{"text_format":"1","workbook":"xlsx","n_sheets":3,"sheets":["Tarif","MAtériels&calculs","XnA"],"not_rendered":{"charts":0,"images":12,"macros":0,"external_links":0,"defined_names":8,"comments":0,"pivot_tables":0},"unopened":[],"bounds":{"document_bytes":16777216,"sheet_cells":100000,"rows_first":2000,"rows_last":500,"rows_between":2000,"halvings":0,"cell_chars":16384,"cell_head_chars":4096},"cells_cut":0,"cells_raw":0,"read":"whole","date_system":"1900"}

{"sheet":"Tarif","index":0,"n_rows":5292,"n_cols":14,"rows_kept":5292,"cut":false,"hidden":true,"merged":[[1093,5,1093,7],[4886,6,4886,7],[4887,6,4887,7]]}
["N°Article","Désignation","Colis","Tarif HT au 01/01/2016","Eco Participation HT","Classe Energétique Chauffage","Classe Ener-\ngétique ECS","Profil de puisage ECS","Code EAN","Poids ","Long mm","Larg mm","Haut mm","Groupe article"]
[]
["LA LEGISLATION IMPOSE UNE ECO-PARTICIPATION  AFIN D'ORGANISER SUR LE TERRITOIRE NATIONAL LA COLLECTE ET"]
["LE RECYCLAGE DE CERTAINS PRODUITS ELECTRIQUES ET ELECTRONIQUES D'EQUIPEMENTS DE LA MAISON . CELA SIGNIFIE QUE LE"]
["CONSOMMATEUR POURRA DEMANDER AU PROFESSIONNEL LA REPRISE DE L'ANCIEN MATERIEL CONTRE L'ACHAT D'UN NOUVEL"]
["EQUIPEMENT DE MEME NATURE , SELON LE PRINCIPE DE << UN >> POUR << UN  >> . "]
["LES PRODUITS ELIGIBLES SONT REPERTORIES SUR LE SITE OFFICIEL : www.eco-systemes.fr "]
["ET  APPARAISSENT DANS NOTRE TARIF AVEC UN MONTANT HT D'ECO-PARTICIPATION "]
["* TOUT MONTANT D'ECO PARTICIPATION EST SUSCEPTIBLE D'EVOLUER EN CAS DE MODIFICATION DU BAREME PAR NOTRE ORGANISME COLLECTEUR"]
[]
["FAMILLE:","POMPE A CHALEUR"]
[]
[null,"VERSIONS POUR CHAUFFAGE ET RAFRAICHISSEMENT"]
[7610054,"OENOVIAPAC-2 4 MR-3/H",null,{"$f":"D30+D37+D42","v":3984},null,"A+++","/","/",366123859383,83.7,null,null,null,"C9"]
[7610055,"OENOVIAPAC-2 4 MR-3/EM",null,{"$f":"D30+D39+D42","v":3984},null,"A+++","/","/",366123859384,83.7,null,null,null,"C9"]
[7610056,"OENOVIAPAC-2 6 MR-3/H",null,{"$f":"D31+D37+D42","v":4071},null,"A++","/","/",366123859385,82.7,null,null,null,"C9"]
[7610057,"OENOVIAPAC-2 6 MR-3/EM",null,{"$f":"D31+D39+D42","v":4071},null,"A++","/","/",366123859386,82.7,null,null,null,"C9"]
[7610058,"OENOVIAPAC-2 8 MR-3/H",null,{"$f":"D32+D37","v":4750},null,"A++","/","/",366123859387,112.2,null,null,null,"C9"]
[7610059,"OENOVIAPAC-2 8 MR-3/EM",null,{"$f":"D32+D39","v":4750},null,"A++","/","/",366123859388,112.2,null,null,null,"C9"]
[7610060,"OENOVIAPAC-2 11 MR-3/H",null,{"$f":"D33+D38","v":6109},null,"A++","/","/",366123859389,168.7,null,null,null,"C9"]
[7610061,"OENOVIAPAC-2 11 MR-3/EM",null,{"$f":"D33+D40","v":6109},null,"A++","/","/",366123859390,168.7,null,null,null,"C9"]
[7610062,"OENOVIAPAC-2 11 TR-3/H",null,{"$f":"D34+D38","v":6407},null,"A++","/","/",366123859391,182.7,null,null,null,"C9"]
[7610063,"OENOVIAPAC-2 11 TR-3/ET",null,{"$f":"D34+D41","v":6407},null,"A++","/","/",366123859392,182.7,null,null,null,"C9"]
[7610064,"OENOVIAPAC-2 16 MR-3/H",null,{"$f":"D35+D38","v":7180},null,"A++","/","/",366123859393,168.7,null,null,null,"C9"]
[7610065,"OENOVIAPAC-2 16 MR-3/EM",null,{"$f":"D35+D40","v":7180},null,"A++","/","/",366123859394,168.7,null,null,null,"C9"]
[7610066,"OENOVIAPAC-2 16 TR-3/H",null,{"$f":"D36+D38","v":7596},null,"A++","/","/",366123859395,182.7,null,null,null,"C9"]
[7610067,"OENOVIAPAC-2 16 TR-3/ET",null,{"$f":"D36+D41","v":7596},null,"A++","/","/",366123859396,182.7,null,null,null,"C9"]
[]
["COMPOSANTS"]
[7603571,"AWHP 4 MR","EH336",1799,5," /"," /"," /",3661238581012,48,450,950,690,"C9"]
[7609925,"AWHP 6 MR-2 ","EH380",1886,5," /"," /"," /",3661238589513,47,450,950,690,"C9"]
[7609926,"AWHP 8 MR-2 ","EH381",2622,5," /"," /"," /",3661238589520,77,450,1040,1030,"C9"]
[7609927,"AWHP 11 MR-2 ","EH382",3456,5," /"," /"," /",3661238589537,131,450,1040,1440,"C9"]
[7609928,"AWHP 11 TR-2 ","EH383",3754,5," /"," /"," /",3661238589544,145,450,1040,1440,"C9"]
[7609929,"AWHP 16 MR-2 ","EH384",4527,5," /"," /"," /",3661238589551,131,450,1040,1440,"C9"]
[7609930,"AWHP 16 TR-2 ","EH385",4943,5," /"," /"," /",3661238589568,145,450,1040,1440,"C9"]
[7609961,"MHX-3/H 4-8 ","EH413",2128,null," /"," /"," /",3661238589841,35.200000000000003,465,465,800,"C9"]
[7609962,"MHX-3/H 11-16 ","EH414",2653,null," /"," /"," /",3661238589858,37.700000000000003,465,465,800,"C9"]
[7609963,"MHX-3/EM 4-8 ","EH415",2128,null," /"," /"," /",3661238589865,35.200000000000003,465,465,800,"C9"]
[7609964,"MHX-3/EM 11-16 ","EH416",2653,null," /"," /"," /",3661238589872,37.700000000000003,465,465,800,"C9"]
[7609965,"MHX-3/ET 11-16 ","EH417",2653,null," /"," /"," /",3661238589889,37.700000000000003,465,465,800,"C9"]
[100015480,"RACCORD D'ADAPTATION FRIGO POUR 4 kW ET 6 kW","EH146",57,null," /"," /"," /",3661238381612,0.5,150,80,30,"C9"]
[]
[null,"VERSIONS POUR CLIMATISATION"]
[7610068,"OENOVIAPAC-2 4 MR-3/HI",null,{"$f":"D61+D68+D73+D75","v":5016},null,"A+++","/","/",366123859397,87.8,null,null,null,"C9"]
[7610069,"OENOVIAPAC-2 4 MR-3/EMI",null,{"$f":"D61+D70+D73+D74","v":4924},null,"A+++","/","/",366123859398,86.7,null,null,null,"C9"]
[7610070,"OENOVIAPAC-2 6 MR-3/HI",null,{"$f":"D62+D68+D73+D75","v":5103},null,"A++","/","/",366123859399,86.8,null,null,null,"C9"]
[7610071,"OENOVIAPAC-2 6 MR-3/EMI",null,{"$f":"D62+D70+D73+D74","v":5011},null,"A++","/","/",366123859400,85.7,null,null,null,"C9"]
[7610072,"OENOVIAPAC-2 8 MR-3/HI",null,{"$f":"D63+D68+D75","v":5782},null,"A++","/","/",366123859401,116.3,null,null,null,"C9"]
[7610073,"OENOVIAPAC-2 8 MR-3/EMI",null,{"$f":"D63+D70+D74","v":5690},null,"A++","/","/",366123859402,115.2,null,null,null,"C9"]
[7610074,"OENOVIAPAC-2 11 MR-3/HI",null,{"$f":"D64+D69+D75","v":7332},null,"A++","/","/",366123859403,172.79999999999998,null,null,null,"C9"]
[7610075,"OENOVIAPAC-2 11 MR-3/EMI",null,{"$f":"D64+D71+D74","v":7240},null,"A++","/","/",366123859404,171.7,null,null,null,"C9"]
[7610076,"OENOVIAPAC-2 11 TR-3/HI",null,{"$f":"D65+D69+D75","v":7630},null,"A++","/","/",366123859405,186.79999999999998,null,null,null,"C9"]
[7610077,"OENOVIAPAC-2 11 TR-3/ETI",null,{"$f":"D65+D72+D74","v":7538},null,"A++","/","/",366123859406,185.7,null,null,null,"C9"]
[7610078,"OENOVIAPAC-2 16 MR-3/HI",null,{"$f":"D66+D69+D75","v":8403},null,"A++","/","/",366123859407,172.79999999999998,null,null,null,"C9"]
[7610079,"OENOVIAPAC-2 16 MR-3/EMI",null,{"$f":"D66+D71+D74","v":8311},null,"A++","/","/",366123859408,171.7,null,null,null,"C9"]
[7610080,"OENOVIAPAC-2 16 TR-3/HI",null,{"$f":"D67+D69+D75","v":8819},null,"A++","/","/",366123859409,186.79999999999998,null,null,null,"C9"]
[7610081,"OENOVIAPAC-2 16 TR-3/ETI",null,{"$f":"D67+D72+D74","v":8727},null,"A++","/","/",366123859410,185.7,null,null,null,"C9"]
[]
["COMPOSANTS"]
{"$rows_left_out":5233}
{"sheet":"MAtériels&calculs","index":1,"n_rows":74,"n_cols":34,"rows_kept":74,"cut":false,"hidden":true,"merged":[]}
["références","Dénomination","Colis","Prix"]
[null,null,null,null,null,"Surface","Station",null,"Régulation"]
["Stations",null,null,null,null,"≤ 20 ","DKS 8-20",7619964,"Deltasol E (à ajouter)",{"$f":"A13","v":7619972}]
[7619964,{"$f":"VLOOKUP(A4,Tarif!$1:$1048576,2,FALSE)","v":"STATION SOLAIRE SKS 13-45"},{"$f":"VLOOKUP(A4,Tarif!$1:$1048576,3,FALSE)","v":"ER665"},{"$f":"VLOOKUP(A4,Tarif!$1:$1048576,4,FALSE)","v":662},null,"21-30","DKCS 8-30",{"$f":"A5","v":7619966},"Deltasol E (à ajouter)",{"$f":"A13","v":7619972}]
[7619966,{"$f":"VLOOKUP(A5,Tarif!$1:$1048576,2,FALSE)","v":"STATION SOLAIRE STS 14-30 CME"},{"$f":"VLOOKUP(A5,Tarif!$1:$1048576,3,FALSE)","v":"ER667"},{"$f":"VLOOKUP(A5,Tarif!$1:$1048576,4,FALSE)","v":2649},null,"31-50","DKCS 8-50 CME",{"$f":"A6","v":7619967},"Deltasol E (intégrée)",{"$f":"\"\"","v":""}]
[7619967,{"$f":"VLOOKUP(A6,Tarif!$1:$1048576,2,FALSE)","v":"STATION SOLAIRE STS 14-50 CME"},{"$f":"VLOOKUP(A6,Tarif!$1:$1048576,3,FALSE)","v":"ER668"},{"$f":"VLOOKUP(A6,Tarif!$1:$1048576,4,FALSE)","v":3057},null,"51-100","DKCS 12-100 CME",{"$f":"A7","v":7619968},"Deltasol E (intégrée)",{"$f":"\"\"","v":""}]
[7619968,{"$f":"VLOOKUP(A7,Tarif!$1:$1048576,2,FALSE)","v":"STATION SOLAIRE STS 14-100 CME"},{"$f":"VLOOKUP(A7,Tarif!$1:$1048576,3,FALSE)","v":"ER669"},{"$f":"VLOOKUP(A7,Tarif!$1:$1048576,4,FALSE)","v":6114},null,"101-200","DKCS 11-200 CME",{"$f":"A8","v":7619970},"Deltasol E (intégrée)",{"$f":"\"\"","v":""}]
[7619970,{"$f":"VLOOKUP(A8,Tarif!$1:$1048576,2,FALSE)","v":{"$error":"#N/A"}},{"$f":"VLOOKUP(A8,Tarif!$1:$1048576,3,FALSE)","v":{"$error":"#N/A"}},{"$f":"VLOOKUP(A8,Tarif!$1:$1048576,4,FALSE)","v":{"$error":"#N/A"}},null,"201-300","DKCS 11-300 CME",{"$f":"A9","v":7619971},"Deltasol E (intégrée)",{"$f":"\"\"","v":""}]
[7619971,{"$f":"VLOOKUP(A9,Tarif!$1:$1048576,2,FALSE)","v":{"$error":"#N/A"}},{"$f":"VLOOKUP(A9,Tarif!$1:$1048576,3,FALSE)","v":{"$error":"#N/A"}},{"$f":"VLOOKUP(A9,Tarif!$1:$1048576,4,FALSE)","v":{"$error":"#N/A"}}]
[]
["Régulation deltasol E",null,null,null,null,"Appoint"]
[null,null,null,null,null,"Electrique"]
[7619972,{"$f":"VLOOKUP(A13,Tarif!$1:$1048576,2,FALSE)","v":"REGULATION SOL COLLECTIF SC5 "},{"$f":"VLOOKUP(A13,Tarif!$1:$1048576,3,FALSE)","v":"ER672"},{"$f":"VLOOKUP(A13,Tarif!$1:$1048576,4,FALSE)","v":596},null,"Hydraulique"]
[]
["Sondes",null,null,null,null,"Hydraulique","CME","DL2","CS10","COMPT ACS","COMPT ECHO solaire","COMPT ECHO (relève)","COMPT ECHO bouclage","Compt elec accessoire","Compteur elec appoint","PT 1000"]
[null,null,null,null,null,"référence",{"$f":"A31","v":100017498},{"$f":"A35","v":100013514},{"$f":"A17","v":89804815},{"$f":"VLOOKUP(XnA!E51,'MAtériels&calculs'!F38:G41,2,FALSE)","v":100017492},{"$f":"IF(OR(XnA!E42='MAtériels&calculs'!F18,XnA!E42='MAtériels&calculs'!F17),G34,\"\")","v":100017495},{"$f":"IF(AND(XnA!E45=\"Hydraulique\",XnA!O45=\"Non\"),VLOOKUP(XnA!E47,'MAtériels&calculs'!F34:G36,2,FALSE),\"\")","v":100017495},{"$f":"IF(XnA!I42=\"Oui\",VLOOKUP(XnA!I45,'MAtériels&calculs'!F34:G37,2,FALSE),\"\")","v":""},null,null,{"$f":"A18","v":100003690}]
[89804815,{"$f":"VLOOKUP(A17,Tarif!$1:$1048576,2,FALSE)","v":"SONDE D'IRRADIATION CS10"},{"$f":"VLOOKUP(A17,Tarif!$1:$1048576,3,FALSE)","v":"EC175"},{"$f":"VLOOKUP(A17,Tarif!$1:$1048576,4,FALSE)","v":142},null,"≤ 20 ",1,1,1,1,1,{"$f":"IF(O17=1,0,IF(XnA!$E$45=\"Hydraulique\",1,0))","v":1},{"$f":"IF(XnA!$I$42=\"Oui\",1,0)","v":0},1,{"$f":"IF(XnA!$E$45=\"Electrique\",1,0)","v":0},{"$f":"2+SUM(J17+K17+L17+M17)*2","v":8}]
[100003690,{"$f":"CONCATENATE(VLOOKUP(A18,Tarif!$1:$1048576,2,FALSE),\" (2 par compteur)\")","v":"SONDE A APPLIQUE PT1000 (2 par compteur)"},{"$f":"VLOOKUP(A18,Tarif!$1:$1048576,3,FALSE)","v":"EC171"},{"$f":"VLOOKUP(A18,Tarif!$1:$1048576,4,FALSE)","v":61},null,"21-30",1,1,1,1,1,{"$f":"IF(O18=1,0,IF(XnA!$E$45=\"Hydraulique\",1,0))","v":1},{"$f":"IF(XnA!$I$42=\"Oui\",1,0)","v":0},1,{"$f":"IF(XnA!$E$45=\"Electrique\",1,0)","v":0},8]
[null,null,null,null,null,"31-50",1,1,1,1,0,{"$f":"IF(O19=1,0,IF(XnA!$E$45=\"Hydraulique\",1,0))","v":1},{"$f":"IF(XnA!$I$42=\"Oui\",1,0)","v":0},1,{"$f":"IF(XnA!$E$45=\"Electrique\",1,0)","v":0},6]
["Comptage",null,null,null,null,"51-100",1,1,1,1,0,{"$f":"IF(O20=1,0,IF(XnA!$E$45=\"Hydraulique\",1,0))","v":1},{"$f":"IF(XnA!$I$42=\"Oui\",1,0)","v":0},1,{"$f":"IF(XnA!$E$45=\"Electrique\",1,0)","v":0},6]
[null,null,null,null,null,"101-200",1,1,1,1,0,{"$f":"IF(O21=1,0,IF(XnA!$E$45=\"Hydraulique\",1,0))","v":1},{"$f":"IF(XnA!$I$42=\"Oui\",1,0)","v":0},1,{"$f":"IF(XnA!$E$45=\"Electrique\",1,0)","v":0},6]
[100017492,{"$f":"CONCATENATE(VLOOKUP(A22,Tarif!$1:$1048576,2,FALSE),\" (besoins ecs)\")","v":"COMPTEUR EAU FROIDE ACS 3,5m3/H (besoins ecs)"},{"$f":"VLOOKUP(A22,Tarif!$1:$1048576,3,FALSE)","v":"ER307"},{"$f":"VLOOKUP(A22,Tarif!$1:$1048576,4,FALSE)","v":678},null,"201-300",1,1,1,1,0,{"$f":"IF(O22=1,0,IF(XnA!$E$45=\"Hydraulique\",1,0))","v":1},{"$f":"IF(XnA!$I$42=\"Oui\",1,0)","v":0},1,{"$f":"IF(XnA!$E$45=\"Electrique\",1,0)","v":0},6]
[100017493,{"$f":"CONCATENATE(VLOOKUP(A23,Tarif!$1:$1048576,2,FALSE),\" (besoins ecs)\")","v":"COMPTEUR EAU FROIDE ACS 5m3/H (besoins ecs)"},{"$f":"VLOOKUP(A23,Tarif!$1:$1048576,3,FALSE)","v":"ER308"},{"$f":"VLOOKUP(A23,Tarif!$1:$1048576,4,FALSE)","v":747}]
[100017494,{"$f":"CONCATENATE(VLOOKUP(A24,Tarif!$1:$1048576,2,FALSE),\" (besoins ecs)\")","v":"COMPTEUR EAU FROIDE ACS 10m3/H (besoins ecs)"},{"$f":"VLOOKUP(A24,Tarif!$1:$1048576,3,FALSE)","v":"ER309"},{"$f":"VLOOKUP(A24,Tarif!$1:$1048576,4,FALSE)","v":961},null,"Electrique","CME","DL2","CS10","COMPT ACS","COMPT ECHO solaire","COMPT ECHO (relève)","COMPT ECHO bouclage","Compt elec accessoire","Compteur elec appoint","Pt 1000"]
[100017495,{"$f":"VLOOKUP(A25,Tarif!$1:$1048576,2,FALSE)","v":"COMPT.FLU.CHAUD US ECHO 1.5M3"},{"$f":"VLOOKUP(A25,Tarif!$1:$1048576,3,FALSE)","v":"ER310"},{"$f":"VLOOKUP(A25,Tarif!$1:$1048576,4,FALSE)","v":430},null,"≤ 20 ",1,1,1,1,1,{"$f":"IF(O25=1,0,1)","v":1},{"$f":"IF(XnA!$I$42=\"Oui\",1,0)","v":0},1,{"$f":"IF(XnA!$E$45=\"Electrique\",1,0)","v":0},{"$f":"SUM(J25+K25+L25+M25)*2","v":6}]
[100017496,{"$f":"VLOOKUP(A26,Tarif!$1:$1048576,2,FALSE)","v":"COMPT.FLU.CHAUD US ECHO 2.5M3"},{"$f":"VLOOKUP(A26,Tarif!$1:$1048576,3,FALSE)","v":"ER311"},{"$f":"VLOOKUP(A26,Tarif!$1:$1048576,4,FALSE)","v":476},null,"21-30",1,1,1,1,1,1,{"$f":"IF(XnA!$I$42=\"Oui\",1,0)","v":0},1,{"$f":"IF(XnA!$E$45=\"Electrique\",1,0)","v":0},6]
[100017497,{"$f":"VLOOKUP(A27,Tarif!$1:$1048576,2,FALSE)","v":"COMPT.FLU.CHAUD US ECHO 3.5M3/H "},{"$f":"VLOOKUP(A27,Tarif!$1:$1048576,3,FALSE)","v":"ER312"},{"$f":"VLOOKUP(A27,Tarif!$1:$1048576,4,FALSE)","v":531},null,"31-50",1,1,1,1,0,1,{"$f":"IF(XnA!$I$42=\"Oui\",1,0)","v":0},1,{"$f":"IF(XnA!$E$45=\"Electrique\",1,0)","v":0},4]
[null,null,null,null,null,"51-100",1,1,1,1,0,1,{"$f":"IF(XnA!$I$42=\"Oui\",1,0)","v":0},1,{"$f":"IF(XnA!$E$45=\"Electrique\",1,0)","v":0},4]
["Centrale CME",null,null,null,null,"101-200",1,1,1,1,0,1,{"$f":"IF(XnA!$I$42=\"Oui\",1,0)","v":0},1,{"$f":"IF(XnA!$E$45=\"Electrique\",1,0)","v":0},4]
[null,null,null,null,null,"201-300",1,1,1,1,0,1,{"$f":"IF(XnA!$I$42=\"Oui\",1,0)","v":0},1,{"$f":"IF(XnA!$E$45=\"Electrique\",1,0)","v":0},4,null,null,null,null,null,null,null,null,null,null,null,null,null,null,"Débit nominal","Calibre"]
[100017498,{"$f":"VLOOKUP(A31,Tarif!$1:$1048576,2,FALSE)","v":"CENTRALE DE MESURE D'ENERGIE CME"},{"$f":"VLOOKUP(A31,Tarif!$1:$1048576,3,FALSE)","v":"ER313"},{"$f":"VLOOKUP(A31,Tarif!$1:$1048576,4,FALSE)","v":1641},null,null,null,null,null,null,null,null,null,null,null,null,null,null,null,null,null,null,null,null,null,null,null,null,null,null,"1,5 m3/h","DN 15"]
[null,null,null,null,null,null,null,null,null,null,null,null,null,null,null,null,null,null,null,null,null,null,null,null,null,null,null,null,null,null,"2,5 m3/h","DN 20"]
["Interface DL2",null,null,null,null,"Débit",null,null,null,null,null,null,null,null,null,null,null,null,null,null,null,null,null,null,null,null,null,null,null,null,"3,5 m3/h","DN 25"]
[null,null,null,null,"ECHO","1,5 m3/h",{"$f":"A25","v":100017495},null,{"$f":"IF(OR(XnA!E42='MAtériels&calculs'!F17,XnA!E42='MAtériels&calculs'!F18,XnA!E42='MAtériels&calculs'!F19,XnA!E42='MAtériels&calculs'!F20),1,0)","v":1},100017495,null,null,null,null,null,null,null,null,null,null,null,null,null,null,null,null,null,null,null,null,"5 m3/h","DN 30"]
[100013514,{"$f":"VLOOKUP(A35,Tarif!$1:$1048576,2,FALSE)","v":"DATALOGGER DL2 POUR GRS"},{"$f":"VLOOKUP(A35,Tarif!$1:$1048576,3,FALSE)","v":"ER55"},{"$f":"VLOOKUP(A35,Tarif!$1:$1048576,4,FALSE)","v":451},null,"2,5 m3/h",{"$f":"A26","v":100017496},null,{"$f":"IF(XnA!E42=F21,1,0)","v":0},100017496,null,null,null,null,null,null,null,null,null,null,null,null,null,null,null,null,null,null,null,null,"10 m3/h","DN 40"]
[null,null,null,null,null,"3,5 m3/h",{"$f":"A27","v":100017497},null,{"$f":"IF(XnA!E42=F22,1,0)","v":0},100017497]
[100017499,{"$f":"VLOOKUP(A37,Tarif!$1:$1048576,2,FALSE)","v":"MODULE REPORT DE PANNE OETROSOL AM1"},{"$f":"VLOOKUP(A37,Tarif!$1:$1048576,3,FALSE)","v":"ER314"},{"$f":"VLOOKUP(A37,Tarif!$1:$1048576,4,FALSE)","v":176},null,"> 3,5 m3/h"]
[null,null,null,null,"ACS","3,5 m3/h",{"$f":"A22","v":100017492}]
[null,null,null,null,null,"5 m3/h",{"$f":"A23","v":100017493}]
[null,null,null,null,null,"10 m3/h",{"$f":"A24","v":100017494}]
[7619964,{"$f":"CONCATENATE(VLOOKUP(A41,Tarif!$1:$1048576,2,FALSE),\" (besoins ecs)\")","v":"STATION SOLAIRE SKS 13-45 (besoins ecs)"},{"$f":"VLOOKUP(A41,Tarif!$1:$1048576,3,FALSE)","v":"ER665"},{"$f":"VLOOKUP(A41,Tarif!$1:$1048576,4,FALSE)","v":662},null,{"$f":"\"\"","v":""},100019195]
[7619966,{"$f":"CONCATENATE(VLOOKUP(A42,Tarif!$1:$1048576,2,FALSE),\" (besoins ecs)\")","v":"STATION SOLAIRE STS 14-30 CME (besoins ecs)"},{"$f":"VLOOKUP(A42,Tarif!$1:$1048576,3,FALSE)","v":"ER667"},{"$f":"VLOOKUP(A42,Tarif!$1:$1048576,4,FALSE)","v":2649}]
[7619967,{"$f":"CONCATENATE(VLOOKUP(A43,Tarif!$1:$1048576,2,FALSE),\" (besoins ecs)\")","v":"STATION SOLAIRE STS 14-50 CME (besoins ecs)"},{"$f":"VLOOKUP(A43,Tarif!$1:$1048576,3,FALSE)","v":"ER668"},{"$f":"VLOOKUP(A43,Tarif!$1:$1048576,4,FALSE)","v":3057},null,"Chiffrage"]
[7619968,{"$f":"CONCATENATE(VLOOKUP(A44,Tarif!$1:$1048576,2,FALSE),\" (besoins ecs)\")","v":"STATION SOLAIRE STS 14-100 CME (besoins ecs)"},{"$f":"VLOOKUP(A44,Tarif!$1:$1048576,3,FALSE)","v":"ER669"},{"$f":"VLOOKUP(A44,Tarif!$1:$1048576,4,FALSE)","v":6114}]
[7619970,{"$f":"CONCATENATE(VLOOKUP(A45,Tarif!$1:$1048576,2,FALSE),\" (besoins ecs)\")","v":{"$error":"#N/A"}},{"$f":"VLOOKUP(A45,Tarif!$1:$1048576,3,FALSE)","v":{"$error":"#N/A"}},{"$f":"VLOOKUP(A45,Tarif!$1:$1048576,4,FALSE)","v":{"$error":"#N/A"}},null,"référence","Désignation","Colis","Prix","Quantité"]
[7619971,{"$f":"CONCATENATE(VLOOKUP(A46,Tarif!$1:$1048576,2,FALSE),\" (besoins ecs)\")","v":{"$error":"#N/A"}},{"$f":"VLOOKUP(A46,Tarif!$1:$1048576,3,FALSE)","v":{"$error":"#N/A"}},{"$f":"VLOOKUP(A46,Tarif!$1:$1048576,4,FALSE)","v":{"$error":"#N/A"}}]
[null,null,null,null,null,{"$f":"G16","v":100017498},{"$f":"IF(F47=\"\",\"\",VLOOKUP(F47,$A$5:$D$35,2,FALSE))","v":"CENTRALE DE MESURE D'ENERGIE CME"},{"$f":"IF(F47=\"\",\"\",VLOOKUP(F47,$A$5:$D$35,3,FALSE))","v":"ER313"},{"$f":"IF(F47=\"\",\"\",VLOOKUP(F47,$A$5:$D$35,4,FALSE))","v":1641},1]
["Régulation deltasol E",null,null,null,null,{"$f":"H16","v":100013514},{"$f":"IF(F48=\"\",\"\",VLOOKUP(F48,$A$5:$D$35,2,FALSE))","v":"DATALOGGER DL2 POUR GRS"},{"$f":"IF(F48=\"\",\"\",VLOOKUP(F48,$A$5:$D$35,3,FALSE))","v":"ER55"},{"$f":"IF(F48=\"\",\"\",VLOOKUP(F48,$A$5:$D$35,4,FALSE))","v":451},1]
[null,null,null,null,null,{"$f":"J16","v":100017492},"COMPTEUR EAU FROIDE ACS 3,5m3/H (besoins ecs)","ER307",678,1]
[7619972,{"$f":"CONCATENATE(VLOOKUP(A50,Tarif!$1:$1048576,2,FALSE),\" (besoins ecs)\")","v":"REGULATION SOL COLLECTIF SC5  (besoins ecs)"},{"$f":"VLOOKUP(A50,Tarif!$1:$1048576,3,FALSE)","v":"ER672"},{"$f":"VLOOKUP(A50,Tarif!$1:$1048576,4,FALSE)","v":596},null,{"$f":"K16","v":100017495},"COMPT.FLU.CHAUD US ECHO 1.5M3","ER310",430,{"$f":"IF(F50=\"\",\"\",1)","v":1},null,null,null,null,null,null,null,null,null,null,null,null,null,null,null,null,null,null,null,null,"RSB + ballon en relève",null,1,-1]
[null,null,null,null,null,{"$f":"L16","v":100017495},"COMPT.FLU.CHAUD US ECHO 1.5M3","ER310",430,{"$f":"IF(F51=\"\",\"\",1)","v":1},null,null,null,null,null,null,null,null,null,null,null,null,null,null,null,null,null,null,null,null,"RSB en série + ballon en relève",null,2,-1]
["Sondes",null,null,null,null,{"$f":"M16","v":""},"","","",{"$f":"IF(F52=\"\",\"\",1)","v":""},null,null,null,null,null,null,null,null,null,null,null,null,null,null,null,null,null,null,null,null,"RSB en parallèle + ballon en relève",null,3,-1]
[null,null,null,null,null,{"$f":"P16","v":100003690},"SONDE A APPLIQUE PT1000 (2 par compteur)","EC171",61,{"$f":"VLOOKUP(XnA!E42,F17:P22,11,FALSE)+VLOOKUP(XnA!E12,'MAtériels&calculs'!AE50:AH57,4,FALSE)","v":7},{"$f":"VLOOKUP(XnA!E12,'MAtériels&calculs'!AE50:AH57,4,FALSE)","v":-1},null,null,null,null,null,null,null,null,null,null,null,null,null,null,null,null,null,null,null,"Préparateur FWS ECS instantannée",null,4,-2]
[89804815,{"$f":"CONCATENATE(VLOOKUP(A54,Tarif!$1:$1048576,2,FALSE),\" (besoins ecs)\")","v":"SONDE D'IRRADIATION CS10 (besoins ecs)"},{"$f":"VLOOKUP(A54,Tarif!$1:$1048576,3,FALSE)","v":"EC175"},{"$f":"VLOOKUP(A54,Tarif!$1:$1048576,4,FALSE)","v":142},null,{"$f":"IF(XnA!E12='MAtériels&calculs'!AE57,VLOOKUP(1,'MAtériels&calculs'!I34:J36,2,FALSE),\"\")","v":""},"","","",{"$f":"IF(I54=\"\",\"\",1)","v":""},null,null,null,null,null,null,null,null,null,null,null,null,null,null,null,null,null,null,null,null,"Préparateur FWS avec décharge",null,5,-2]
[100003690,{"$f":"CONCATENATE(VLOOKUP(A55,Tarif!$1:$1048576,2,FALSE),\" (besoins ecs)\")","v":"SONDE A APPLIQUE PT1000 (besoins ecs)"},{"$f":"VLOOKUP(A55,Tarif!$1:$1048576,3,FALSE)","v":"EC171"},{"$f":"VLOOKUP(A55,Tarif!$1:$1048576,4,FALSE)","v":61},null,"Compteur électrique pour auxiliaires (pompes, régulation)",null,null,null,1,null,null,null,null,null,null,null,null,null,null,null,null,null,null,null,null,null,null,null,null,"Préparateur à serpentin avec relève intégrée",null,6,-2]
[null,null,null,null,null,"Compteur électrique pour appoint par résistance électrique",null,null,null,{"$f":"O18","v":0},null,null,null,null,null,null,null,null,null,null,null,null,null,null,null,null,null,null,null,null,"Préparateur à serpentin + ballon en relève",null,7,-1]
["Comptage",null,null,null,null,null,null,null,null,null,null,null,null,null,null,null,null,null,null,null,null,null,null,null,null,null,null,null,null,null,"Tampon primaire + ballon en relève",null,8,1]
[]
[100017492,{"$f":"CONCATENATE(VLOOKUP(A59,Tarif!$1:$1048576,2,FALSE),\" (besoins ecs)\")","v":"COMPTEUR EAU FROIDE ACS 3,5m3/H (besoins ecs)"},{"$f":"VLOOKUP(A59,Tarif!$1:$1048576,3,FALSE)","v":"ER307"},{"$f":"VLOOKUP(A59,Tarif!$1:$1048576,4,FALSE)","v":678}]
[100017493,{"$f":"CONCATENATE(VLOOKUP(A60,Tarif!$1:$1048576,2,FALSE),\" (besoins ecs)\")","v":"COMPTEUR EAU FROIDE ACS 5m3/H (besoins ecs)"},{"$f":"VLOOKUP(A60,Tarif!$1:$1048576,3,FALSE)","v":"ER308"},{"$f":"VLOOKUP(A60,Tarif!$1:$1048576,4,FALSE)","v":747},null,null,null,null,null,null,null,null,null,null,null,null,null,null,null,null,null,null,null,null,null,null,null,null,null,null,null,null,{"$f":"VLOOKUP(XnA!E12,'MAtériels&calculs'!AE50:AG57,3,FALSE)","v":1}]
{"$rows_left_out":15}
{"sheet":"XnA","index":2,"n_rows":87,"n_cols":15,"rows_kept":87,"cut":false,"hidden":false,"merged":[[45,7,45,9],[9,3,9,10],[47,2,47,5],[72,3,72,7],[66,3,66,7],[65,3,65,7],[64,3,64,7],[63,3,63,7],[2,4,2,8],[41,4,41,5],[7,3,7,10],[50,4,50,5],[46,4,46,5],[80,2,80,8],[74,3,74,7],[75,3,75,7],[3,4,3,8],[78,3,78,7],[43,7,43,8],[8,3,8,10],[80,9,80,10],[44,8,44,9],[73,3,73,7],[62,3,62,7],[44,4,44,5],[56,3,56,7],[41,8,41,9],[11,4,11,10],[57,3,57,7],[51,2,51,5],[58,3,58,7],[59,3,59,7],[61,3,61,7],[79,3,79,7],[77,3,77,7]]}
[]
[]
[null,null,null,null,"Chiffrage métrologie solaire"]
[null,null,null,null,"Procédure Xna",null,null,null,null,null,null,"Version 01/2016"]
[]
[]
[]
[null,null,"Références"]
[]
[]
[]
[null,null,"Schéma de principe",null,"RSB + ballon en relève"]
[]
[]
[]
[]
[]
[]
[]
[]
[]
[]
[]
[]
[]
[]
[]
[]
[]
[]
[]
[]
[]
[]
[]
[]
[]
[]
[]
[]
[]
[null,null,null,"Surface de capteurs","≤ 20 ",null,"m²","Bouclage ECS","Non"]
[]
[null,null,null,null,{"$f":"IF(AND(E42<>surf1,E42<>\"21-30\"),\"Comptage inclus dans la station solaire\",\"\")","v":""}]
[null,null,null,"Appoint","Hydraulique",null,null,"Débit bouclage","3,5 m3/h",null,null,null,null,null,"Non"]
[null,null,{"$f":"IF(E45=\"Electrique\",\"Mise en place compteur électrique pour l'appoint(non fourni par DD)\",\"\")","v":""},null,null,null,null,{"$f":"IF(I45=\"> 3,5 m3/h\",\"Compteur non fourni par De Dietrich\",\"\")","v":""}]
[null,null,null,"Débit relève hydraulique","1,5 m3/h"]
[null,null,{"$f":"IF(E47=\"> 3,5 m3/h\",\"Compteur non fourni par De Dietrich\",\"\")","v":""},null,null,null,null,"Pour information, relation entre le débit nominal et le DN de la conduite"]
[]
[]
[null,null,null,"Soutirage ECS de pointe","3,5 m3/h"]
[null,null,{"$f":"IF(E51=\"> 10 m3/h\",\"Compteur non fourni par De Dietrich\",\"\")","v":""}]
[]
[]
[null,null,"Chiffrage de la solution pour comptage d'énergie"]
[]
[null,null,"Référence","Désignation",null,null,null,null,"Colis","Qté","Prix"]
[null,null,"Métrologie"]
[null,null,{"$f":"'MAtériels&calculs'!F47","v":100017498},{"$f":"'MAtériels&calculs'!G47","v":"CENTRALE DE MESURE D'ENERGIE CME"},null,null,null,null,{"$f":"'MAtériels&calculs'!H47","v":"ER313"},{"$f":"'MAtériels&calculs'!J47","v":1},{"$f":"IF(C59<>\"\",J59*'MAtériels&calculs'!I47,\"\")","v":1641}]
[null,null,{"$f":"'MAtériels&calculs'!F48","v":100013514},{"$f":"'MAtériels&calculs'!G48","v":"DATALOGGER DL2 POUR GRS"},null,null,null,null,{"$f":"'MAtériels&calculs'!H48","v":"ER55"},{"$f":"'MAtériels&calculs'!J48","v":1},{"$f":"IF(C60<>\"\",J60*'MAtériels&calculs'!I48,\"\")","v":451}]
{"$rows_left_out":27}