{"text_format":"1","workbook":"xlsx","n_sheets":3,"sheets":["Tarif","MAtériels&calculs","XnA"],"not_rendered":{"charts":0,"images":12,"macros":0,"external_links":0,"defined_names":8,"comments":0,"pivot_tables":0},"unopened":[],"bounds":{"document_bytes":16777216,"sheet_cells":100000,"rows_first":2000,"rows_last":500,"rows_between":2000,"halvings":0,"cell_chars":16384,"cell_head_chars":4096},"cells_cut":0,"cells_raw":0,"read":"whole","date_system":"1900"}

{"sheet":"Tarif","index":0,"n_rows":5292,"n_cols":14,"rows_kept":5292,"cut":false,"hidden":true,"merged":[[1093,5,1093,7],[4886,6,4886,7],[4887,6,4887,7]]}
["N°Article","Désignation","Colis","Tarif HT au 01/01/2016","Eco Participation HT","Classe Energétique Chauffage","Classe Ener-\ngétique ECS","Profil de puisage ECS","Code EAN","Poids ","Long mm","Larg mm","Haut mm","Groupe article"]
[]
["LA LEGISLATION IMPOSE UNE ECO-PARTICIPATION  AFIN D'ORGANISER SUR LE TERRITOIRE NATIONAL LA COLLECTE ET"]
["LE RECYCLAGE DE CERTAINS PRODUITS ELECTRIQUES ET ELECTRONIQUES D'EQUIPEMENTS DE LA MAISON . CELA SIGNIFIE QUE LE"]
["CONSOMMATEUR POURRA DEMANDER AU PROFESSIONNEL LA REPRISE DE L'ANCIEN MATERIEL CONTRE L'ACHAT D'UN NOUVEL"]
["EQUIPEMENT DE MEME NATURE , SELON LE PRINCIPE DE << UN >> POUR << UN  >> . "]
["LES PRODUITS ELIGIBLES SONT REPERTORIES SUR LE SITE OFFICIEL : www.eco-systemes.fr "]
["ET  APPARAISSENT DANS NOTRE TARIF AVEC UN MONTANT HT D'ECO-PARTICIPATION "]
["* TOUT MONTANT D'ECO PARTICIPATION EST SUSCEPTIBLE D'EVOLUER EN CAS DE MODIFICATION DU BAREME PAR NOTRE ORGANISME COLLECTEUR"]
[]
["FAMILLE:","POMPE A CHALEUR"]
[]
[null,"VERSIONS POUR CHAUFFAGE ET RAFRAICHISSEMENT"]
[7610054,"OENOVIAPAC-2 4 MR-3/H",null,{"$f":"D30+D37+D42","v":3984},null,"A+++","/","/",366123859383,83.7,null,null,null,"C9"]
[7610055,"OENOVIAPAC-2 4 MR-3/EM",null,{"$f":"D30+D39+D42","v":3984},null,"A+++","/","/",366123859384,83.7,null,null,null,"C9"]
[7610056,"OENOVIAPAC-2 6 MR-3/H",null,{"$f":"D31+D37+D42","v":4071},null,"A++","/","/",366123859385,82.7,null,null,null,"C9"]
[7610057,"OENOVIAPAC-2 6 MR-3/EM",null,{"$f":"D31+D39+D42","v":4071},null,"A++","/","/",366123859386,82.7,null,null,null,"C9"]
[7610058,"OENOVIAPAC-2 8 MR-3/H",null,{"$f":"D32+D37","v":4750},null,"A++","/","/",366123859387,112.2,null,null,null,"C9"]
[7610059,"OENOVIAPAC-2 8 MR-3/EM",null,{"$f":"D32+D39","v":4750},null,"A++","/","/",366123859388,112.2,null,null,null,"C9"]
[7610060,"OENOVIAPAC-2 11 MR-3/H",null,{"$f":"D33+D38","v":6109},null,"A++","/","/",366123859389,168.7,null,null,null,"C9"]
[7610061,"OENOVIAPAC-2 11 MR-3/EM",null,{"$f":"D33+D40","v":6109},null,"A++","/","/",366123859390,168.7,null,null,null,"C9"]
[7610062,"OENOVIAPAC-2 11 TR-3/H",null,{"$f":"D34+D38","v":6407},null,"A++","/","/",366123859391,182.7,null,null,null,"C9"]
[7610063,"OENOVIAPAC-2 11 TR-3/ET",null,{"$f":"D34+D41","v":6407},null,"A++","/","/",366123859392,182.7,null,null,null,"C9"]
[7610064,"OENOVIAPAC-2 16 MR-3/H",null,{"$f":"D35+D38","v":7180},null,"A++","/","/",366123859393,168.7,null,null,null,"C9"]
[7610065,"OENOVIAPAC-2 16 MR-3/EM",null,{"$f":"D35+D40","v":7180},null,"A++","/","/",366123859394,168.7,null,null,null,"C9"]
[7610066,"OENOVIAPAC-2 16 TR-3/H",null,{"$f":"D36+D38","v":7596},null,"A++","/","/",366123859395,182.7,null,null,null,"C9"]
[7610067,"OENOVIAPAC-2 16 TR-3/ET",null,{"$f":"D36+D41","v":7596},null,"A++","/","/",366123859396,182.7,null,null,null,"C9"]
[]
["COMPOSANTS"]
[7603571,"AWHP 4 MR","EH336",1799,5," /"," /"," /",3661238581012,48,450,950,690,"C9"]
[7609925,"AWHP 6 MR-2 ","EH380",1886,5," /"," /"," /",3661238589513,47,450,950,690,"C9"]
[7609926,"AWHP 8 MR-2 ","EH381",2622,5," /"," /"," /",3661238589520,77,450,1040,1030,"C9"]
[7609927,"AWHP 11 MR-2 ","EH382",3456,5," /"," /"," /",3661238589537,131,450,1040,1440,"C9"]
[7609928,"AWHP 11 TR-2 ","EH383",3754,5," /"," /"," /",3661238589544,145,450,1040,1440,"C9"]
[7609929,"AWHP 16 MR-2 ","EH384",4527,5," /"," /"," /",3661238589551,131,450,1040,1440,"C9"]
[7609930,"AWHP 16 TR-2 ","EH385",4943,5," /"," /"," /",3661238589568,145,450,1040,1440,"C9"]
[7609961,"MHX-3/H 4-8 ","EH413",2128,null," /"," /"," /",3661238589841,35.200000000000003,465,465,800,"C9"]
[7609962,"MHX-3/H 11-16 ","EH414",2653,null," /"," /"," /",3661238589858,37.700000000000003,465,465,800,"C9"]
[7609963,"MHX-3/EM 4-8 ","EH415",2128,null," /"," /"," /",3661238589865,35.200000000000003,465,465,800,"C9"]
[7609964,"MHX-3/EM 11-16 ","EH416",2653,null," /"," /"," /",3661238589872,37.700000000000003,465,465,800,"C9"]
[7609965,"MHX-3/ET 11-16 ","EH417",2653,null," /"," /"," /",3661238589889,37.700000000000003,465,465,800,"C9"]
[100015480,"RACCORD D'ADAPTATION FRIGO POUR 4 kW ET 6 kW","EH146",57,null," /"," /"," /",3661238381612,0.5,150,80,30,"C9"]
[]
[null,"VERSIONS POUR CLIMATISATION"]
[7610068,"OENOVIAPAC-2 4 MR-3/HI",null,{"$f":"D61+D68+D73+D75","v":5016},null,"A+++","/","/",366123859397,87.8,null,null,null,"C9"]
[7610069,"OENOVIAPAC-2 4 MR-3/EMI",null,{"$f":"D61+D70+D73+D74","v":4924},null,"A+++","/","/",366123859398,86.7,null,null,null,"C9"]
[7610070,"OENOVIAPAC-2 6 MR-3/HI",null,{"$f":"D62+D68+D73+D75","v":5103},null,"A++","/","/",366123859399,86.8,null,null,null,"C9"]
[7610071,"OENOVIAPAC-2 6 MR-3/EMI",null,{"$f":"D62+D70+D73+D74","v":5011},null,"A++","/","/",366123859400,85.7,null,null,null,"C9"]
[7610072,"OENOVIAPAC-2 8 MR-3/HI",null,{"$f":"D63+D68+D75","v":5782},null,"A++","/","/",366123859401,116.3,null,null,null,"C9"]
[7610073,"OENOVIAPAC-2 8 MR-3/EMI",null,{"$f":"D63+D70+D74","v":5690},null,"A++","/","/",366123859402,115.2,null,null,null,"C9"]
[7610074,"OENOVIAPAC-2 11 MR-3/HI",null,{"$f":"D64+D69+D75","v":7332},null,"A++","/","/",366123859403,172.79999999999998,null,null,null,"C9"]
[7610075,"OENOVIAPAC-2 11 MR-3/EMI",null,{"$f":"D64+D71+D74","v":7240},null,"A++","/","/",366123859404,171.7,null,null,null,"C9"]
[7610076,"OENOVIAPAC-2 11 TR-3/HI",null,{"$f":"D65+D69+D75","v":7630},null,"A++","/","/",366123859405,186.79999999999998,null,null,null,"C9"]
[7610077,"OENOVIAPAC-2 11 TR-3/ETI",null,{"$f":"D65+D72+D74","v":7538},null,"A++","/","/",366123859406,185.7,null,null,null,"C9"]
[7610078,"OENOVIAPAC-2 16 MR-3/HI",null,{"$f":"D66+D69+D75","v":8403},null,"A++","/","/",366123859407,172.79999999999998,null,null,null,"C9"]
[7610079,"OENOVIAPAC-2 16 MR-3/EMI",null,{"$f":"D66+D71+D74","v":8311},null,"A++","/","/",366123859408,171.7,null,null,null,"C9"]
[7610080,"OENOVIAPAC-2 16 TR-3/HI",null,{"$f":"D67+D69+D75","v":8819},null,"A++","/","/",366123859409,186.79999999999998,null,null,null,"C9"]
[7610081,"OENOVIAPAC-2 16 TR-3/ETI",null,{"$f":"D67+D72+D74","v":8727},null,"A++","/","/",366123859410,185.7,null,null,null,"C9"]
[]
["COMPOSANTS"]
[7603571,"AWHP 4 MR","EH336",1799,5,"/","/","/",3661238581012,48,450,950,690,"C9"]
[7609925,"AWHP 6 MR-2 ","EH380",1886,5,"/","/","/",3661238589513,47,450,950,690,"C9"]
[7609926,"AWHP 8 MR-2 ","EH381",2622,5,"/","/","/",3661238589520,77,450,1040,1030,"C9"]
[7609927,"AWHP 11 MR-2 ","EH382",3456,5,"/","/","/",3661238589537,131,450,1040,1440,"C9"]
[7609928,"AWHP 11 TR-2 ","EH383",3754,5,"/","/","/",3661238589544,145,450,1040,1440,"C9"]
[7609929,"AWHP 16 MR-2 ","EH384",4527,5,"/","/","/",3661238589551,131,450,1040,1440,"C9"]
[7609930,"AWHP 16 TR-2 ","EH385",4943,5,"/","/","/",3661238589568,145,450,1040,1440,"C9"]
[7609966,"MHX-3/HI 4-8 ","EH418",2897,null,"/","/","/",3661238589896,35.200000000000003,465,465,800,"C9"]
[7609967,"MHX-3/HI 11-16 ","EH419",3613,null,"/","/","/",3661238589902,37.700000000000003,465,465,800,"C9"]
[7609968,"MHX-3/EMI 4-8 ","EH420",2897,null,"/","/","/",3661238589919,35.200000000000003,465,465,800,"C9"]
[7609969,"MHX-3/EMI 11-16 ","EH421",3613,null,"/","/","/",3661238589926,37.700000000000003,465,465,800,"C9"]
[7609970,"MHX-3/ETI 11-16 ","EH422",3613,null,"/","/","/",3661238589933,37.700000000000003,465,465,800,"C9"]
[100015480,"RACCORD D'ADAPTATION FRIGO POUR 4 kW ET 6 kW","EH146",57,null,"/","/","/",3661238381612,0.5,150,80,30,"C9"]
[100015481,"DOSSERET DE MONTAGE VERSION E","EH147",171,null,"/","/","/",3661238381629,3,715,420,115,"C9"]
[100015482,"DOSSERET DE MONTAGE VERSION H","EH148",263,null,"/","/","/",3661238381636,4.0999999999999996,715,420,115,"C9"]
[]
["OPTIONS"]
[100004417,"FILTRE 400UM + VANNE D'ISOLEMENT PAC ROE 6-10 ET ROE+","EH61",103,null,"/","/","/",3661238003415,0.85,175,90,130,"C6"]
[100011222,"SUPPORT MURALE & PLOTS ANTIVIBRATILES POUR  ROE-II AWHP 6-8","EH95",159,null,"/","/","/",3661238339927,5.4,820,90,90,"C6"]
[100012532,"BAC DE RECUPERATION CONDENSATS POUR SUPPORT MURAL","EH111",139,null,"/","/","/",3661238361553,2,960,440,80,"C6"]
[100012534,"CORDON CHAUFFANT ELECTRIQUE","EH113",147,null,"/","/","/",3661238361577,0.2,200,200,10,"C6"]
[100012533,"SUPPORT POSE AU SOL AWHP","EH112",44,null,"/","/","/",3661238361560,1.2,450,140,80,"C6"]
[100015476,"LIAISON FRIGORIFIQUE PE 1/2\" 1/4\" - LG 10 m","EH142",228,null,"/","/","/",3661238381575,7.9,600,650,150,"C6"]
[100012535,"LIAISON FRIGORIFIQUE PE 5/8'' 3/8'' - LG 5m","EH114",228,null,"/","/","/",3661238361522,4.5999999999999996,600,600,150,"C6"]
[100012536,"LIAISON FRIGORIFIQUE PE 5/8'' 3/8'' - LG 10m","EH115",407,null,"/","/","/",3661238361539,7.2,600,600,200,"C6"]
[100012537,"LIAISON FRIGORIFIQUE PE 5/8'' 3/8'' - LG 20m","EH116",736,null,"/","/","/",3661238361546,14.3,750,750,230,"C6"]
[100008841,"BALLON TAMPON 80L B 80 T","EH85",510,null,"/","/","/",3661238166325,44.5,510,510,920,"C6"]
[100004415,"BALLON TAMPON 160L B 150 T","EH60",765,null,"/","/","/",3661238003422,63.2,825,690,1120,"C6"]
[100002276,"VANNE D'INVERSION CHAUFFAGE SANITAIRE MC 35E MC 45 ET 65","HC135",345,null,"/","/","/",3661238007734,1,195,155,130,"C0"]
[100003301,"KIT CABLAGE PLANCHER CHAUFFANT DIRECT","HA249",38,0.01,"/","/","/",3661238005570,0.1,210,140,20,"C0"]
[88017904,"THERMOSTAT AMBIANCE PROGRAMMABLE (FILAIRE)","AD191",158,0.08,"/","/","/",3661238102415,0.25,135,90,55,"C0"]
[88017010,"THERMOSTAT D'AMBIANCE PROGRAMMABLE (SANS FILS)","AD192",280,0.08,"/","/","/",3661238102439,0.42499999999999999,180,150,90,"C0"]
[100015479,"VANNE D'INVERSION CHAUFFAGE-SANITAIRE+SONDE ECS ","EH145",328,null,"/","/","/",3661238381605,4.2,410,210,125,"C6"]
[100015468,"KIT RAC HYDRAULIQUE PAC - BALLON ECS","EH149",97,null,"/","/","/",3661238413818,1.2,575,505,145,"C6"]
[100015481,"DOSSERET DE MONTAGE VERSION E","EH147",171,null,"/","/","/",3661238381629,6,715,420,115,"C6"]
[]
[]
[7610082,"OENOVIAPAC-2 4 MR-3/H V220",null,{"$f":"D114+D121+D126+D127+D128","v":5874},null,"A++","A","XL",366123859326,233.1,null,null,null,"C9"]
[7610083,"OENOVIAPAC-2 4 MR-3/EM V220",null,{"$f":"D114+D123+D126+D127+D128","v":5985},null,"A++","A","XL",366123859327,231.5,null,null,null,"C9"]
[7610084,"OENOVIAPAC-2 6 MR-3/H V220",null,{"$f":"D115+D121+D126+D127+D128","v":5961},null,"A+","A","XL",366123859328,232.1,null,null,null,"C9"]
[7610085,"OENOVIAPAC-2 6 MR-3/EM V220",null,{"$f":"D115+D123+D126+D127+D128","v":6072},null,"A+","A","XL",366123859329,230.5,null,null,null,"C9"]
[7610086,"OENOVIAPAC-2 8 MR-3/H V220",null,{"$f":"D116+D121+D126+D127","v":6640},null,"A++","A","XL",366123859330,261.60000000000002,null,null,null,"C9"]
[7610087,"OENOVIAPAC-2 8 MR-3/EM V220",null,{"$f":"D116+D123+D126+D127","v":6751},null,"A++","A","XL",366123859411,260,null,null,null,"C9"]
[7610088,"OENOVIAPAC-2 11 MR-3/H V220",null,{"$f":"D117+D122+D126+D127","v":8664},null,"A++","A","XL",366123859412,318.10000000000002,null,null,null,"C9"]
[7610089,"OENOVIAPAC-2 11 MR-3/EM V220",null,{"$f":"D117+D124+D126+D127","v":8787},null,"A++","A","XL",366123859413,316,null,null,null,"C9"]
[7610090,"OENOVIAPAC-2 11 TR-3/H V220",null,{"$f":"D118+D122+D126+D127","v":8962},null,"A++","A","XL",366123859414,332.1,null,null,null,"C9"]
[7610091,"OENOVIAPAC-2 11 TR-3/ET V220",null,{"$f":"D118+D125+D126+D127","v":9085},null,"A++","A","XL",366123859415,332,null,null,null,"C9"]
[7610092,"OENOVIAPAC-2 16 MR-3/H V220",null,{"$f":"D119+D122+D126+D127","v":9735},null,"A++","A","XL",366123859416,318.10000000000002,null,null,null,"C9"]
[7610093,"OENOVIAPAC-2 16 MR-3/EM V220",null,{"$f":"D119+D124+D126+D127","v":9858},null,"A++","A","XL",366123859417,316,null,null,null,"C9"]
[7610094,"OENOVIAPAC-2 16 TR-3/H V220",null,{"$f":"D120+D122+D126+D127","v":10151},null,"A++","A","XL",366123859418,332.1,null,null,null,"C9"]
[7610095,"OENOVIAPAC-2 16 TR-3/ET V220",null,{"$f":"D120+D125+D126+D127","v":10274},null,"A++","A","XL",366123859419,332,null,null,null,"C9"]
[]
["COMPOSANTS"]
[7603571,"AWHP 4 MR","EH336",1799,5,"/","/","/",3661238581012,48,450,950,690,"C9"]
[7609925,"AWHP 6 MR-2 ","EH380",1886,5,"/","/","/",3661238589513,47,450,950,690,"C9"]
[7609926,"AWHP 8 MR-2 ","EH381",2622,5,"/","/","/",3661238589520,77,450,1040,1030,"C9"]
[7609927,"AWHP 11 MR-2 ","EH382",3456,5,"/","/","/",3661238589537,131,450,1040,1440,"C9"]
[7609928,"AWHP 11 TR-2 ","EH383",3754,5,"/","/","/",3661238589544,145,450,1040,1440,"C9"]
[7609929,"AWHP 16 MR-2 ","EH384",4527,5,"/","/","/",3661238589551,131,450,1040,1440,"C9"]
[7609930,"AWHP 16 TR-2 ","EH385",4943,5,"/","/","/",3661238589568,145,450,1040,1440,"C9"]
[7609971,"MHX-3/H 4-8 V220 ","EH423",2207,null,"/","/","/",3661238589940,64.599999999999994,775,660,1045,"C9"]
[7609972,"MHX-3/H 11-16 V220 ","EH424",3397,null,"/","/","/",3661238589957,67.099999999999994,775,660,1045,"C9"]
[7609973,"MHX-3/EM 4-8 V220 ","EH425",2318,null,"/","/","/",3661238589964,63,775,660,1045,"C9"]
[7609974,"MHX-3/EM 11-16 V220 ","EH426",3520,null,"/","/","/",3661238589971,65,775,660,1045,"C9"]
[7609975,"MHX-3/ET 11-16 V220 ","EH427",3520,null,"/","/","/",3661238589988,67,775,660,1045,"C9"]
[100016427,"BALLON 220HPSL","ER222",1536,null,"/","/","/",3661238493438,115.5,790,675,1160,"C9"]
[100018045,"KIT TUBULURES DE RACCORDEMENT","EH210",275,null,"/","/","/",3661238543720,4.5,720,425,120,"C9"]
[100015480,"RACCORD D'ADAPTATION FRIGO POUR 4 kW ET 6 kW","EH146",57,null,"/","/","/",3661238381612,0.5,150,80,30,"C9"]
[]
["OPTIONS"]
[100011222,"SUPPORT MURALE & PLOTS ANTIVIBRATILES POUR  ROE-II AWHP 6-8","EH95",159,null,"/","/","/",3661238339927,5.4,820,90,90,"C6"]
[100018409,"SUPPORT MURAL AWHP 11à 27 kW","EH250",163,null,"/","/","/",3661238543874,5,820,90,90,"C6"]
[100012532,"BAC DE RECUPERATION CONDENSATS POUR SUPPORT MURAL","EH111",139,null,"/","/","/",3661238361553,2,960,440,80,"C6"]
[100012534,"CORDON CHAUFFANT ELECTRIQUE","EH113",147,null,"/","/","/",3661238361577,0.2,200,200,10,"C6"]
[100012533,"SUPPORT POSE AU SOL AWHP","EH112",44,null,"/","/","/",3661238361560,1.2,450,140,80,"C6"]
[100015476,"LIAISON FRIGORIFIQUE PE 1/2\" 1/4\" - LG 10 m","EH142",228,null,"/","/","/",3661238381575,7.9,600,650,150,"C6"]
[100012535,"LIAISON FRIGORIFIQUE PE 5/8'' 3/8'' - LG 5m","EH114",228,null,"/","/","/",3661238361522,4.5999999999999996,600,600,150,"C6"]
[100012536,"LIAISON FRIGORIFIQUE PE 5/8'' 3/8'' - LG 10m","EH115",407,null,"/","/","/",3661238361539,7.2,600,600,200,"C6"]
[100012537,"LIAISON FRIGORIFIQUE PE 5/8'' 3/8'' - LG 20m","EH116",736,null,"/","/","/",3661238361546,14.3,750,750,230,"C6"]
[100008841,"BALLON TAMPON 80L B 80 T","EH85",510,null,"/","/","/",3661238166325,44.5,510,510,920,"C6"]
[100004415,"BALLON TAMPON 160L B 150 T","EH60",765,null,"/","/","/",3661238003422,63.2,825,690,1120,"C6"]
[100003301,"KIT CABLAGE PLANCHER CHAUFFANT DIRECT","HA249",38,0.01,"/","/","/",3661238005570,0.1,210,140,20,"C0"]
[88017904,"THERMOSTAT AMBIANCE PROGRAMMABLE (FILAIRE)","AD191",158,0.08,"/","/","/",3661238102415,0.25,135,90,55,"C0"]
[88017010,"THERMOSTAT D'AMBIANCE PROGRAMMABLE (SANS FILS)","AD192",280,0.08,"/","/","/",3661238102439,0.42499999999999999,180,150,90,"C0"]
[100015482,"DOSSERET DE MONTAGE VERSION H","EH148",263,null,"/","/","/",3661238381636,4.0999999999999996,715,420,115,"C0"]
[100019114,"KIT DETECTEUR DE CONDENSATION","HK27",208,0.01,"/","/","/",3661238569119,0.7,185,130,105,"C0"]
[]
[]
[7638440,"OENOVIAPAC-2C 4 MR-4/H V200",null,{"$f":"SUM(D165+D172+D176)","v":5874},null,"A++","A","L",3661238640337,null,null,null,null,"C9"]
[7638441,"OENOVIAPAC-2C 4 MR-4/E V200",null,{"$f":"SUM(D165+D174+D176)","v":5985},null,"A++","A","L",3661238640344,null,null,null,null,"C9"]
[7638442,"OENOVIAPAC-2C 6 MR-4/H V200",null,{"$f":"SUM(D166+D172+D176)","v":5961},null,"A++","A","L",3661238640351,null,null,null,null,"C9"]
[7638443,"OENOVIAPAC-2C 6 MR-4/E V200",null,{"$f":"SUM(D166+D174+D176)","v":6072},null,"A++","A","L",3661238640368,null,null,null,null,"C9"]
[7638444,"OENOVIAPAC-2C 8 MR-4/H V200",null,{"$f":"SUM(D167+D172)","v":6640},null,"A++","A","L",3661238640375,null,null,null,null,"C9"]
[7638445,"OENOVIAPAC-2C 8 MR-4/E V200",null,{"$f":"SUM(D167+D174)","v":6751},null,"A++","A","L",3661238640382,null,null,null,null,"C9"]
[7638446,"OENOVIAPAC-2C 11 MR-4/H V200",null,{"$f":"SUM(D168+D173)","v":8664},null,"A++","A","L",3661238640399,null,null,null,null,"C9"]
[7638447,"OENOVIAPAC-2C 11 MR-4/E V200",null,{"$f":"SUM(D168+D175)","v":8786},null,"A++","A","L",3661238640405,null,null,null,null,"C9"]
[7638448,"OENOVIAPAC-2C 11 TR-4/H V200",null,{"$f":"SUM(D169+D173)","v":8962},null,"A++","A","L",3661238640412,null,null,null,null,"C9"]
[7638449,"OENOVIAPAC-2C 11 TR-4/E V200",null,{"$f":"SUM(D169+D175)","v":9084},null,"A++","A","L",3661238640429,null,null,null,null,"C9"]
[7638450,"OENOVIAPAC-2C 16 MR-4/H V200",null,{"$f":"SUM(D170+D173)","v":9735},null,"A++","A","L",3661238640436,null,null,null,null,"C9"]
[7638451,"OENOVIAPAC-2C 16 MR-4/E V200",null,{"$f":"SUM(D170+D175)","v":9857},null,"A++","A","L",3661238640443,null,null,null,null,"C9"]
[7638452,"OENOVIAPAC-2C 16 TR-4/H V200",null,{"$f":"SUM(D171+D173)","v":10151},null,"A++","A","L",3661238640450,null,null,null,null,"C9"]
[7638453,"OENOVIAPAC-2C 16 TR-4/E V200",null,{"$f":"SUM(D171+D175)","v":10273},null,"A++","A","L",3661238640467,null,null,null,null,"C9"]
[]
["COMPOSANTS"]
[7603571,"AWHP 4 MR","EH336",1799,5,"/","/","/",3661238581012,48,450,950,690,"C9"]
[7609925,"AWHP 6 MR-2 ","EH380",1886,5,"/","/","/",3661238589513,47,450,950,690,"C9"]
[7609926,"AWHP 8 MR-2 ","EH381",2622,5,"/","/","/",3661238589520,77,450,1040,1030,"C9"]
[7609927,"AWHP 11 MR-2 ","EH382",3456,5,"/","/","/",3661238589537,131,450,1040,1440,"C9"]
[7609928,"AWHP 11 TR-2 ","EH383",3754,5,"/","/","/",3661238589544,145,450,1040,1440,"C9"]
[7609929,"AWHP 16 MR-2 ","EH384",4527,5,"/","/","/",3661238589551,131,450,1040,1440,"C9"]
[7609930,"AWHP 16 TR-2 ","EH385",4943,5,"/","/","/",3661238589568,145,450,1040,1440,"C9"]
[7625406,"MHX-4/H 4-8 V200 ","EH546",4018,null,"/","/","/",3661238622968,143,970,675,1435,"C9"]
[7625407,"MHX-4/H 11-16 V200 ","EH547",5208,null,"/","/","/",3661238622975,145,970,675,1435,"C9"]
[7625408,"MHX-4/E 4-8 V200 ","EH548",4129,null,"/","/","/",3661238622982,146,970,675,1435,"C9"]
[7625421,"MHX-4/E 11-16 V200 ","EH549",5330,null,"/","/","/",3661238622999,148,970,675,1435,"C9"]
[100015480,"RACCORD D'ADAPTATION FRIGO POUR 4 kW ET 6 kW","EH146",57,null,"/","/","/",3661238381612,0.5,150,80,30,"C9"]
[]
["OPTIONS"]
[100004417,"FILTRE 400UM + VANNE D'ISOLEMENT PAC ROE 6-10 ET ROE+","EH61",103,null,"/","/","/",3661238003415,0.85,175,90,130,"C6"]
[100011222,"SUPPORT MURALE & PLOTS ANTIVIBRATILES POUR  ROE-II AWHP 6-8","EH95",159,null,"/","/","/",3661238339927,5.4,820,90,90,"C6"]
[100018409,"SUPPORT MURAL AWHP 11à 27 kW","EH250",163,null,"/","/","/",3661238543874,5,820,90,90,"C6"]
[100012532,"BAC DE RECUPERATION CONDENSATS POUR SUPPORT MURAL","EH111",139,null,"/","/","/",3661238361553,2,960,440,80,"C6"]
[100012534,"CORDON CHAUFFANT ELECTRIQUE","EH113",147,null,"/","/","/",3661238361577,0.2,200,200,10,"C6"]
[100012533,"SUPPORT POSE AU SOL AWHP","EH112",44,null,"/","/","/",3661238361560,1.2,450,140,80,"C6"]
[100015476,"LIAISON FRIGORIFIQUE PE 1/2\" 1/4\" - LG 10 m","EH142",284,null,"/","/","/",3661238381575,7.9,600,650,150,"C6"]
[100012535,"LIAISON FRIGORIFIQUE PE 5/8'' 3/8'' - LG 5m","EH114",228,null,"/","/","/",3661238361522,4.5999999999999996,600,600,150,"C6"]
[100012536,"LIAISON FRIGORIFIQUE PE 5/8'' 3/8'' - LG 10m","EH115",407,null,"/","/","/",3661238361539,7.2,600,600,200,"C6"]
[100012537,"LIAISON FRIGORIFIQUE PE 5/8'' 3/8'' - LG 20m","EH116",736,null,"/","/","/",3661238361546,14.3,750,750,230,"C6"]
[100008841,"BALLON TAMPON 80L B 80 T","EH85",510,null,"/","/","/",3661238166325,44.5,510,510,920,"C6"]
[100004415,"BALLON TAMPON 160L B 150 T","EH60",765,null,"/","/","/",3661238003422,63.2,825,690,1120,"C6"]
[7624902,"KIT CABLAGE PLANCHER CHAUFFANT DIRECT","HA255",36,null,"/","/","/",3661238618176,0.1,210,140,20,"C0"]
[88017904,"THERMOSTAT AMBIANCE PROGRAMMABLE (FILAIRE)","AD191",158,0.08,"/","/","/",3661238102415,0.25,135,90,55,"C0"]
[88017010,"THERMOSTAT D'AMBIANCE PROGRAMMABLE (SANS FILS)","AD192",280,0.08,"/","/","/",3661238102439,0.42499999999999999,180,150,90,"C0"]
[100019114,"KIT DETECTEUR DE CONDENSATION","HK27",208,0.01,"/","/","/",3661238569119,0.7,185,130,105,"C0"]
[7619010,"KIT VANNE 3 VOIES","EH528",564,0.17,"/","/","/",3661238618152,17.7,750,300,150,"C0"]
[7622273,"CARTE DE REGULATION 2 CIRCUITS","EH527",195,0.01,"/","/","/",3661238618145,0.3,185,130,105,"C0"]
[7626737,"KIT ISOLATION MODE FROID","EH 567",204,null,"/","/","/",3661238624115,null,360,340,180,"C0"]
[7636899,"KIT SILENCIEUX MODULE EXTERIEUR","EH 572",59,0.01,"/","/","/",3661238644335,0.2,170,210,20,"C0"]
[]
["OPTIONS ECS"]
[7631121,"KIT CONNEXION BASE ","EH590",449,null,null,null,null,3661238631229,10.9,1187,397,181,"C6"]
[7631133,"KIT CONNEXION SECOND CIRCUIT","EH591",130,null,null,null,null,3661238631311,2.4500000000000002,600,150,100,"C6"]
[7631134,"KIT CONNEXION CHAUDIERE APPOIN","EH592",130,null,null,null,null,3661238631328,2.1,795,160,160,"C6"]
[7631764,"KIT CONNEXION RECIRCULATIO","EH593",75,null,null,null,null,3661238632349,1.55,600,150,100,"C6"]
[]
[]
[7609994,"OENOVIAPAC-2 CONFORT 4 MR-2/H",null,{"$f":"D227+D236+D242","v":4984},null,"A++","/","/",366123859365,110.1,null,null,null,"C6"]
[7609995,"OENOVIAPAC-2 CONFORT 4 MR-2/EM",null,{"$f":"D227+D238+D242","v":5464},null,"A++","/","/",366123859366,116.2,null,null,null,"C6"]
[7609996,"OENOVIAPAC-2 CONFORT 6 MR-2/H",null,{"$f":"D228+D236+D242","v":5071},null,"A++","/","/",366123859367,109.1,null,null,null,"C6"]
[7609997,"OENOVIAPAC-2 CONFORT 6 MR-2/EM",null,{"$f":"D228+D238+D242","v":5551},null,"A++","/","/",366123859368,115.2,null,null,null,"C6"]
[7609998,"OENOVIAPAC-2 CONFORT 8 MR-2/H",null,{"$f":"D229+D236","v":5750},null,"A++","/","/",366123859369,138.6,null,null,null,"C6"]
[7609999,"OENOVIAPAC-2 CONFORT 8 MR-2/EM",null,{"$f":"D229+D238","v":6230},null,"A++","/","/",366123859370,144.69999999999999,null,null,null,"C6"]
[7610000,"OENOVIAPAC-2 CONFORT 11 MR-2/H",null,{"$f":"D230+D237","v":7245},null,"A++","/","/",366123859371,195.2,null,null,null,"C6"]
[7610001,"OENOVIAPAC-2 CONFORT 11 MR-2/EM",null,{"$f":"D230+D239","v":7811},null,"A++","/","/",366123859372,205.5,null,null,null,"C6"]
[7610002,"OENOVIAPAC-2 CONFORT 11 TR-2/H",null,{"$f":"D231+D237","v":7543},null,"A++","/","/",366123859373,209.2,null,null,null,"C6"]
[7610003,"OENOVIAPAC-2 CONFORT 11 TR-2/ET",null,{"$f":"D231+D239","v":8109},null,"A++","/","/",366123859374,219.5,null,null,null,"C6"]
[7610004,"OENOVIAPAC-2 CONFORT 16 MR-2/H",null,{"$f":"D232+D237","v":8316},null,"A++","/","/",366123859375,195.2,null,null,null,"C6"]
[7610005,"OENOVIAPAC-2 CONFORT 16 MR-2/EM",null,{"$f":"D232+D239","v":8882},null,"A++","/","/",366123859376,205.5,null,null,null,"C6"]
[7610006,"OENOVIAPAC-2 CONFORT 16 TR-2/H",null,{"$f":"D233+D237","v":8732},null,"A++","/","/",366123859377,209.2,null,null,null,"C6"]
[7610007,"OENOVIAPAC-2 CONFORT 16 TR-2/ET",null,{"$f":"D233+D239","v":9298},null,"A++","/","/",366123859378,219.5,null,null,null,"C6"]
[7610008,"OENOVIAPAC-2 CONFORT 22 TR-2/H",null,{"$f":"D234+D240+D243","v":11146},null,"A++","/","/",366123859379,211.2,null,null,null,"C6"]
[7610009,"OENOVIAPAC-2 CONFORT 22 TR-2/ET",null,{"$f":"D234+D241+D243","v":11945},null,"A++","/","/",366123859380,217.29999999999998,null,null,null,"C6"]
[7610010,"OENOVIAPAC-2 CONFORT 27 TR-2/H",null,{"$f":"D235+D240","v":12354},null,"A+","/","/",366123859381,216.2,null,null,null,"C6"]
[7610011,"OENOVIAPAC-2 CONFORT 27 TR-2/ET",null,{"$f":"D235+D241","v":13153},null,"A+","/","/",366123859382,222.29999999999998,null,null,null,"C6"]
[]
["COMPOSANTS"]
[7603571,"AWHP 4 MR","EH336",1799,5,"/","/","/",3661238581012,48,450,950,690,"C9"]
[7609925,"AWHP 6 MR-2 ","EH380",1886,5,"/","/","/",3661238589513,47,450,950,690,"C9"]
[7609926,"AWHP 8 MR-2 ","EH381",2622,5,"/","/","/",3661238589520,77,450,1040,1030,"C9"]
[7609927,"AWHP 11 MR-2 ","EH382",3456,5,"/","/","/",3661238589537,131,450,1040,1440,"C9"]
[7609928,"AWHP 11 TR-2 ","EH383",3754,5,"/","/","/",3661238589544,145,450,1040,1440,"C9"]
[7609929,"AWHP 16 MR-2 ","EH384",4527,5,"/","/","/",3661238589551,131,450,1040,1440,"C9"]
[7609930,"AWHP 16 TR-2","EH385",4943,5,"/","/","/",3661238589568,145,450,1040,1440,"C9"]
[100017900,"AWHP 22 TR","EH225",5779,5,"/","/","/",3661238543737,143,450,1100,1430,"C9"]
[100017901,"AWHP 27 TR","EH226",7022,5,"/","/","/",3661238543744,148,450,1100,1430,"C9"]
[7609940,"MHR-IN-2/H 4-8 OE-TRO ","EH392",3128,null,"/","/","/",3661238589636,61.6,670,1135,650,"C6"]
[7609941,"MHR-IN-2/H 11-16 OE-TRO ","EH393",3789,null,"/","/","/",3661238589643,64.2,670,1135,650,"C6"]
[7609942,"MHR-IN-2/E 4-8 OE-TRO ","EH394",3608,null,"/","/","/",3661238589650,68.2,670,1135,650,"C6"]
[7609943,"MHR-IN-2/E 11-16 OE-TRO ","EH395",4355,null,"/","/","/",3661238589667,67.7,670,1135,650,"C6"]
[7609944,"MHR-IN-2/H 22-27 OE-TRO ","EH396",5332,null,"/","/","/",3661238589674,74.5,670,1135,650,"C6"]
[7609945,"MHR-IN-2/E 22-27 OE-TRO ","EH397",6131,null,"/","/","/",3661238589681,74.2,670,1135,650,"C6"]
[100015480,"RACCORD D'ADAPTATION FRIGO POUR 4 kW ET 6 kW","EH146",57,null,"/","/","/",3661238381612,0.5,150,80,30,"C9"]
[100018428,"RACCORD D'ADAPTATION FRIGO POUR 22 kW","HK26",35,null,"/","/","/",3661238544635,0.1,140,70,25,"C9"]
[]
["OPTIONS"]
[100011222,"SUPPORT MURALE & PLOTS ANTIVIBRATILES POUR  ROE-II AWHP 6-8","EH95",159,null,"/","/","/",3661238339927,5.4,820,90,90,"C6"]
[100018409,"SUPPORT MURAL AWHP 11à 27 kW","EH250",163,null,"/","/","/",3661238543874,5,820,90,90,"C6"]
[100012532,"BAC DE RECUPERATION CONDENSATS POUR SUPPORT MURAL","EH111",139,null,"/","/","/",3661238361553,2,960,440,80,"C6"]
[100012534,"CORDON CHAUFFANT ELECTRIQUE","EH113",147,null,"/","/","/",3661238361577,0.2,200,200,10,"C6"]
[100012533,"SUPPORT POSE AU SOL AWHP","EH112",44,null,"/","/","/",3661238361560,1.2,450,140,80,"C6"]
[100012535,"LIAISON FRIGORIFIQUE PE 5/8'' 3/8'' - LG 5m","EH114",228,null,"/","/","/",3661238361522,4.5999999999999996,600,600,150,"C6"]
[100012536,"LIAISON FRIGORIFIQUE PE 5/8'' 3/8'' - LG 10m","EH115",407,null,"/","/","/",3661238361539,7.2,600,600,200,"C6"]
[100012537,"LIAISON FRIGORIFIQUE PE 5/8'' 3/8'' - LG 20m","EH116",736,null,"/","/","/",3661238361546,14.2,750,750,230,"C6"]
[100015476,"LIAISON FRIGORIFIQUE PE 1/2\" 1/4\" - LG 10 m","EH142",228,null,"/","/","/",3661238381575,7.9,600,650,150,"C6"]
[100018410,"KIT ISOLATION MODE FROID MIT-IN iSYSTEM","HK24",265,null,"/","/","/",3661238543881,0.87,360,340,180,"C6"]
[100018411,"KIT ISOLATION MODE FROID KIT VANNE 3 VOIES (CIRCUIT B)","HK25",150,null,"/","/","/",3661238543898,0.26,310,210,130,"C6"]
[100008841,"BALLON TAMPON 80L B 80 T","EH85",510,null,"/","/","/",3661238166325,44.5,510,510,920,"C6"]
[100003301,"KIT CABLAGE PLANCHER CHAUFFANT DIRECT","HA249",38,0.01,"/","/","/",3661238005570,0.1,210,140,20,"C0"]
[100017830,"KIT VANNE 3 VOIES (CIRCUIT B)","HK21",653,null,"/","/","/",3661238544727,5.9,880,270,150,"C6"]
[100017832,"KIT TUBULURES 2 CIRCUITS","HK22",139,null,"/","/","/",3661238544710,1.6,880,270,150,"C6"]
[100017833,"VANNE D'INVERSION CHAUFFAGE-SANITAIRE","HK23",194,null,"/","/","/",3661238544734,1.4,310,230,130,"C6"]
[100015468,"KIT RAC HYDRAULIQUE PAC - BALLON ECS","EH149",97,null,"/","/","/",3661238413818,1.2,575,505,145,"C6"]
[100020164,"COLLECTEUR 2/3 CIRCUITS ","EA140",341,null,"/","/","/",3661238575011,6.6,660,180,200,"C0"]
[100020165,"CONSOLE MUR COLLECTEUR ","EA141",43,null,"/","/","/",3661238575028,1.2,220,125,70,"C0"]
[100020166,"CONSOLE MUR 1 MODULE ","EA142",114,null,"/","/","/",3661238575035,1.6,220,125,70,"C0"]
[100020167,"CIRCUIT DIRECT P.ELEC CLASSE A  ","EA143",631,0.17,"/","/","/",3661238575042,5.0999999999999996,460,270,235,"C0"]
[100020169,"MODULE HYDR COMPACT 2 CIRCUITS HEE","EA145",1122,0.17399999999999999,"/","/","/",3661238575059,9,525,415,210,"C0"]
[100020294,"KIT COMPTAGE D'ENERGIE","HK29",186,0.01,"/","/","/",3661238576513,0.34,190,145,124,"C6"]
[]
["OPTIONS REGULATIONS"]
[100013304,"OPTION V3V ","AD249",155,0.01,"/","/","/",3661238363519,0.4,260,170,130,"C0"]
[100013305,"SONDE SYSTÈME ECS","AD250",45,0.01,"/","/","/",3661238363588,0.13400000000000001,150,210,25,"C0"]
[100013306,"SONDE EXTERIEURE RADIO ","AD251",76,0.08,"/","/","/",3661238363595,0.15,150,210,40,"C0"]
[100013307,"MODULE CHAUDIERE RADIO (EMETTEUR)","AD252",121,0.08,"/","/","/",3661238363601,0.32,260,160,130,"C0"]
[100018923,"CDE À DIST RADIO CDR 2/CD","AD284",232,0.08,"/","/","/",3661238544932,0.253,175,122,60,"C0"]
[100013477,"COMMANDE A DISTANCE RS 400","AD257",174,0.08,"/","/","/",3661238364257,0.253,175,122,60,"C0"]
[100013472,"CDE A DISTANCE RADIO RS 400R     ","AD255",233,0.08,"/","/","/",3661238364233,0.253,175,122,60,"C0"]
[88017851,"CABLE DE LIAISON BUS LG 12 M","AD134",108,0.01,"/","/","/",3661238048850,0.4,350,260,30,"C0"]
[88017878,"MODULE DE TELESURVEILLANCE VOCAL TELCOM 2","AD152",690,0.08,"/","/","/",3661238048751,1.1000000000000001,210,190,105,"C0"]
[88017017,"SONDE DEPART v3v","AD199",79,0.01,"/","/","/",3661238049185,0.21,150,200,40,"C0"]
[100002803,"COMMANDE A DISTANCE SIMPLIFIEE AD208","AD208",102,0.08,"/","/","/",3661238554931,0.2,120,85,40,"C0"]
[100000030,"COLIS OPTION SONDE ECS","AD212",48,0.01,"/","/","/",3661238011168,0.2,200,150,30,"C0"]
[7623159,"KIT DE REGULATION 2 CIRCUITS ","EH493",642,0.08,"/","/","/",3661238619517,2.2200000000000002,325,280,90,"C0"]
[]
[]
[7617624,"OEnoviaPAC-GS 5 MR","HZ38",6725,6,"A++","/","/",3661238603561,149.69999999999999,970,675,1135,"C6"]
[7617626,"OEnoviaPAC-GS 5 TR","HZ39",6725,6,"A++","/","/",3661238603578,149.69999999999999,970,675,1135,"C6"]
[7618122,"OEnoviaPAC-GS 9 MR","HZ40",7439,6,"A++","/","/",3661238614437,166,970,675,1135,"C6"]
[7618123,"OEnoviaPAC-GS 9 TR","HZ41",7439,6,"A++","/","/",3661238614444,166,970,675,1135,"C6"]
[7618124,"OEnoviaPAC-GS 12 MR","HZ42",8009,6,"A++","/","/",3661238603585,168,970,675,1135,"C6"]
[7615884,"OEnoviaPAC-GS 12 TR","HZ43",8009,6,"A++","/","/",3661238603592,168,970,675,1135,"C6"]
[7618125,"OEnoviaPAC-GS 15 TR","HZ44",8600,6,"A++","/","/",3661238603608,182.9,970,675,1135,"C6"]
[7618126,"OEnoviaPAC-GS 19 TR","HZ45",9293,6,"A++","/","/",3661238603615,173.4,970,675,1135,"C6"]
[7618127,"OEnoviaPAC-GS 27 TR","HZ46",10913,6,"A++","/","/",3661238603622,208.5,970,675,1135,"C6"]
[]
["OPTIONS "]
[7616429,"VANNE INVERSION + SONDE ECS GSHP 19 – 27 kW ","HZ17",416,0.17,"/","/","/",3661238600812,4.0999999999999996,410,210,110,"C6"]
[7616680,"KIT APPOINT ELECTRIQUE 9 kW GSHP 05 à 15 kW","HZ20",642,0.42,"/","/","/",3661238639829,4.7,420,280,190,"C6"]
[7616643,"KIT APPOINT ELECTRIQUE 9 kW GSHP 19 - 27 kW","HZ19",693,0.42,"/","/","/",3661238603226,4.8,420,280,190,"C6"]
[7618061,"KIT ECHANGEUR DE BARRAGE GSHP 05 – 09 kW","HZ24",937,null,"/","/","/",3661238603264,16.2,660,220,325,"C6"]
[7618063,"KIT ECHANGEUR DE BARRAGE GSHP 12 – 15 kW","HZ26",1141,null,"/","/","/",3661238603288,19.5,660,220,325,"C6"]
[7618065,"KIT ECHANGEUR DE BARRAGE GSHP 19 – 27 kW","HZ28",1488,null,"/","/","/",3661238603301,25.4,660,220,325,"C6"]
[7622431,"KIT CABLAGE THERMOSTAT DE SECURITE PCBT","HZ29",73,0.01,"/","/","/",3661238614116,0.3,210,150,40,"C6"]
[7622062,"KIT POMPE WILO PARA 25/1-8 pour GSHP 19","HZ63",652,0.17,"/","/","/",3661238613041,5,360,235,285,"C6"]
[7610411,"KIT CIRCUIT PLANCHER CHAUFFANT ","ER604",713,0.17,"/","/","/",3661238600669,5.3,815,415,250,"C0"]
[7620436,"KIT ISOLATION MODE FROID","ER581",179,null,"/","/","/",3661238621572,3.5,615,205,205,"C0"]
[7610412,"KIT CIRCUIT RADIATEUR","ER605",469,0.17,"/","/","/",3661238600645,6.8,815,415,250,"C0"]
[7610667,"KIT DE RACCORDEMENT BALLON TAMPON - GSHP","ER606",194,null,"/","/","/",3661238600652,3.2,860,250,135,"C0"]
[7607396,"COLIS BALLON TAMPON GSHP 200L","ER602",876,null,"/","/","/",3661238600034,85,790,675,1330,"C0"]
[]
["OPTIONS REGULATION"]
[100013304,"OPTION V3V ","AD249",155,0.01,"/","/","/",3661238363519,0.4,260,170,130,"C0"]
[100013305,"SONDE SYSTÈME ECS","AD250",45,0.01,"/","/","/",3661238363588,0.13400000000000001,150,210,25,"C0"]
[100013306,"SONDE EXTERIEURE RADIO ","AD251",76,0.08,"/","/","/",3661238363595,0.15,150,210,40,"C0"]
[100013307,"MODULE CHAUDIERE RADIO (EMETTEUR)","AD252",121,0.08,"/","/","/",3661238363601,0.32,260,160,130,"C0"]
[100018923,"CDE À DIST RADIO CDR 2/CD","AD284",232,0.08,"/","/","/",3661238544932,0.253,175,122,60,"C0"]
[100013477,"COMMANDE A DISTANCE RS 400","AD257",174,0.08,"/","/","/",3661238364257,0.253,175,122,60,"C0"]
[100013472," CDE A DISTANCE RADIO RS 400R     ","AD255",233,0.08,"/","/","/",3661238364233,0.253,175,122,60,"C0"]
[88017851,"CABLE DE LIAISON BUS LG 12 M","AD134",108,0.01,"/","/","/",3661238048850,0.4,350,260,30,"C0"]
[88017017,"SONDE DEPART v3v","AD199",79,0.01,"/","/","/",3661238049185,0.21,150,200,40,"C0"]
[100002803,"COMMANDE A DISTANCE SIMPLIFIEE AD208","AD208",102,0.08,"/","/","/",3661238554931,0.2,120,85,40,"C0"]
[100000030,"COLIS OPTION SONDE ECS","AD212",48,0.01,"/","/","/",3661238011168,0.2,200,150,30,"C0"]
[100020294,"KIT COMPTAGE D'ENERGIE","HK29",186,0.01,"/","/","/",3661238576513,0.34,190,145,124,"C6"]
[100019114,"KIT SONDE HYGRO RAFRAICHISSEMENT","HK27",208,0.01,"/","/","/",3661238569119,0.2,185,130,105,"C0"]
[]
[]
[7638403,"OEnoviaPAC-GS 5 MR/B200GHL",null,{"$f":"SUM(D343+D350+D351)","v":8773},null,"A++","A","L",3661238640474,null,null,null,null,"C6"]
[7638404,"OEnoviaPAC-GS 5 MR/V200GHL",null,{"$f":"SUM(D343+D350+D352)","v":8663},null,"A++","A","L",3661238640481,null,null,null,null,"C6"]
[7638405,"OEnoviaPAC-GS 5 TR/B200GHL",null,{"$f":"SUM(D344+D350+D351)","v":8773},null,"A++","A","L",3661238640498,null,null,null,null,"C6"]
[7638406,"OEnoviaPAC-GS 5 TR/V200GHL",null,{"$f":"SUM(D344+D350+D352)","v":8663},null,"A++","A","L",3661238640504,null,null,null,null,"C6"]
[7638407,"OEnoviaPAC-GS 9 MR/B200GHL",null,{"$f":"SUM(D345+D350+D351)","v":9487},null,"A++","A","L",3661238640511,null,null,null,null,"C6"]
[7638408,"OEnoviaPAC-GS 9 MR/V200GHL",null,{"$f":"SUM(D345+D350+D352)","v":9377},null,"A++","A","L",3661238640528,null,null,null,null,"C6"]
[7638409,"OEnoviaPAC-GS 9 TR/B200GHL",null,{"$f":"SUM(D346+D350+D351)","v":9487},null,"A++","A","L",3661238640535,null,null,null,null,"C6"]
[7638410,"OEnoviaPAC-GS 9 TR/V200GHL",null,{"$f":"SUM(D346+D350+D352)","v":9377},null,"A++","A","L",3661238640542,null,null,null,null,"C6"]
[7638411,"OEnoviaPAC-GS 12 MR/B200GHL",null,{"$f":"SUM(D347+D350+D351)","v":10057},null,"A++","A","L",3661238640559,null,null,null,null,"C6"]
[7638412,"OEnoviaPAC-GS 12 MR/V200GHL",null,{"$f":"SUM(D347+D350+D352)","v":9947},null,"A++","A","L",3661238640566,null,null,null,null,"C6"]
[7638413,"OEnoviaPAC-GS 12 TR/B200GHL",null,{"$f":"SUM(D348+D350+D351)","v":10057},null,"A++","A","L",3661238640573,null,null,null,null,"C6"]
[7638414,"OEnoviaPAC-GS 12 TR/V200GHL",null,{"$f":"SUM(D348+D350+D352)","v":9947},null,"A++","A","L",3661238640580,null,null,null,null,"C6"]
[7638415,"OEnoviaPAC-GS 15 TR/B200GHL",null,{"$f":"SUM(D349+D350+D351)","v":10648},null,"A++","A","L",3661238640597,null,null,null,null,"C6"]
[7638416,"OEnoviaPAC-GS 15 TR/V200GHL",null,{"$f":"SUM(D349+D350+D352)","v":10538},null,"A++","A","L",3661238640603,null,null,null,null,"C6"]
[]
["COMPOSANTS"]
[7617624,"OEnoviaPAC-GS 5 MR","HZ38",6725,6,"A++","/","/",3661238603561,149.69999999999999,970,675,1135,"C6"]
[7617626,"OEnoviaPAC-GS 5 TR","HZ39",6725,6,"A++","/","/",3661238603578,149.69999999999999,970,675,1135,"C6"]
[7618122,"OEnoviaPAC-GS 9 MR","HZ40",7439,6,"A++","/","/",3661238614437,166,970,675,1135,"C6"]
[7618123,"OEnoviaPAC-GS 9 TR","HZ41",7439,6,"A++","/","/",3661238614444,166,970,675,1135,"C6"]
[7618124,"OEnoviaPAC-GS 12 MR","HZ42",8009,6,"A++","/","/",3661238603585,168,970,675,1135,"C6"]
[7615884,"OEnoviaPAC-GS 12 TR","HZ43",8009,6,"A++","/","/",3661238603592,168,970,675,1135,"C6"]
[7618125,"OEnoviaPAC-GS 15 TR","HZ44",8600,6,"A++","/","/",3661238603608,182.9,970,675,1135,"C6"]
[7613947,"BALLON 200 GHL","ER600",1783,null,"/","/","/",3661238600621,90,790,675,1330,"C6"]
[7611489,"KIT DE LIAISON PAC-BALLON B200","ER611",265,null,"/","/","/",3661238590618,6,860,670,220,"C6"]
[7611488,"KIT DE LIAISON PAC-BALLON V200","ER610",155,null,"/","/","/",3661238590717,3,510,460,175,"C6"]
[]
["OPTIONS"]
[7616429,"VANNE INVERSION + SONDE ECS GSHP 19 – 27 kW ","HZ17",416,0.17,"/","/","/",3661238600812,4.0999999999999996,410,210,110,"C6"]
[7616680,"KIT APPOINT ELECTRIQUE 9 kW GSHP 05 à 15 kW","HZ20",642,0.42,"/","/","/",3661238639829,4.7,420,280,190,"C6"]
[7616643,"KIT APPOINT ELECTRIQUE 9 kW GSHP 19 - 27 kW","HZ19",693,0.42,"/","/","/",3661238603226,4.8,420,280,190,"C6"]
[7618061,"KIT ECHANGEUR DE BARRAGE GSHP 05 – 09 kW","HZ24",937,null,"/","/","/",3661238603264,16.2,660,220,325,"C6"]
[7618063,"KIT ECHANGEUR DE BARRAGE GSHP 12 – 15 kW","HZ26",1141,null,"/","/","/",3661238603288,19.5,660,220,325,"C6"]
[7618065,"KIT ECHANGEUR DE BARRAGE GSHP 19 – 27 kW","HZ28",1488,null,"/","/","/",3661238603301,25.4,660,220,325,"C6"]
[7622431,"KIT CABLAGE THERMOSTAT DE SECURITE PCBT","HZ29",73,0.01,"/","/","/",3661238614116,0.3,210,150,40,"C6"]
[7622062,"KIT POMPE WILO PARA 25/1-8 pour GSHP 19","HZ63",652,0.17,"/","/","/",3661238613041,5,360,235,285,"C6"]
[7610411,"KIT CIRCUIT PLANCHER CHAUFFANT ","ER604",713,0.17,"/","/","/",3661238600669,5.3,815,415,250,"C6"]
[7620436,"KIT ISOLATION MODE FROID","ER581",179,null,"/","/","/",3661238621572,3.5,615,205,205,"C6"]
[7610412,"KIT CIRCUIT RADIATEUR","ER605",469,0.17,"/","/","/",3661238600645,6.8,815,415,250,"C6"]
[7610667,"KIT DE RACCORDEMENT BALLON TAMPON - GSHP","ER606",194,null,"/","/","/",3661238600652,3.2,860,250,135,"C6"]
[7607396,"COLIS BALLON TAMPON GSHP 200L","ER602",876,null,"/","/","/",3661238600034,85,790,675,1330,"C6"]
[]
["OPTIONS REGULATIONS"]
[100013304,"OPTION V3V ","AD249",155,0.01,"/","/","/",3661238363519,0.4,260,170,130,"C0"]
[100013305,"SONDE SYSTÈME ECS","AD250",45,0.01,"/","/","/",3661238363588,0.13400000000000001,150,210,25,"C0"]
[100013306,"SONDE EXTERIEURE RADIO ","AD251",76,0.08,"/","/","/",3661238363595,0.15,150,210,40,"C0"]
[100013307,"MODULE CHAUDIERE RADIO (EMETTEUR)","AD252",121,0.08,"/","/","/",3661238363601,0.32,260,160,130,"C0"]
[100018923,"CDE À DIST RADIO CDR 2/CD","AD284",232,0.08,"/","/","/",3661238544932,0.253,175,122,60,"C0"]
[100013477,"COMMANDE A DISTANCE RS 400","AD257",174,0.08,"/","/","/",3661238364257,0.253,175,122,60,"C0"]
[100013472," CDE A DISTANCE RADIO RS 400R     ","AD255",233,0.08,"/","/","/",3661238364233,0.253,175,122,60,"C0"]
[88017851,"CABLE DE LIAISON BUS LG 12 M","AD134",108,0.01,"/","/","/",3661238048850,0.4,350,260,30,"C0"]
[88017017,"SONDE DEPART v3v","AD199",79,0.01,"/","/","/",3661238049185,0.21,150,200,40,"C0"]
[100002803,"COMMANDE A DISTANCE SIMPLIFIEE AD208","AD208",102,0.08,"/","/","/",3661238554931,0.2,120,85,40,"C0"]
[100000030,"COLIS OPTION SONDE ECS","AD212",48,0.01,"/","/","/",3661238011168,0.2,200,150,30,"C0"]
[100020294,"KIT COMPTAGE D'ENERGIE","HK29",186,0.01,"/","/","/",3661238576513,0.34,190,145,124,"C6"]
[100019114,"KIT SONDE HYGRO RAFRAICHISSEMENT","HK27",208,0.01,"/","/","/",3661238569119,0.2,185,130,105,"C0"]
[]
[]
[7638417,"OEnoviaPAC-GS 5 MR/B200GSHL",null,{"$f":"SUM(D401+D408+D409)","v":9018},null,"A++","A","L",3661238640610,null,null,null,null,"C6"]
[7638418,"OEnoviaPAC-GS 5 MR/V200GSHL",null,{"$f":"SUM(D401+D408+D410)","v":8908},null,"A++","A","L",3661238640627,null,null,null,null,"C6"]
[7638419,"OEnoviaPAC-GS 5 TR/B200GSHL",null,{"$f":"SUM(D402+D408+D409)","v":9018},null,"A++","A","L",3661238640634,null,null,null,null,"C6"]
[7638420,"OEnoviaPAC-GS 5 TR/V200GSHL",null,{"$f":"SUM(D402+D408+D410)","v":8908},null,"A++","A","L",3661238640641,null,null,null,null,"C6"]
[7638421,"OEnoviaPAC-GS 9 MR/B200GSHL",null,{"$f":"SUM(D403+D408+D409)","v":9732},null,"A++","A","L",3661238640658,null,null,null,null,"C6"]
[7638422,"OEnoviaPAC-GS 9 MR/V200GSHL",null,{"$f":"SUM(D403+D408+D410)","v":9622},null,"A++","A","L",3661238640665,null,null,null,null,"C6"]
[7638423,"OEnoviaPAC-GS 9 TR/B200GSHL",null,{"$f":"SUM(D404+D408+D409)","v":9732},null,"A++","A","L",3661238640672,null,null,null,null,"C6"]
[7638424,"OEnoviaPAC-GS 9 TR/V200GSHL",null,{"$f":"SUM(D404+D408+D410)","v":9622},null,"A++","A","L",3661238640689,null,null,null,null,"C6"]
[7638425,"OEnoviaPAC-GS 12 MR/B200GSHL",null,{"$f":"SUM(D405+D408+D409)","v":10302},null,"A++","A","L",3661238640696,null,null,null,null,"C6"]
[7638426,"OEnoviaPAC-GS 12 MR/V200GSHL",null,{"$f":"SUM(D405+D408+D410)","v":10192},null,"A++","A","L",3661238640702,null,null,null,null,"C6"]
[7638427,"OEnoviaPAC-GS 12 TR/B200GSHL",null,{"$f":"SUM(D406+D408+D409)","v":10302},null,"A++","A","L",3661238640719,null,null,null,null,"C6"]
[7638428,"OEnoviaPAC-GS 12 TR/V200GSHL",null,{"$f":"SUM(D406+D408+D410)","v":10192},null,"A++","A","L",3661238640726,null,null,null,null,"C6"]
[7638429,"OEnoviaPAC-GS 15 TR/B200GSHL",null,{"$f":"SUM(D407+D408+D409)","v":10893},null,"A++","A","L",3661238640733,null,null,null,null,"C6"]
[7638430,"OEnoviaPAC-GS 15 TR/V200GSHL",null,{"$f":"SUM(D407+D408+D410)","v":10783},null,"A++","A","L",3661238640740,null,null,null,null,"C6"]
[]
["COMPOSANTS"]
[7617624,"OEnoviaPAC-GS 5 MR","HZ38",6725,6,"A++","/","/",3661238603561,149.69999999999999,970,675,1135,"C6"]
[7617626,"OEnoviaPAC-GS 5 TR","HZ39",6725,6,"A++","/","/",3661238603578,149.69999999999999,970,675,1135,"C6"]
[7618122,"OEnoviaPAC-GS 9 MR","HZ40",7439,6,"A++","/","/",3661238614437,166,970,675,1135,"C6"]
[7618123,"OEnoviaPAC-GS 9 TR","HZ41",7439,6,"A++","/","/",3661238614444,166,970,675,1135,"C6"]
[7618124,"OEnoviaPAC-GS 12 MR","HZ42",8009,6,"A++","/","/",3661238603585,168,970,675,1135,"C6"]
[7615884,"OEnoviaPAC-GS 12 TR","HZ43",8009,6,"A++","/","/",3661238603592,168,970,675,1135,"C6"]
[7618125,"OEnoviaPAC-GS 15 TR","HZ44",8600,6,"A++","/","/",3661238603608,182.9,970,675,1135,"C6"]
[7607389,"BALLON 200 GSHL","ER601",2028,null,"/","/","/",3661238590311,105,790,675,1330,"C6"]
[7611489,"KIT DE LIAISON PAC-BALLON B200","ER611",265,null,"/","/","/",3661238590618,6,860,670,220,"C6"]
[7611488,"KIT DE LIAISON PAC-BALLON V200","ER610",155,null,"/","/","/",3661238590717,3,510,460,175,"C6"]
[]
["OPTIONS"]
[7616429,"VANNE INVERSION + SONDE ECS GSHP 19 – 27 kW ","HZ17",416,0.17,"/","/","/",3661238600812,4.0999999999999996,410,210,110,"C6"]
[7616680,"KIT APPOINT ELECTRIQUE 9 kW GSHP 05 à 15 kW","HZ20",642,0.42,"/","/","/",3661238639829,4.7,420,280,190,"C6"]
[7616643,"KIT APPOINT ELECTRIQUE 9 kW GSHP 19 - 27 kW","HZ19",693,0.42,"/","/","/",3661238603226,4.8,420,280,190,"C6"]
[7618061,"KIT ECHANGEUR DE BARRAGE GSHP 05 – 09 kW","HZ24",937,null,"/","/","/",3661238603264,16.2,660,220,325,"C6"]
[7618063,"KIT ECHANGEUR DE BARRAGE GSHP 12 – 15 kW","HZ26",1141,null,"/","/","/",3661238603288,19.5,660,220,325,"C6"]
[7618065,"KIT ECHANGEUR DE BARRAGE GSHP 19 – 27 kW","HZ28",1488,null,"/","/","/",3661238603301,25.4,660,220,325,"C6"]
[7622431,"KIT CABLAGE THERMOSTAT DE SECURITE PCBT","HZ29",73,0.01,"/","/","/",3661238614116,0.3,210,150,40,"C6"]
[7622062,"KIT POMPE WILO PARA 25/1-8 pour GSHP 19","HZ63",652,0.17,"/","/","/",3661238613041,5,360,235,285,"C6"]
[7610411,"KIT CIRCUIT PLANCHER CHAUFFANT ","ER604",713,0.17,"/","/","/",3661238600669,5.3,815,415,250,"C6"]
[7620436,"KIT ISOLATION MODE FROID","ER581",179,null,"/","/","/",3661238621572,3.5,615,205,205,"C6"]
[7610412,"KIT CIRCUIT RADIATEUR","ER605",469,0.17,"/","/","/",3661238600645,6.8,815,415,250,"C6"]
[7610667,"KIT DE RACCORDEMENT BALLON TAMPON - GSHP","ER606",194,null,"/","/","/",3661238600652,3.2,860,250,135,"C6"]
[7607396,"COLIS BALLON TAMPON GSHP 200L","ER602",876,null,"/","/","/",3661238600034,85,790,675,1330,"C6"]
[]
["OPTIONS REGULATIONS"]
[100013304,"OPTION V3V ","AD249",155,0.01,"/","/","/",3661238363519,0.4,260,170,130,"C0"]
[100013305,"SONDE SYSTÈME ECS","AD250",45,0.01,"/","/","/",3661238363588,0.13400000000000001,150,210,25,"C0"]
[100013306,"SONDE EXTERIEURE RADIO ","AD251",76,0.08,"/","/","/",3661238363595,0.15,150,210,40,"C0"]
[100013307,"MODULE CHAUDIERE RADIO (EMETTEUR)","AD252",121,0.08,"/","/","/",3661238363601,0.32,260,160,130,"C0"]
[100018923,"CDE À DIST RADIO CDR 2/CD","AD284",232,0.08,"/","/","/",3661238544932,0.253,175,122,60,"C0"]
[100013477,"COMMANDE A DISTANCE RS 400","AD257",174,0.08,"/","/","/",3661238364257,0.253,175,122,60,"C0"]
[100013472," CDE A DISTANCE RADIO RS 400R     ","AD255",233,0.08,"/","/","/",3661238364233,0.253,175,122,60,"C0"]
[88017851,"CABLE DE LIAISON BUS LG 12 M","AD134",108,0.01,"/","/","/",3661238048850,0.4,350,260,30,"C0"]
[88017017,"SONDE DEPART v3v","AD199",79,0.01,"/","/","/",3661238049185,0.21,150,200,40,"C0"]
[100002803,"COMMANDE A DISTANCE SIMPLIFIEE AD208","AD208",102,0.08,"/","/","/",3661238554931,0.2,120,85,40,"C0"]
[100000030,"COLIS OPTION SONDE ECS","AD212",48,0.01,"/","/","/",3661238011168,0.2,200,150,30,"C0"]
[100020294,"KIT COMPTAGE D'ENERGIE","HK29",186,0.01,"/","/","/",3661238576513,0.34,190,145,124,"C6"]
[100019114,"KIT SONDE HYGRO RAFRAICHISSEMENT","HK27",208,0.01,"/","/","/",3661238569119,0.2,185,130,105,"C0"]
[]
[]
[7625561,"AWHP 4-GMX-M 2024 COMBI HYBRID",null,{"$f":"SUM(D449+D452+D453+D448)","v":5961},null,"A++","A","XL",3661238647121,106.8,null,null,null,"C9"]
[7625562,"AWHP 6-GMX-M 2024 COMBI HYBRID",null,{"$f":"SUM(D448+D450+D452+D453)","v":6048},null,"A++","A","XL",3661238647138,104,null,null,null,"C9"]
[7625563,"AWHP 8-GMX-M 2024 COMBI HYBRID",null,{"$f":"SUM(D451+D448+D452+D453)","v":6784},null,"A++","A","XL",3661238647145,141,null,null,null,"C9"]
[]
["COMPOSANTS"]
[7622151,"GMX-M 2024 COMBI CONDENS HYBRID","EH598",1987,null,"/","/","/",null,27.8,600,400,520,"C9"]
[7603571,"AWHP 4 MR","EH336",1799,5,"/","/","/",3661238581012,48,450,950,690,"C9"]
[7609925,"AWHP 6 MR-2","EH380",1886,5,"/","/","/",3661238589513,45.2,445,950,680,"C9"]
[7609926,"AWHP 8 MR-2","EH381",2622,5,"/","/","/",3661238589520,82.2,460,1090,1100,"C9"]
[7625043,"KIT HYDRAULIQUE + HABILLAGE","EH519",239,null,"/","/","/",3661238618596,7.5,750,450,260,"C9"]
[7627623,"KIT HYBRIDE MURAL","EH568",1936,null,"/","/","/",3661238626492,23.5,404,341,1180,"C9"]
[]
["OPTIONS"]
[100008296,"TERMINAL HORIZONTAL PPS Ø 60/100 MM LG=800 MM","DY871",114,null,"/","/","/",3661238168022,2.8,1200,200,200,"C0"]
["S101688","ADAPTATEUR AIR/FUMEES D80/125","HR68",24,null,"/","/","/",8713809243722,0.2,175,180,130,"C0"]
[100002732,"TERMINAL VERTICAL PPS Ø 80/125 MM NOIR","DY843",152,null,"/","/","/",3661238006621,4.2,1210,270,240,"C0"]
[100004417,"FILTRE 400UM + VANNE D'ISOLEMENT 1''","EH61",103,null,"/","/","/",3661238003415,0.9,175,90,130,"C6"]
[100011222,"SUPPORT FIXATION MURALE & PLOTS ANTIVIBRATILES POUR ROE-II 6 à 10 - AWHP","EH95",159,null,"/","/","/",3661238339927,5.4,820,90,90,"C6"]
[100012532,"BAC DE RECUPERATION CONDENSATS POUR SUPPORT MURAL","EH111",139,null,"/","/","/",3661238361553,2,960,430,80,"C6"]
[100012534,"KIT DE TRACAGE ELECTRIQUE POUR AWHP","EH113",147,null,"/","/","/",3661238361577,0.2,200,200,10,"C6"]
[100012533,"SUPPORT POSE AU SOL AWHP","EH112",44,null,"/","/","/",3661238361560,1.2,450,140,80,"C6"]
[100012535,"LIAISON FRIGORIFIQUE PE 5/8'' 3/8'' - LG 5m","EH114",228,null,"/","/","/",3661238361522,4.5999999999999996,600,600,150,"C6"]
[100012536,"LIAISON FRIGORIFIQUE PE 5/8'' 3/8'' - LG 10m","EH115",407,null,"/","/","/",3661238361539,7.2,600,600,200,"C6"]
[100012537,"LIAISON FRIGORIFIQUE PE 5/8'' 3/8'' - LG 20m","EH116",736,null,"/","/","/",3661238361546,14.3,750,750,230,"C6"]
[100015476,"LIAISON FRIGORIFIQUE PE 1/2\" 1/4\" - LG 10 m","EH142",284,null,"/","/","/",3661238381575,7.9,600,650,150,"C6"]
[100008841,"COLIS BALLON TAMPON 80L","EH85",510,null,"/","/","/",3661238166325,44.5,510,510,920,"C6"]
[100004415,"COLIS BALLON TAMPON 160L","EH60",765,null,"/","/","/",3661238003422,63.2,825,690,1120,"C6"]
[88017904,"THERMOSTAT D'AMBIANCE PROGRAMMABLE (FILAIRE)","AD191",158,0.08,"/","/","/",3661238048836,0.2,130,90,55,"C0"]
[88017010,"THERMOSTAT D'AMBIANCE PROGRAMMABLE (SANS FILS)","AD192",280,0.08,"/","/","/",3661238049178,0.4,175,150,90,"C0"]
[7618227,"KIT VANNE 3 VOIES","EH517",453,0.17,"/","/","/",3661238616240,3.9,404,274,152,"C6"]
[7622273,"CARTE DE REGULATION 2 CIRCUITS","EH527",195,0.01,"/","/","/",3661238618145,0.3,185,130,105,"C6"]
[7624902,"KIT CABLAGE PLANCHER CHAUFFANT DIRECT","HA255",36,0.01,"/","/","/",3661238618176,null,210,140,20,"C6"]
[7626700,"KIT ISOLATION MODE CLIMATISATION","EH566",204,null,"/","/","/",3661238622739,0.5,315,225,120,"C6"]
[7636899,"KIT SILENCIEUX MODULE EXTERIEUR","EH572",59,0.01,"/","/","/",3661238644335,0.2,170,210,20,"C6"]
[]
[]
[7642831,"AWHP 4 MR-GSCR 15 HYBRID V200",null,{"$f":"SUM(D517+D520+D527+D530+D528)","v":7588},null,"A++","A","L",3661238647213,246.7,null,null,null,"C6"]
[7642832,"AWHP 4 MR-GSCR 15 HYBRID B200",null,{"$f":"SUM(D517+D520+D527+D528+D531)","v":7690},null,"A++","A","L",3661238647220,252.8,null,null,null,"C6"]
[7642833,"AWHP 6 MR-GSCR 15 HYBRID V200",null,{"$f":"SUM(D517+D521+D527+D528+D530)","v":7675},null,"A++","A","L",3661238647237,243.9,null,null,null,"C6"]
[7642834,"AWHP 6 MR-GSCR 15 HYBRID B200",null,{"$f":"SUM(D517+D521+D527+D528+D531)","v":7777},null,"A++","A","L",3661238647244,250,null,null,null,"C6"]
[7642835,"AWHP 8 MR-GSCR 15 HYBRID V200",null,{"$f":"SUM(D517+D522+D528+D530)","v":8354},null,"A++","A","L",3661238647251,280.39999999999998,null,null,null,"C6"]
[7642836,"AWHP 8 MR-GSCR 15 HYBRID B200",null,{"$f":"SUM(D517+D522+D528+D531)","v":8456},null,"A++","A","L",3661238647268,286.5,null,null,null,"C6"]
[7642837,"AWHP 11 MR-GSCR 15 HYBRID V200",null,{"$f":"SUM(D517+D523+D529+D530)","v":9595},null,"A++","A","L",3661238647275,324.8,null,null,null,"C6"]
[7642839,"AWHP 11 MR-GSCR 15 HYBRIDE B200",null,{"$f":"SUM(D517+D523+D529+D531)","v":9697},null,"A++","A","L",3661238647282,330.9,null,null,null,"C6"]
[7642840,"AWHP 11 TR-GSCR 15 HYBRID V200",null,{"$f":"SUM(D517+D524+D529+D530)","v":9893},null,"A++","A","L",3661238647299,337.8,null,null,null,"C6"]
[7642841,"AWHP 11 TR-GSCR 15 HYBRID B200",null,{"$f":"SUM(D517+D524+D529+D531)","v":9995},null,"A++","A","L",3661238647305,343.9,null,null,null,"C6"]
[7642842,"AWHP 16 MR-GSCR 15 HYBRID V200",null,{"$f":"SUM(D517+D525+D529+D530)","v":10666},null,"A++","A","L",3661238647312,324.60000000000002,null,null,null,"C6"]
[7642843,"AWHP 16 MR-GSCR 15 HYBRID B200",null,{"$f":"SUM(D517+D525+D529+D531)","v":10768},null,"A++","A","L",3661238647329,330.7,null,null,null,"C6"]
[7642844,"AWHP 16 TR-GSCR 15 HYBRID V200",null,{"$f":"SUM(D517+D526+D529+D530)","v":11082},null,"A++","A","L",3661238647336,336.8,null,null,null,"C6"]
[7642845,"AWHP 16 TR-GSCR 15 HYBRID B200",null,{"$f":"SUM(D517+D526+D529+D531)","v":11184},null,"A++","A","L",3661238647343,342.9,null,null,null,"C6"]
[7642846,"AWHHP 6 MR-GSCR 25 HYBRID V200",null,{"$f":"SUM(D518+D521+D527+D528+D530)","v":7836},null,"A++","A","L",3661238647350,246.9,null,null,null,"C6"]
[7642847,"AWHP 6 MR-GSCR 25 HYBRID B200",null,{"$f":"SUM(D518+D521+D527+D528+D531)","v":7938},null,"A++","A","L",3661238647367,253,null,null,null,"C6"]
[7642848,"AWHP 8 MR-GSCR 25 HYBRID V200",null,{"$f":"SUM(D518+D522+D528+D530)","v":8515},null,"A++","A","L",3661238647374,283.39999999999998,null,null,null,"C6"]
[7642849,"AWHP 8 MR-GSCR 25 HYBRID B200",null,{"$f":"SUM(D518+D522+D528+D531)","v":8617},null,"A++","A","L",3661238647381,289.5,null,null,null,"C6"]
[7642850,"AWHP 11 MR-GSCR 25 HYBRID V200",null,{"$f":"SUM(D518+D523+D529+D530)","v":9756},null,"A++","A","L",3661238647398,327.8,null,null,null,"C6"]
[7642851,"AWHP 11 MR-GSCR 25 HYBRID B200",null,{"$f":"SUM(D518+D523+D529+D531)","v":9858},null,"A++","A","L",3661238647404,333.9,null,null,null,"C6"]
[7642852,"AWHP 11 TR-GSCR 25 HYBRID V200",null,{"$f":"SUM(D518+D524+D529+D530)","v":10054},null,"A++","A","L",3661238647411,340.8,null,null,null,"C6"]
[7642853,"AWHP 11 TR-GSCR 25 HYBRID B200",null,{"$f":"SUM(D518+D524+D529+D531)","v":10156},null,"A++","A","L",3661238647428,346.9,null,null,null,"C6"]
[7642854,"AWHP 16 MR-GSCR 25 HYBRID V200",null,{"$f":"SUM(D518+D525+D529+D530)","v":10827},null,"A++","A","L",3661238647435,327.60000000000002,null,null,null,"C6"]
[7642855,"AWHP 16 MR-GSCR 25 HYBRID B200",null,{"$f":"SUM(D518+D525+D529+D531)","v":10929},null,"A++","A","L",3661238647442,333.7,null,null,null,"C6"]
[7642856,"AWHP 16 TR-GSCR 25 HYBRID V200",null,{"$f":"SUM(D518+D526+D529+D530)","v":11243},null,"A++","A","L",3661238647459,339.8,null,null,null,"C6"]
[7642857,"AWHP 16 TR-GSCR 25 HYBRID B200",null,{"$f":"SUM(D518+D526+D529+D531)","v":11345},null,"A++","A","L",3661238647466,345.9,null,null,null,"C6"]
[7642858,"AWHP 8 MR-GSCR 35 HYBRID V200",null,{"$f":"SUM(D519+D522+D528+D530)","v":8825},null,"A++","A","L",3661238647473,283.39999999999998,null,null,null,"C6"]
[7642859,"AWHP 8 MR-GSCR 35 HYBRID B200",null,{"$f":"SUM(D519+D522+D528+D531)","v":8927},null,"A++","A","L",3661238647480,289.5,null,null,null,"C6"]
[7642860,"AWHP 11 MR-GSCR 35 HYBRID V200",null,{"$f":"SUM(D519+D523+D529+D530)","v":10066},null,"A++","A","L",3661238647497,327.8,null,null,null,"C6"]
[7642861,"AWHP 11 MR-GSCR 35 HYBRID B200",null,{"$f":"SUM(D519+D523+D529+D531)","v":10168},null,"A++","A","L",3661238647503,333.9,null,null,null,"C6"]
[7642862,"AWHP 11 TR-GSCR 35 HYBRID V200",null,{"$f":"SUM(D519+D524+D529+D530)","v":10364},null,"A++","A","L",3661238647510,340.8,null,null,null,"C6"]
[7642863,"AWHP 11 TR-GSCR 35 HYBRID B200",null,{"$f":"SUM(D519+D524+D529+D531)","v":10466},null,"A++","A","L",3661238647527,346.9,null,null,null,"C6"]
[7642864,"AWHP 16 MR-GSCR 35 HYBRID V200",null,{"$f":"SUM(D519+D525+D529+D530)","v":11137},null,"A++","A","L",3661238647534,327.60000000000002,null,null,null,"C6"]
[7642865,"AWHP 16 MR-GSCR 35 HYBRID B200",null,{"$f":"SUM(D519+D525+D529+D531)","v":11239},null,"A++","A","L",3661238647541,333.7,null,null,null,"C6"]
[7642866,"AWHP 16 TR-GSCR 35 HYBRID V200",null,{"$f":"SUM(D519+D526+D529+D530)","v":11553},null,"A++","A","L",3661238647558,339.8,null,null,null,"C6"]
[7642867,"AWHP 16 TR-GSCR 35 HYBRID B200",null,{"$f":"SUM(D519+D526+D529+D531)","v":11655},null,"A++","A","L",3661238647565,345.9,null,null,null,"C6"]
[]
["COMPOSANTS"]
[100017756,"GSCR 15","JA21",3174,null,"A","/","/",3661238505971,67,780,680,1070,"C0"]
[100017757,"GSCR 25","JA22",3335,null,"A","/","/",3661238505988,70,780,680,1070,"C0"]
[100017758,"GSCR 35","JA23",3645,null,"A","/","/",3661238505995,70,780,680,1070,"C0"]
[7603571,"AWHP 4 MR","EH336",1799,5,"/","/","/",3661238581012,48,450,950,690,"C9"]
[7609925,"AWHP 6 MR-2","EH380",1886,5,"/","/","/",3661238589513,45.2,445,950,680,"C9"]
[7609926,"AWHP 8 MR-2","EH381",2622,5,"/","/","/",3661238589520,82.2,460,1090,1100,"C9"]
[7609927,"AWHP 11 MR-2","EH382",3456,5,"/","/","/",3661238589537,131,450,1040,1440,"C9"]
[7609928,"AWHP 11 TR-2","EH383",3754,5,"/","/","/",3661238589544,137.6,460,1090,1490,"C9"]
[7609929,"AWHP 16 MR-2","EH384",4527,5,"/","/","/",3661238589551,124.4,460,1090,1490,"C9"]
[7609930,"AWHP 16 TR-2","EH385",4943,5,"/","/","/",3661238589568,136.6,460,1090,1490,"C9"]
[100015480,"RACCORD D'ADAPTATION FRIGO POUR 4 kW ET 6 kW","EH146",57,null,"/","/","/",3661238381612,0.5,150,80,30,"C9"]
[7623217,"BALLON 200 CSL HYBRID 4-8","EH509",2446,null,"/","/","/",3661238621312,130,970,675,1435,"C6"]
[7623229,"BALLON 200 CSL HYBRID 11-16","EH513",2853,null,"/","/","/",3661238621329,132,970,675,1435,"C6"]
[7621386,"KIT DE MONTAGE BALLON VERSION V","EH524",112,null,"/","/","/",3661238618114,1.2,860,250,135,"C6"]
[7621387,"KIT DE MONTAGE BALLON VERSION B","EH525",214,null,"/","/","/",3661238618121,7.3,860,670,220,"C6"]
[]
["OPTIONS FUMISTERIE"]
[100013756,"TERMINAL HORIZONTAL Ø 60/100 MM AVEC COUDE DE VISITE","HR48",183,null,"/","/","/",3661238370883,3.4,1200,200,200,"C0"]
[100011365,"KIT VENTOUSE HOR PPS/ALU Ø 80/125mm","DY882",204,null,"/","/","/",3661238374768,0.3,1210,265,250,"C0"]
[100002732,"TERMINAL VERTICAL PPS Ø 80/125 mm NOIR","DY843",152,null,"/","/","/",3661238006621,4.2,1210,270,240,"C0"]
[]
["OPTIONS"]
[100004417,"FILTRE 400UM + VANNE D'ISOLEMENT 1''","EH61",103,null,"/","/","/",3661238003415,0.9,175,90,130,"C6"]
[100011222,"SUPPORT FIXATION MURALE & PLOTS ANTIVIBRATILES POUR ROE-II 6 à 10 - AWHP","EH95",159,null,"/","/","/",3661238339927,5.4,820,90,90,"C6"]
[100018409,"SUPPORT MURAL AWHP 11à 27 kW","EH250",163,null,"/","/","/",3661238543874,5,820,90,90,"C6"]
[100012532,"BAC DE RECUPERATION CONDENSATS POUR SUPPORT MURAL","EH111",139,null,"/","/","/",3661238361553,2,960,430,80,"C6"]
[100012534,"KIT DE TRACAGE ELECTRIQUE POUR AWHP","EH113",147,null,"/","/","/",3661238361577,0.2,200,200,10,"C6"]
[100012533,"SUPPORT POSE AU SOL AWHP","EH112",44,null,"/","/","/",3661238361560,1.2,450,140,80,"C6"]
[100012535,"LIAISON FRIGORIFIQUE PE 5/8'' 3/8'' - LG 5m","EH114",228,null,"/","/","/",3661238361522,4.5999999999999996,600,600,150,"C6"]
[100012536,"LIAISON FRIGORIFIQUE PE 5/8'' 3/8'' - LG 10m","EH115",407,null,"/","/","/",3661238361539,7.2,600,600,200,"C6"]
[100012537,"LIAISON FRIGORIFIQUE PE 5/8'' 3/8'' - LG 20m","EH116",736,null,"/","/","/",3661238361546,14.3,750,750,230,"C6"]
[100015476,"LIAISON FRIGORIFIQUE PE 1/2\" 1/4\" - LG 10 m","EH142",284,null,"/","/","/",3661238381575,7.9,600,650,150,"C6"]
[100008841,"COLIS BALLON TAMPON 80L","EH85",510,null,"/","/","/",3661238166325,44.5,510,510,920,"C6"]
[100004415,"COLIS BALLON TAMPON 160L","EH60",765,null,"/","/","/",3661238003422,63.2,825,690,1120,"C6"]
[7624902,"KIT CABLAGE PLANCHER CHAUFFANT DIRECT","HA255",36,0.01,"/","/","/",3661238618176,null,210,140,20,"C6"]
[7619010,"KIT VANNE 3 VOIES","EH528",564,0.17,"/","/","/",3661238618152,17.7,750,300,150,"C6"]
[7626737,"KIT ISOLATION MODE CLIMATISATION","EH567",204,null,"/","/","/",3661238624115,null,360,340,180,"C6"]
[100019114,"KIT SONDE HYGRO RAFRAICHISSEMENT","HK27",208,0.01,"/","/","/",3661238569119,0.2,185,130,105,"C0"]
[7636899,"KIT SILENCIEUX MODULE EXTERIEUR","EH572",59,0.01,"/","/","/",3661238644335,0.2,170,210,20,"C6"]
[]
["OPTIONS REGULATION"]
[100013304,"OPTION V3V DIEMATIC iSystem","AD249",155,0.01,"/","/","/",3661238363519,0.4,260,170,130,"C0"]
[100013305,"SONDE SYSTÈME ECS","AD250",45,0.01,"/","/","/",3661238363588,0.1,150,210,25,"C0"]
[100013306,"SONDE EXTERIEURE RADIO DIEMATIC iSystem","AD251",76,0.08,"/","/","/",3661238363595,0.2,150,210,40,"C0"]
[100013307,"MODULE CHAUDIERE RADIO DIEMATIC iSystem","AD252",121,0.08,"/","/","/",3661238363601,0.3,260,160,130,"C0"]
[100018923,"COMMANDE A DISTANCE RADIO CDR iSystem","AD284",232,0.08,"/","/","/",3661238544932,0.3,175,122,60,"C0"]
[100013477,"COMMANDE A DISTANCE RS 400","AD257",174,0.08,"/","/","/",3661238364257,null,175,122,60,"C0"]
[100013472,"CDE A DISTANCE RADIO RS 400R     ","AD255",233,0.08,"/","/","/",3661238364233,0.3,175,122,60,"C0"]
[88017017,"SONDE DEPART V3V","AD199",79,0.01,"/","/","/",3661238049185,0.2,150,200,40,"C0"]
[100002803,"COMMANDE A DISTANCE SIMPLIFIEE AD208","AD208",102,0.08,"/","/","/",3661238554931,0.1,120,85,40,"C0"]
[]
[]
[null,"Avec chaudière fioul basse température"]
[7642876,"AWHP 4MR-FSBR 22P HYBRID V200",null,{"$f":"D590+D594+D595+D600+D601+D603","v":8556},5," A++","A","L",3661238644717,null,null,null,null,"C6"]
[7642878,"AWHP 6MR-FSBR 22P HYBRID V200",null,{"$f":"D590+D594+D596+D600+D601+D603","v":8643},5," A++","A","L",3661238644731,null,null,null,null,"C6"]
[7642881,"AWHP 8MR-FSBR 22P HYBRID V200",null,{"$f":"D590+D594+D597+D601+D603","v":9322},5," A++","A","L",3661238644755,null,null,null,null,"C6"]
[7642883,"AWHP 11MR-FSBR 22P HYBRID V200",null,{"$f":"D590+D594+D598+D602+D603","v":10614},5," A++","A","L",3661238644779,null,null,null,null,"C6"]
[7642885,"AWHP 11TR-FSBR 22P HYBRID V200",null,{"$f":"D590+D594+D599+D602+D603","v":10912},5," A++","A","L",3661238644793,null,null,null,null,"C6"]
[7642891,"AWHP 8MR-FSBR 29P HYBRID V200",null,{"$f":"D591+D594+D597+D601+D603","v":9471},5," A++","A","L",3661238644854,null,null,null,null,"C6"]
[7642893,"AWHP 11MR-FSBR 29P HYBRID V200",null,{"$f":"D591+D594+D598+D602+D603","v":10763},5," A++","A","L",3661238644878,null,null,null,null,"C6"]
[7642895,"AWHP 11TR-FSBR 29P HYBRID V200",null,{"$f":"D591+D594+D599+D602+D603","v":11061},5," A++","A","L",3661238644892,null,null,null,null,"C6"]
[]
[null,"Avec chaudière fioul basse température ventouse"]
[7642903,"AWHP 4MR-FSBR 22PF HYBRID V200",null,{"$f":"D592+D594+D595+D600+D601+D603","v":8738},5," A++","A","L",3661238644953,null,null,null,null,"C6"]
[7642906,"AWHP 6MR-FSBR 22PF HYBRID V200",null,{"$f":"D592+D594+D596+D600+D601+D603","v":8825},5," A++","A","L",3661238644977,null,null,null,null,"C6"]
[7642908,"AWHP 8MR-FSBR 22PF HYBRID V200",null,{"$f":"D592+D594+D597+D601+D603","v":9504},5," A++","A","L",3661238644991,null,null,null,null,"C6"]
[7642910,"AWHP 11MR-FSBR 22PF HYBRID V200",null,{"$f":"D592+D594+D598+D602+D603","v":10796},5," A++","A","L",3661238645011,null,null,null,null,"C6"]
[7642912,"AWHP 11TR-FSBR 22PF HYBRID V200",null,{"$f":"D592+D594+D599+D602+D603","v":11094},5," A++","A","L",3661238645035,null,null,null,null,"C6"]
[7642918,"AWHP 8MR-FSBR 29PF HYBRID V200",null,{"$f":"D593+D594+D597+D601+$F603","v":9540},5," A++","A","L",3661238645097,null,null,null,null,"C6"]
[7642920,"AWHP 11MR-FSBR 29PF HYBRID V200",null,{"$f":"D593+D594+D598+D602+D603","v":10944},5," A++","A","L",3661238645110,null,null,null,null,"C6"]
[7642922,"AWHP 11TR-FSBR 29PF HYBRID V200",null,{"$f":"D593+D594+D599+D602+D603","v":11242},5," A++","A","L",3661238645127,null,null,null,null,"C6"]
[]
["COMPOSANTS"]
[7624149,"FSB. 22  ","MY125",3163,null,null,null,null,3661238616158,204,1220,750,1050,"D6"]
[7624151,"FSB. 29  ","MY135",3312,null,null,null,null,3661238616189,232,1220,750,1050,"D6"]
[7627332,"FSB. 22 FF","MY122",3345,null,null,null,null,3661238630222,214,1220,750,1050,"D6"]
[7627333,"FSB. 29 FF","MY132",3493,null,null,null,null,3661238630239,242,1220,750,1050,"D6"]
[7616272,"KIT EQUIPEMENT HYDRAULIQUE","MY404",470,null,"/","/","/",3661238603097,15,675,485,180,"D6"]
[7603571,"AWHP 4 MR","EH336",1799,5,"/","/","/",3661238581012,48,450,950,690,"C9"]
[7609925,"AWHP 6 MR-2 ","EH380",1886,5,"/","/","/",3661238589513,45.2,445,950,680,"C9"]
[7609926,"AWHP 8 MR-2 ","EH381",2622,5,null,null,null,3661238589520,82.2,460,1090,1100,"C9"]
[7609927,"AWHP 11 MR-2 ","EH382",3456,5,null,null,null,3661238589537,131,450,1040,1440,"C9"]
[7609928,"AWHP 11 TR-2 ","EH383",3754,5,"/","/","/",3661238589544,137.6,460,1090,1490,"C9"]
[100015480,"RACCORD D'ADAPTATION FRIGO POUR 4 kW ET 6 kW","EH146",57,null,"/","/","/",3661238381612,0.5,150,80,30,"C9"]
[7623188,"BALLON 200 PSL HYBRIDE 4-8","EH500",2955,null,null,null,null,3661238621251,130,970,645,1435,"C9"]
[7623201,"BALLON 200 PSL HYBRIDE 11","EH504",3413,null,null,null,null,3661238621268,132,970,645,1435,"C9"]
[7621386,"KIT DE MONTAGE BALLON VERSION V","EH524",112,null,null,null,null,3661238618114,1.1499999999999999,860,250,134,"C9"]
[7621387,"KIT DE MONTAGE BALLON VERSION B","EH525",214,null,null,null,null,3661238618121,7.3,860,670,220,"C9"]
[]
["OPTIONS"]
[81998533,"TERMINAL HORIZONTAL STANDARD","DB90",227,null,"/","/","/",3661238001329,2.9,1015,150,145,"C0"]
[81998534,"TERMINAL VERTICAL NOIR","DB91",202,null,"/","/","/",3661238001312,4.9000000000000004,1150,260,270,"C0"]
[81998539,"COUDE A 90 °","DB96",112,null,"/","/","/",3661238001268,0.9,325,240,150,"C0"]
[100004417,"FILTRE 400UM + VANNE D'ISOLEMENT PAC ROE 6-10 ET ROE+","EH61",103,null,"/","/","/",3661238003415,0.9,175,90,130,"C6"]
[100011222,"SUPPORT MURALE & PLOTS ANTIVIBRATILES POUR  ROE-II AWHP 6-8","EH95",159,null,"/","/","/",3661238339927,5.4,820,90,90,"C6"]
[100018409,"SUPPORT MURAL AWHP 11à 27 kW","EH250",163,null,"/","/","/",3661238543874,5,820,90,90,"C6"]
[100012532,"BAC DE RECUPERATION CONDENSATS POUR SUPPORT MURAL","EH111",139,null,"/","/","/",3661238361553,2,960,430,80,"C6"]
[100012534,"CORDON CHAUFFANT ELECTRIQUE","EH113",147,null,"/","/","/",3661238361577,0.2,200,200,10,"C6"]
[100012533,"SUPPORT POSE AU SOL AWHP","EH112",44,null,"/","/","/",3661238361560,1.2,450,140,80,"C6"]
[100015476,"LIAISON FRIGORIFIQUE PE 1/2\" 1/4\" - LG 10 m","EH142",228,null,"/","/","/",3661238381575,7.9,600,650,150,"C6"]
[100012535,"LIAISON FRIGORIFIQUE PE 5/8'' 3/8'' - LG 5m","EH114",228,null,"/","/","/",3661238361522,4.5999999999999996,600,600,150,"C6"]
[100012536,"LIAISON FRIGORIFIQUE PE 5/8'' 3/8'' - LG 10m","EH115",407,null,"/","/","/",3661238361539,7.2,600,600,200,"C6"]
[100012537,"LIAISON FRIGORIFIQUE PE 5/8'' 3/8'' - LG 20m","EH116",736,null,"/","/","/",3661238361546,14.3,750,750,230,"C6"]
[100008841,"BALLON TAMPON 80L B 80 T","EH85",510,null,"/","/","/",3661238166325,44.5,510,510,920,"C6"]
[100004415,"BALLON TAMPON 160L B 150 T","EH60",765,null,"/","/","/",3661238003422,63.2,825,690,1120,"C6"]
[88017904,"THERMOSTAT AMBIANCE PROGRAMMABLE (FILAIRE)","AD191",158,0.08,"/","/","/",3661238048836,0.2,130,90,55,"C0"]
[88017010,"THERMOSTAT D'AMBIANCE PROGRAMMABLE (SANS FILS)","AD192",280,0.08,"/","/","/",3661238049178,0.4,175,150,90,"C0"]
[7624902,"KIT CABLAGE PLANCHER CHAUFFANT DIRECT","HA255",36,0.01,"/","/","/",3661238618176,null,210,140,20,"C6"]
[7619010,"KIT VANNE 3 VOIES","EH528",564,0.17,"/","/","/",3661238618152,17.7,750,300,150,"C6"]
[7622273,"CARTE DE REGULATION 2 CIRCUITS","EH527",195,0.01,"/","/","/",3661238618145,0.3,185,130,105,"C6"]
[7626737,"KIT ISOLATION MODE FROID","EH 567",204,null,"/","/","/",3661238624115,null,360,340,180,"C0"]
[100019114,"KIT DETECTEUR DE CONDENSATION","HK27",208,0.01,"/","/","/",3661238569119,0.2,185,130,105,"C0"]
[7636899,"KIT SILENCIEUX MODULE EXTERIEUR","EH 572",59,0.01,"/","/","/",3661238644335,0.2,170,210,20,"C0"]
[]
[null,"Avec chaudière fioul à condensation"]
[7642928,"AWHP 4MR-FSCR 19P HYBRID V200",null,{"$f":"D660+D663+D665+D670+D671+D673","v":9199},5," A++"," A","L",3661238645189,null,null,null,null,"C6"]
[7642930,"AWHP 6MR-FSCR 19P HYBRID V200",null,{"$f":"D660+D663+D666+D670+D671+D673","v":9286},5," A++"," A","L",3661238645202,null,null,null,null,"C6"]
[7642932,"AWHP 8MR-FSCR 19P HYBRID V200",null,{"$f":"D660+D663+D667+D671+D673","v":9965},5," A++"," A","L",3661238645226,null,null,null,null,"C6"]
[7642934,"AWHP 11MR-FSCR 19P HYBRID V200",null,{"$f":"D660+D663+D668+D672+D673","v":11257},5," A++"," A","L",3661238645240,null,null,null,null,"C6"]
[7642936,"AWHP 11TR-FSCR 19P HYBRID V200",null,{"$f":"D660+D663+D669+D672+D673","v":11555},5," A++"," A","L",3661238645264,null,null,null,null,"C6"]
[7642942,"AWHP 6MR-FSCR 24P HYBRID V200",null,{"$f":"D661+D663+D666+D670+D671+D673","v":9484},5," A++"," A","L",3661238645325,null,null,null,null,"C6"]
[7642944,"AWHP 8MR-FSCR 24P HYBRID V200",null,{"$f":"D661+D663+D667+D671+D673","v":10163},5," A++"," A","L",3661238645349,null,null,null,null,"C6"]
[7642946,"AWHP 11MR-FSCR 24P HYBRID V200",null,{"$f":"D661+D663+D668+D672+D673","v":11455},5," A++"," A","L",3661238645363,null,null,null,null,"C6"]
[7642948,"AWHP 11TR-FSCR 24P HYBRID V200",null,{"$f":"D661+D663+D669+D672+D673","v":11753},5," A++"," A","L",3661238645387,null,null,null,null,"C6"]
[7642954,"AWHP 8MR-FSCR 32P HYBRID V200",null,{"$f":"D662+D663+D667+D671+D673","v":10508},5," A++"," A","L",3661238645448,null,null,null,null,"C6"]
[7642956,"AWHP 11MR-FSCR 32P HYBRID V200",null,{"$f":"D662+D663+D668+D672+D673","v":11800},5," A++"," A","L",3661238645462,null,null,null,null,"C6"]
[7642958,"AWHP 11TR-FSCR 32P HYBRID V200",null,{"$f":"D662+D663+D669+D672+D673","v":12098},5," A++"," A","L",3661238645486,null,null,null,null,"C6"]
[]
[null,"Avec chaudière fioul à condensation ventouse"]
[7642964,"AWHP 4MR-FSCR 19PF HYBRID V200",null,{"$f":"D660+D663+D664+D665+D670+D671+D673","v":9298},5," A++"," A","L",3661238645547,null,null,null,null,"C6"]
[7642966,"AWHP 6MR-FSCR 19PF HYBRID V200",null,{"$f":"D660+D663+D664+D666+D670+D671+D673","v":9385},5," A++"," A","L",3661238645561,null,null,null,null,"C6"]
[7642968,"AWHP 8MR-FSCR 19PF HYBRID V200",null,{"$f":"D660+D663+D664+D667+D671+D673","v":10064},5," A++"," A","L",3661238645585,null,null,null,null,"C6"]
[7642970,"AWHP 11MR-FSCR 19PF HYBRID V200",null,{"$f":"D660+D663+D664+D668+D672+D673","v":11356},5," A++"," A","L",3661238645615,null,null,null,null,"C6"]
[7642972,"AWHP 11TR-FSCR 19PF HYBRID V200",null,{"$f":"D660+D663+D664+D669+D672+D673","v":11654},5," A++"," A","L",3661238645639,null,null,null,null,"C6"]
[7642979,"AWHP 6MR-FSCR 24PF HYBRID V200",null,{"$f":"D661+D663+D664+D666+D670+D671+D673","v":9583},5," A++"," A","L",3661238645691,null,null,null,null,"C6"]
[7642981,"AWHP 8MR-FSCR 24PF HYBRID V200",null,{"$f":"D661+D663+D664+D667+D671+D673","v":10262},5," A++"," A","L",3661238645714,null,null,null,null,"C6"]
[7642983,"AWHP 11MR-FSCR 24PF HYBRID V200",null,{"$f":"D661+D663+D664+D668+D672+D673","v":11554},5," A++"," A","L",3661238645738,null,null,null,null,"C6"]
[7642985,"AWHP 11TR-FSCR 24PF HYBRID V200",null,{"$f":"D661+D663+D664+D669+D672+D673","v":11852},5," A++"," A","L",3661238645752,null,null,null,null,"C6"]
[7642991,"AWHP 8MR-FSCR 32PF HYBRID V200",null,{"$f":"D662+D663+D664+D667+D671+D673","v":10607},5," A++"," A","L",3661238645813,null,null,null,null,"C6"]
[7642993,"AWHP 11MR-FSCR 32PF HYBRID V200",null,{"$f":"D662+D663+D664+D668+D672+D673","v":11899},5," A++"," A","L",3661238645837,null,null,null,null,"C6"]
[7642995,"AWHP 11TR-FSCR 32PF HYBRID V200",null,{"$f":"D662+D663+D664+D669+D672+D673","v":12197},5," A++"," A","L",3661238645851,null,null,null,null,"C6"]
[]
["COMPOSANTS"]
[7624096,"FSC. 19","MY103",3806,null,null,null,null,3661238617315,209,1220,750,1050,"D6"]
[7624118,"FSC. 24","MY108",4004,null,null,null,null,3661238617322,237,1220,750,1050,"D6"]
[7624125,"FSC. 32","MY113",4349,null,null,null,null,3661238617339,265,1220,750,1050,"D6"]
[7616272,"KIT EQUIPEMENT HYDRAULIQUE","MY404",470,null,"/","/","/",3661238603097,15,675,485,180,"D6"]
[7605520,"KIT FLUX FORCE FSC.","MY405",99,null,null,null,null,3661238627048,2,510,460,175,"D6"]
[7603571,"AWHP 4 MR","EH336",1799,5,"/","/","/",3661238581012,48,450,950,690,"C9"]
[7609925,"AWHP 6 MR-2 ","EH380",1886,5,"/","/","/",3661238589513,45.2,445,950,680,"C9"]
[7609926,"AWHP 8 MR-2 ","EH381",2622,5,null,null,null,3661238589520,82.2,460,1090,1100,"C9"]
[7609927,"AWHP 11 MR-2 ","EH382",3456,5,null,null,null,3661238589537,131,450,1040,1440,"C9"]
[7609928,"AWHP 11 TR-2 ","EH383",3754,5,"/","/","/",3661238589544,137.6,460,1090,1490,"C9"]
[100015480,"RACCORD D'ADAPTATION FRIGO POUR 4 kW ET 6 kW","EH146",57,null,"/","/","/",3661238381612,0.5,150,80,30,"C9"]
[7623188,"BALLON 200 PSL HYBRIDE 4-8","EH500",2955,null,null,null,null,3661238621251,130,970,675,1435,"C9"]
[7623201,"BALLON 200 PSL HYBRIDE 11","EH504",3413,null,null,null,null,3661238621268,132,970,675,1435,"C9"]
[7621386,"KIT DE MONTAGE BALLON VERSION V","EH524",112,null,null,null,null,3661238618114,1.1499999999999999,860,250,135,"C9"]
[7621387,"KIT DE MONTAGE BALLON VERSION B","EH525",214,null,null,null,null,3661238618121,7.3,860,670,220,"C9"]
[]
["OPTIONS"]
[100007638,"TERMINAL HORIZONTAL  Ø 80/125","FM183",96,null,null,null,null,3661238157972,2,1025,170,170,"C0"]
[100002732,"TERMINAL VERTICAL PPS Ø 80/125 MM NOIR","DY843",152,null,"/","/","/",3661238006621,4.2,1210,270,240,"C0"]
[84887531,"COUDE A 87° ALU/PPS  Ø 80/125 MM","DY131",50,null,"/","/","/",3661238013636,0.66,200,200,150,"C0"]
[100004417,"FILTRE 400UM + VANNE D'ISOLEMENT PAC ROE 6-10 ET ROE+","EH61",103,null,"/","/","/",3661238003415,0.9,175,90,130,"C6"]
[100011222,"SUPPORT MURALE & PLOTS ANTIVIBRATILES POUR  ROE-II AWHP 6-8","EH95",159,null,"/","/","/",3661238339927,5.4,820,90,90,"C6"]
[100018409,"SUPPORT MURAL AWHP 11à 27 kW","EH250",163,null,"/","/","/",3661238543874,5,820,90,90,"C6"]
[100012532,"BAC DE RECUPERATION CONDENSATS POUR SUPPORT MURAL","EH111",139,null,"/","/","/",3661238361553,2,960,430,80,"C6"]
[100012534,"CORDON CHAUFFANT ELECTRIQUE","EH113",147,null,"/","/","/",3661238361577,0.2,200,200,10,"C6"]
[100012533,"SUPPORT POSE AU SOL AWHP","EH112",44,null,"/","/","/",3661238361560,1.2,450,140,80,"C6"]
[100012535,"LIAISON FRIGORIFIQUE PE 5/8'' 3/8'' - LG 5m","EH114",228,null,"/","/","/",3661238361522,4.5999999999999996,600,600,150,"C6"]
[100012536,"LIAISON FRIGORIFIQUE PE 5/8'' 3/8'' - LG 10m","EH115",407,null,"/","/","/",3661238361539,7.2,600,600,200,"C6"]
[100012537,"LIAISON FRIGORIFIQUE PE 5/8'' 3/8'' - LG 20m","EH116",736,null,"/","/","/",3661238361546,14.3,750,750,230,"C6"]
[100015476,"LIAISON FRIGORIFIQUE PE 1/2\" 1/4\" - LG 10 m","EH142",228,null,"/","/","/",3661238381575,7.9,600,650,150,"C6"]
[100008841,"BALLON TAMPON 80L B 80 T","EH85",510,null,"/","/","/",3661238166325,44.5,510,510,920,"C6"]
[100004415,"BALLON TAMPON 160L B 150 T","EH60",765,null,"/","/","/",3661238003422,63.2,825,690,1120,"C6"]
[88017904,"THERMOSTAT AMBIANCE PROGRAMMABLE (FILAIRE)","AD191",158,0.08,"/","/","/",3661238048836,0.2,130,90,55,"C0"]
[88017010,"THERMOSTAT D'AMBIANCE PROGRAMMABLE (SANS FILS)","AD192",280,0.08,"/","/","/",3661238049178,0.4,175,150,90,"C0"]
[7624902,"KIT CABLAGE PLANCHER CHAUFFANT DIRECT","HA255",36,0.01,"/","/","/",3661238618176,null,210,140,20,"C6"]
[7619010,"KIT VANNE 3 VOIES","EH528",564,0.17,"/","/","/",3661238618152,17.7,750,300,150,"C6"]
[7622273,"CARTE DE REGULATION 2 CIRCUITS","EH527",195,0.01,"/","/","/",3661238618145,0.3,185,130,105,"C6"]
[7626737,"KIT ISOLATION MODE FROID","EH 567",204,null,"/","/","/",3661238624115,null,360,340,180,"C0"]
[100019114,"KIT DETECTEUR DE CONDENSATION","HK27",208,0.01,"/","/","/",3661238569119,0.2,185,130,105,"C0"]
[7636899,"KIT SILENCIEUX MODULE EXTERIEUR","EH 572",59,0.01,"/","/","/",3661238644335,0.2,170,210,20,"C0"]
[7621387,"KIT DE MONTAGE BALLON VERSION B","EH525",214,null,null,null,null,3661238618121,null,860,670,220,"C0"]
[]
[]
[100017618,"OTWH 300 E","EH196",2263,5,"/","A","XL",3661238497023,127,780,800,2165,"D7"]
[100017619,"OTWH 300 EH","EH197",2686,5,"/","A","XL",3661238497016,143,780,800,2165,"D7"]
[100017617,"OTWH 200 E","EH195",2160,5,"/","A","L",3661238497030,112,780,800,1810,"D7"]
[7603139,"OTWH 200 EV","EH282",3025,5,"/","A","L",3661238583337,96,800,780,1800,"D7"]
[7629072,"OTWH 180 E","EH583",1730,5,"/","A","L",3661238625235,128,730,700,1865,"D7"]
[7629074,"OTWH 230 E","EH584",1829,5,"/","A","XL",3661238625242,144,730,700,2185,"D7"]
[]
[]
[7629721,"OTWH SPLIT FS 200 E",null,2069,null,"/","A","L",3661238626584,null,null,null,null,"D7"]
[7629722,"OTWH SPLIT FS 270 E",null,2170,null,"/","A","XL",3661238626591,null,null,null,null,"D7"]
[]
["COMPOSANTS"]
[7629505,"BALLON OSFS 200 E ","ER688",1478,5,"/","/","/",3661238626560,81.5,900,800,1450,"D7"]
[7619506,"BALLON OSFS 270 E ","ER689",1579,5,"/","/","/",3661238626577,93,900,800,1850,"D7"]
[7626223,"UNITE EXTERIEURE SPLIT TD","EH571",591,null,"/","/","/",3588691513148,39.4,915,385,715,"D7"]
[]
["ACCESSOIRES HYDRAULIQUES"]
[100019424,"KIT DE RACCORDEMENT GROUPE DE SECURITE ","ER208",23,null,"/","/","/",3661238571723,0.5,250,150,100,"C6"]
[]
["OPTIONS"]
[100011222,"SUPPORT MURALE & PLOTS ANTIVIBRATILES POUR  ROE-II AWHP 6-8","EH95",159,null,"/","/","/",3661238339927,5.4,820,90,90,"C6"]
[100012533,"SUPPORT POSE AU SOL AWHP","EH112",44,null,"/","/","/",3661238361560,1.2,450,140,80,"C6"]
[7627741,"TUBE CU ISOLE 1/4 3/8 L5M","EH569",126,null,"/","/","/",3661238626539,3,600,600,100,"C6"]
[7627742,"TUBE CU ISOLE 1/4 3/8 L10M","EH570",219,null,"/","/","/",3661238626546,4.5,600,600,150,"C6"]
[7629725,"TUBE CU ISOLE 1/4 3/8 L20","EH589",323,null,"/","/","/",3661238626553,8,800,800,100,"C6"]
[]
["ACCESSOIRES HYDRAULIQUES"]
[100019424,"KIT DE RACCORDEMENT GROUPE DE SECURITE ","ER208",23,null,"/","/","/",3661238571723,0.5,250,150,100,"C6"]
[]
["OPTIONS"]
[100007557,"COUDE A 90° D160","EH77",61,null,"/","/","/",3661238158498,1.26,420,290,195,"C6"]
[100017621,"MANCHON D'ADAPTATION D200 x D160","EH205",75,null,"/","/","/",3661238497047,0.65,220,205,150,"C6"]
[100017622,"GAINE SOUPLE ISOLEE  Ø 160 LONGUEUR 3 M","EH206",280,null,"/","/","/",3661238497054,5.3,3040,210,210,"C6"]
[100017623,"JEU DE 2 COLLIERS DE FIXATION Ø 160","EH207",31,null,"/","/","/",3661238497061,0.09,125,125,15,"C6"]
[7625587,"GRILLE PRISE ET REJET AIR D160 ","EH558",322,null,"/","/","/",3661238619302,3.1,510,330,245,"C6"]
[100017624,"TRAVERSEE DE MUR Ø 160 AVEC GRILLE","EH208",155,null,"/","/","/",3661238497078,1.6,225,205,295,"C6"]
[100017625,"GRILLE EXTERIEURE Ø 160 EN ALUMINIUM","EH209",222,null,"/","/","/",3661238497085,0.46,215,215,85,"C6"]
[100019964,"CONDUIT PPE Ø 160 mm 2 x 1 m + 2 MANCHONS","EH272",104,null,"/","/","/",3661238571310,1.6,400,310,1020,"C6"]
[100019965,"JEU DE 2  COUDES 90°  PPE  Ø 160 mm + 2 MANCHONS","EH273",76,null,"/","/","/",3661238571327,0.9,440,340,510,"C6"]
[100019966,"JEU DE 2 MANCHONS PPE Ø  160 mm","EH274",23,null,"/","/","/",3661238571334,0.6,250,180,260,"C6"]
[100019967,"TERMINAL VERTICAL NOIR Ø 160 mm","EH275",173,null,"/","/","/",3661238571341,2.84,1030,320,320,"C6"]
[100019968,"EMBASE D'ETANCHEITE TOIT PLAT Ø  160mm","EH276",36,null,"/","/","/",3661238571358,0.88,560,430,260,"C6"]
[100019969,"EMBASE D'ETANCHEITE TOIT PENTE DEN 25 à 45°","EH277",144,null,"/","/","/",3661238571365,3,null,null,null,"C6"]
[7613626,"COUDE CONDUIT","EH434",52,null,"/","/","/",3661238592414,1,565,370,235,"C6"]
[7603277,"BOUCHE EXTRACTION HYGRO CUISINE A PILES 6/40/90 m3/h   (1)","EH291",117,0.08,"/","/","/",3661238581159,0.6,310,220,100,"C6"]
[7603278,"BOUCHE EXTRACTION HYGRO CUISINE A PILES 10/45/120 m3/h   (1)","EH292",117,0.08,"/","/","/",3661238581142,0.6,310,220,100,"C6"]
[7603279,"BOUCHE EXTRACTION HYGRO CUISINE A PILES 10/45/135 m3/h    (1)","EH293",117,0.08,"/","/","/",3661238581135,0.6,310,220,100,"C6"]
[7618711,"BOUCHE EXTRACTION HYGRO CUISINE A PILES 12/45/105 m3/h    (1)","EH487",117,0.08,"/","/","/",3661238604438,0.65,310,220,110,"C6"]
[7603280,"BOUCHE EXTRACTION HYGRO CUISINE A PILES 12/45/135 m3/h    (1)","EH294",117,0.08,"/","/","/",3661238581128,0.6,310,220,100,"C6"]
[7603281,"BOUCHE EXTRACTION HYGRO CUISINE A CORDON 6/40/90 m3/h ","EH295",100,null,"/","/","/",3661238581104,0.5,310,220,100,"C6"]
[7603282,"BOUCHE EXTRACTION HYGRO CUISINE A CORDON 10/45/120 m3/h ","EH296",100,null,"/","/","/",3661238581081,0.5,310,220,100,"C6"]
[7603283,"BOUCHE EXTRACTION HYGRO CUISINE A CORDON 10/45/135 m3/h ","EH297",100,null,"/","/","/",3661238581074,0.5,310,220,100,"C6"]
[7618714,"BOUCHE EXTRACTION HYGRO CUISINE A CORDON 12/45/105 m3/h ","EH488",100,null,"/","/","/",3661238604445,0.5,310,220,110,"C6"]
[7603284,"BOUCHE EXTRACTION HYGRO CUISINE A CORDON 12/45/135 m3/h ","EH298",100,null,"/","/","/",3661238581050,0.5,310,220,100,"C6"]
[7603286,"BOUCHE EXTRACTION HYGRO BAINS A PILES 5/40 m3/h ","EH299",70,0.08,"/","/","/",3661238581043,0.3,310,220,100,"C6"]
[7603287,"BOUCHE EXTRACTION HYGRO BAINS A PILES 5/45 m3/h ","EH300",70,0.08,"/","/","/",3661238581029,0.3,310,220,100,"C6"]
[7603288,"BOUCHE EXTRACTION HYGRO BAINS A PILES 10/40 m3/h ","EH301",70,0.08,"/","/","/",3661238581173,0.3,310,220,100,"C6"]
[7603289,"BOUCHE EXTRACTION HYGRO BAINS A PILES 10/45 m3/h ","EH302",70,0.08,"/","/","/",3661238581319,0.3,310,220,100,"C6"]
[7618715,"BOUCHE EXTRACTION HYGRO MANCHON PLACO 3 GRIFFES - BAINS A PILES 10/45/45 m3/h","EH489",73,0.08,"/","/","/",3661238604452,0.5,310,220,110,"C6"]
[7603290,"BOUCHE EXTRACTION HYGRO WC A PILES 5/30 m3/h   (2)","EH303",76,0.08,"/","/","/",3661238581296,0.4,310,220,100,"C6"]
[7604607,"KIT T3-T4 AVEC BOUCHES EXTRACTION HYGRO POUR CUISINE - BAINS - WC  (2)","EH338",246,0.42,"/","/","/",3661238588127,1.4,405,310,205,"C6"]
[7604608,"KIT T5-T7 AVEC BOUCHES EXTRACTION HYGRO POUR CUISINE - BAINS - WC   (2)","EH339",246,0.42,"/","/","/",3661238588134,1.4,405,310,205,"C6"]
[7603291,"KIT ENTREE D'AIR HYGRO 6/45 m3/h","EH304",34,null,"/","/","/",3661238581289,0.2,435,320,280,"C6"]
[7603296,"MANCHETTE PLASTIQUE D 125 POUR BOUCHE EXTRACTION","EH307",3,null,"/","/","/",3661238581241,0.2,210,200,120,"C6"]
[7603297,"MANCHETTE PLAST D80 BOUCHE EXTR","EH308",3,null,"/","/","/",3661238581234,0.4,450,325,55,"C6"]
[7603298,"CHAPEAU DE TOITURE COULEUR TUILE D 160","EH309",61,null,"/","/","/",3661238581210,2.6,420,255,310,"C6"]
[7608997,"CHAPEAU DE TOITURE COULEUR ARDOISE D 160","EH370",61,null,"/","/","/",3661238588141,2.6,420,255,310,"C6"]
[7603304,"CONDUIT FLEXIBLE ISOLE D 160 LONGUEUR 6 M","EH314",96,null,"/","/","/",3661238581418,5.5,1150,390,390,"C6"]
[7603303,"CONDUIT FLEXIBLE ISOLE D 125 LONGUEUR 6 M","EH313",61,null,"/","/","/",3661238581425,4.2,1150,260,260,"C6"]
[7603302,"CONDUIT FLEXIBLE ISOLE D 80 LONGUEUR 6 M","EH312",50,null,"/","/","/",3661238581340,3,1150,190,190,"C6"]
[7603305,"CAISSON COLLECTEUR  2 PIQUAGES D 125 ET 6 PIQUAGES D 80","EH315",139,null,"/","/","/",3661238581401,1,610,520,165,"C6"]
[7603306,"CONDUIT PPE D125 - LONGUEUR 2 x 1 M + 2 MANCHONS","EH316",74,null,"/","/","/",3661238581395,1.5,1000,400,300,"C6"]
[7603307,"TUBE PPE D125 L=1M ","EH317",74,null,"/","/","/",3661238581388,1.5,1000,400,300,"C6"]
[7603310,"2 COUDES 90° PPE D125 + 2 MANCHONS","EH319",69,null,"/","/","/",3661238581364,1,500,400,300,"C6"]
[7603312,"2 MANCHONS PPE D125","EH321",14,null,"/","/","/",3661238581432,0.5,240,180,250,"C6"]
[7603313,"TE DROIT GALVA 90° A JOINT D 125","EH322",22,null,"/","/","/",3661238581555,7,600,400,400,"C6"]
[7603314,"TE DROIT GALVA 90° A JOINT D 160","EH323",30,null,"/","/","/",3661238581548,50,1203,803,800,"C6"]
[7603315,"TE DROIT GALVA 90° A JOINT D 125 X 80","EH324",26,null,"/","/","/",3661238581531,10,400,400,800,"C6"]
[7603316,"TE DROIT GALVA 90° A JOINT D 160 X 125 ","EH325",25,null,"/","/","/",3661238581524,35,1203,803,800,"C6"]
[7603317,"REDUCTION GALVA  A JOINT  D 125 X 80","EH326",24,null,"/","/","/",3661238581517,13,400,400,400,"C6"]
[7603318,"REDUCTION GALVA  A Ø 160 X 80","EH327",29,null,"/","/","/",3661238581500,12,400,400,400,"C6"]
[7603319,"REDUCTION GALVA  A JOINT D 160 X 125 ","EH328",24,null,"/","/","/",3661238581494,7,400,400,400,"C6"]
[7603320,"MANCHON GALVA D 125","EH329",4,null,"/","/","/",3661238581487,1,250,180,140,"C6"]
[7603321,"MANCHON GALVA D 160","EH330",4,null,"/","/","/",3661238581470,1,300,180,140,"C6"]
[7603322,"JEU DE 10 COLLIERS DE FIXATION Ø 80 à Ø 125","EH331",48,null,"/","/","/",3661238581463,0.6,250,185,155,"C6"]
[7603325,"FILTRE DE RECHANGE ","EH334",34,null,"/","/","/",3661238581562,0.2,330,290,30,"C6"]
[7602875,"ENJOLIVEUR POUR MONTAGE REGULATEUR SUR OTWH 200 EV","EH286",77,null,"/","/","/",3661238587717,0.7,350,320,150,"C6"]
[100019890,"KIT POIGNEES DE PREHENSION","ER239",32,null,"/","/","/",3661238570634,1.2,250,150,100,"C6"]
[null,null,null,null,null,"/","/","/"]
["PREPARATEUR ECS MIXTE POUR PAC"]
[7622063,"PREPARATEUR MIXTE OBEPB 300 POUR PAC","ER616",2007,null,"/","C","XL",3661238613010,125,900,800,1970,"C6"]
["OPTIONS"]
[100009229,"VANNE 3 VOIES D'INVERSION POUR ECS AVEC KIT CABLAGE","EH84",327,null,"/","/","/",3661238337916,4.3499999999999996,410,210,115,"C6"]
[100000030,"COLIS OPTION SONDE ECS","AD212",48,0.01,"/","/","/",3661238011168,0.16,200,150,30,"C0"]
[89757753,"ANODE ACI CORREX UP BALLON > 300 LITRES","AJ39",383,0.01,"/","/","/",3661238046832,0.4,425,100,55,"C0"]
[]
[]
["FAMILLE:","SOLAIRE - OERTLISOL    "]
[]
["SYSTÈME SOLAIRE DB 200"]
[null,"PACKS TOIT"]
[7608050,"PACK TOIT 1 DB 200 H- 2m² CROCHET UNIVERSEL TUILES MECANIQUES","ER500",1122,null,"/","/","/",3661238586970,80,1330,770,1950,"C7"]
[7608051,"PACK TOIT 1 DB 200 H- 2m² SUR TOITURE ARDOISES","ER501",1122,null,"/","/","/",3661238586987,80,1330,770,1950,"C7"]
[7608052,"PACK TOIT 2 DB 200 H- 4m² CROCHET UNIVERSEL TUILES MECANIQUES","ER502",1870,null,"/","/","/",3661238586994,121,1330,770,1950,"C7"]
[7608053,"PACK TOIT 2 DB 200 H- 4m² SUR TOITURE ARDOISES","ER503",1870,null,"/","/","/",3661238587007,121,1330,770,1950,"C7"]
[7608054,"PACK TOIT 3 DB 200 H- 6m² CROCHET UNIVERSEL TUILES MECANIQUES","ER504",2885,null,"/","/","/",3661238587014,160,1330,770,1950,"C7"]
[7608055,"PACK TOIT 3 DB 200 H- 6m² SUR TOITURE ARDOISES","ER505",2885,null,"/","/","/",3661238587021,160,1330,770,1950,"C7"]
[7608062,"PACK TOIT 1 DB 200 H- 2m² MONTAGE HZ SUR TERRASSE ","ER512",1176,null,"/","/","/",3661238586499,80,1330,770,1950,"C7"]
[7608063,"PACK TOIT 2 DB 200 H- 4m² MONTAGE HZ SUR TERRASSE ","ER513",1977,null,"/","/","/",3661238586505,120,1330,770,1950,"C7"]
[7608056,"PACK TOIT 1 DB 200 H- 2m² INTEGRE V 22° TUILE MECANIQUE","ER506",1142,null,"/","/","/",3661238587038,95,1330,770,2200,"C7"]
[7608057,"PACK TOIT 2 DB 200 H- 4m² INTEGRE V 22° TUILE MECANIQUE","ER507",1973,null,"/","/","/",3661238587045,145,1330,770,2200,"C7"]
[7608058,"PACK TOIT 1 DB 200 H- 2m² INTEGRE V 17° TUILE CANAL","ER508",1298,null,"/","/","/",3661238586475,100,1330,770,2200,"C7"]
[7608059,"PACK TOIT 2 DB 200 H- 4m² INTEGRE V 17° TUILE CANAL","ER509",2129,null,"/","/","/",3661238586482,150,1330,770,2200,"C7"]
[7608060,"PACK TOIT 1 DB 200 H- 2m² INTEGRE HZ 17° TUILE CANAL","ER510",1402,null,"/","/","/",3661238586475,115,1330,770,2200,"C7"]
[7608061,"PACK TOIT 2 DB 200 H- 4m² INTEGRE HZ 17° TUILE CANAL","ER511",2337,null,"/","/","/",3661238586482,165,1330,770,2200,"C7"]
[]
[null,"COLIS AU DETAIL"]
[7502520,"CAPTEUR SOLAIRE  DB 200 H","ER540",748,null,"Pas concerné par l'étiquettage",null,null,3661238586338,40,1850,1230,105,"C7"]
[7502514,"KIT RACCORDEMENT HYDRAULIQUE CHAMPS DE CAPTEURS DB 200","ER541",127,null,"/","/","/",3661238586345,0.6,1042,165,60,"C7"]
[7502518,"KIT DE LIAISON HYDRAULIQUE ENTRE 2 CAPTEURS DB 200 H EN V","ER543",48,null,"/","/","/",3661238586369,0.2,282,95,60,"C7"]
[7502516,"KIT RACCORDEMENT DB POUR 2 CAPTEURS DB 200","ER542",150,null,"/","/","/",3661238586352,0.6,1042,165,60,"C7"]
[7217047,"KIT PROFILES A CLIPS (LONG) 1 CAPT 2M2 HOR","ER663",155,null,"/","/","/",3661238630291,4,1945,110,95,"C7"]
[7217044,"KIT PROFILES A CLIPS (COURT) 1 CAPT VERTICAL","ER664",78,null,"/","/","/",3661238630307,2.6,1250,145,80,"C7"]
[7503259,"KIT INTEGRATION BASE V 22°  1 CAPTEUR DB 200 TUILES MECANIQUES","ER549",394,null,"/","/","/",3661238586529,21,150,800,2000,"C7"]
[7503260,"KIT INTEGRATION BASE V 22°  2 CAPTEURS DB 200 TUILES MECANIQUES","ER550",623,null,"/","/","/",3661238586536,35,150,800,2000,"C7"]
[7503267,"KIT EXTENSION INTEGRATION V 22° 1 CAPTEUR DB 200 TUILES MECANIQUES","ER556",290,null,"/","/","/",3661238586598,14,150,800,2000,"C7"]
[7503270,"KIT INTEGRATION BASE V 17°  1 CAPTEUR DB 200 TUILES CANAL","ER559",550,null,"/","/","/",3661238586628,22,150,800,2000,"C7"]
[7503272,"KIT INTEGRATION BASE V 17°  2 CAPTEURS DB 200 TUILES CANAL","ER561",830,null,"/","/","/",3661238586642,37,150,800,2000,"C7"]
[7503274,"KIT EXTENSION INTEGRATION V 17°  1 CAPTEUR DB 200 TUILES CANAL","ER563",332,null,"/","/","/",3661238586666,15,150,800,2000,"C7"]
[7503271,"KIT INTEGRATION BASE HZ 17°  1 CAPTEUR DB 200 TUILES CANAL","ER560",623,null,"/","/","/",3661238586635,22,150,800,2000,"C7"]
[7503273,"KIT INTEGRATION BASE HZ 17°  2 CAPTEURS DB 200 TUILES CANAL","ER562",997,null,"/","/","/",3661238586659,34,150,800,2000,"C7"]
[]
["ACCESSOIRES DE MONTAGE POUR ARDOISES ET TUILES PLATES"]
[7503269,"KIT NOQUETS POUR TUILES PLATES ET ARDOISES","ER558",135,null,"/","/","/",3661238586611,7,150,200,360,"C7"]
[]
["FERRURES D'ANCRAGE POUR MONTAGE SUR TOITURE"]
[89807311,"4 CROCHETS ALU UNIVERSEL POUR TUILES MÉCANIQUES","EG311",96,null,"/","/","/",3661238045903,2.34,365,120,140,"C7"]
[89807312,"6 CROCHETS ALU UNIVERSEL POUR TUILES MÉCANIQUES","EG312",138,null,"/","/","/",3661238045897,3.46,365,115,140,"C7"]
[89807313,"4 FERRURES D'ANCRAGE INOX POUR MONTAGE SUR TUILES MÉCANIQUES","EG313",96,null,"/","/","/",3661238045880,3.37,320,220,135,"C7"]
[89807314,"6 FERRURES D'ANCRAGE INOX POUR MONTAGE SUR TUILES MÉCANIQUES","EG314",138,null,"/","/","/",3661238045873,4.93,325,225,135,"C7"]
[89807315,"4 FERRURES D'ANCRAGE INOX POUR MONTAGE SUR TUILES PLATES","EG315",96,null,"/","/","/",3661238045866,2.4,300,135,95,"C7"]
[89807316,"6 FERRURES D'ANCRAGE INOX POUR MONTAGE SUR TUILES PLATES","EG316",138,null,"/","/","/",3661238045859,3.5,310,140,95,"C7"]
[100015314,"4 FERRURES D'ANCRAGE INOX POUR MONTAGE SUR TUILES CANAL","ER136",95,null,"/","/","/",3661238415539,4,325,260,120,"C7"]
[100015315,"6 FERRURES D'ANCRAGE INOX POUR MONTAGE SUR TUILES CANAL","ER137",138,null,"/","/","/",3661238415546,6.5,410,305,115,"C7"]
[89807317,"4 FERRURES D'ANCRAGE INOX POUR MONTAGE SUR TOIT ETERNIT","EG317",96,null,"/","/","/",3661238045842,3.56,260,215,75,"C7"]
[89807318,"6 FERRURES D'ANCRAGE INOX POUR MONTAGE SUR TOIT ETERNIT","EG318",138,null,"/","/","/",3661238045835,5.3,260,220,75,"C7"]
[89807319,"4 FERRURES D'ANCRAGE INOX POUR MONTAGE SUR TOIT D'ARDOISES","EG319",96,null,"/","/","/",3661238045828,2.21,280,120,80,"C7"]
[89807320,"6 FERRURES D'ANCRAGE INOX POUR MONTAGE SUR TOIT D'ARDOISES","EG320",138,null,"/","/","/",3661238045811,3.3,305,140,95,"C7"]
[89807782,"KIT TIRE-FONDS POUR MONTAGE 2 CAPTEURS","EG94",242,null,"/","/","/",3661238045057,2.8,400,135,175,"C7"]
[89807783,"KIT TIRE-FONDS POUR MONTAGE 3 CAPTEURS","EG95",304,null,"/","/","/",3661238045040,3.6,400,135,175,"C7"]
[]
["SUPPORTS INCLINABLES POUR MONTAGE EN TERRASSE (OU AU SOL)"]
[7217041,"2 SUPPORTS SL HL MONTAGE HORIZONTAL 1 CAPTEUR","ER656",153,null,"/","/","/",3661238630253,5.5,1250,145,80,"C7"]
[7217042,"1 SUPPORT SL HL HORIZONTAL POUR EXTENSION 1 CAPTEUR","ER657",78,null,"/","/","/",3661238630260,3,1250,145,80,"C7"]
[7502583,"2 SUPPORTS SL MONTAGE VERTICAL 1 CAPTEUR","ER547",192,null,"/","/","/",3661238588417,8.1999999999999993,1945,110,95,"C7"]
[7502951,"1 SUPPORT SL VERTICAL POUR EXTENSION 1 CAPTEUR ","ER548",90,null,"/","/","/",3661238586512,4.5,1945,110,95,"C7"]
[]
["FLUIDE CALOPORTEUR"]
[89807794,"FLUIDE CALOPORTEUR TYPE L (-21°C) 20 LITRES. ","EG101",76,null,"/","/","/",3661238045019,21.72,240,290,370,"C7"]
[100017611,"FLUIDE CALOPORTEUR HAUTE PREFORMANCE BIO (-26°C) 20 LITRES","ER316",131,null,"/","/","/",3661238496606,21.53,340,290,370,"C7"]
[89807792,"FLUIDE CALOPORTEUR HAUTE PREFORMANCE TYPE LS (-26°C) 20 LITRES","EG100",151,null,"/","/","/",3661238045033,21.53,340,290,370,"C7"]
[89807710,"CONCENTRE TYPE L, 10 LITRES","EG11",97,null,"/","/","/",3661238045316,10.95,220,190,295,"C7"]
[]
["PRÉPARATEURS SOLAIRES NON ÉQUIPÉS POUR APPOINT EXTERIEUR"]
[7606302,"BALLON OBS 150N ","ER337",829,null,"/","C stockage \nECS","/",3661238585959,null,null,null,null,"C7"]
[]
["Options"]
[7630415,"STATION SOLAIRE DKSC 6-8 MSB","ER711",469,0.17,"/","/","/",3661238631014,7.3,620,240,450,"C7"]
[100020297,"DUO TUBE DN10 ","ER319",353,null,"/","/","/",3661238576612,11,780,770,160,"C7"]
["S102991","KIT SOLAIRE AVEC MITIGEUR DIAM 15","HR84",219,null,"/","/","/",8713809259983,1.3,145,140,120,"C7"]
[7603940,"KIT CONNECTION SOLAIRE ","ER417",160,0.01,"/","/","/",3661238599376,0.4,185,130,105,"C7"]
[100020290,"KIT TUBULURES COURTES POUR MONTAGE DKS 6 MSB SUR BSL 150N","ER286",107,null,"/","/","/",3661238576384,3,280,280,250,"C7"]
[100019427,"VASE D'EXPANSION  18 L","EG117",95,null,"/","/","/",3661238563025,4.2,400,285,290,"C7"]
[7630422,"REGULATION OETROSOL-PLUS","ER709",255,0.08,"/","/","/",3661238631045,0.69,227,194,85,"C7"]
[7630421,"REGULATION OETROSOL-AEL","ER708",285,0.08,"/","/","/",3661238631038,0.88,290,205,92,"C7"]
[100019425,"MITIGEUR THERMOSTATIQUE","EC60",137,null,"/","/","/",3661238563018,0.65,125,105,90,"C7"]
[100019322,"KIT DE RACCORDEMENT EAU FROIDE","ER404",110,null,"/","/","/",3661238553408,2.2999999999999998,870,260,150,"C7"]
[]
["PRÉPARATEURS SOLAIRES DOUBLE-SERPENTIN NON ÉQUIPÉS OBS"]
[100019529,"PREPARATEUR SOLAIRE OBS 200 N","ER424",883,null,"/","C stockage \nECS","/",3661238564428,110,900,800,1600,"C7"]
[100019522,"PREPARATEUR SOLAIRE OBS 300 N","ER425",894,null,"/","C stockage \nECS","/",3661238564459,121,900,800,1960,"C7"]
[100019526,"PREPARATEUR SOLAIRE OBS 400 N","ER426",1917,null,"/","C stockage \nECS","/",3661238564329,155,900,850,1795,"C7"]
[100019068,"PREPARATEUR SOLAIRE OBS 500 N","ER341",2237,null,"/","C stockage \nECS","/",3661238548527,177,890,850,1950,"C7"]
[]
["PRÉPARATEURS ELECTRO-SOLAIRES BASICSUN ÉQUIPÉS OBES"]
[100019143,"BALLON OBES 200","ER375",1571,3.33,"/","C","XL",3661238551268,110,1200,850,1640,"C7"]
[100019144,"BALLON OBES 300","ER376",1678,3.33,"/","C","XL",3661238551275,126,1200,850,2020,"C7"]
[100019145,"BALLON OBES 400","ER377",2637,3.33,"/","C","XL",3661238551282,166,1200,850,1794,"C7"]
[]
["PRÉPARATEURS SOLAIRES  BASICSUN DOUBLE-SERPENTIN ÉQUIPÉS OBS"]
[100019137,"BALLON OBS 200","ER362",1571,null,"/","C stockage \nECS","/",3661238551206,119,1200,850,1650,"C7"]
[100019138,"BALLON OBS 300","ER363",1678,null,"/","C stockage \nECS","/",3661238551213,136,1200,850,2020,"C7"]
[100019139,"BALLON OBS 400","ER364",2637,null,"/","C stockage \nECS","/",3661238551220,193,1200,850,1794,"C7"]
[]
["OPTIONS BALLONS SOLAIRES OBS / OBES / OBS … N"]
[null,"POUR PREPARATEURS SOLAIRES"]
[100019427,"VASE D'EXPANSION  18 L","EG117",95,null,"/","/","/",3661238563025,4.22,400,285,290,"C7"]
[100019428,"VASE D'EXPANSION  25 L","EG118",110,null,"/","/","/",3661238563032,4.5999999999999996,435,315,315,"C7"]
[89807794,"FLUIDE CALOPORTEUR \"L\" 20L. MELANGE 40/60 ","EG101",76,null,"/","/","/",3661238045019,21.72,240,290,370,"C7"]
[null,"POUR PREPARATEURS SOLAIRES BASICSUN OBS … N"]
[100019163,"R. ELECTRIQUE 1,5 kW AVEC SONDE","ER392",220,null,"/","/","/",3661238551299,1.2,660,105,105,"C7"]
[100019165,"R. ELECTRIQUE 3 kW AVEC SONDE","ER394",220,null,"/","/","/",3661238551312,1.3,770,105,105,"C7"]
[100019166,"R. ELECTRIQUE 1,5 kW THERMOSTATIQUE","ER395",274,null,"/","/","/",3661238549319,1.3,665,150,125,"C7"]
[100019167,"R. ELECTRIQUE 2,3 kW THERMOSTATIQUE","ER396",274,null,"/","/","/",3661238549326,1.8,650,140,115,"C7"]
[100019168,"R. ELECTRIQUE 3 kW avec thermostat","ER397",274,null,"/","/","/",3661238549333,1.45,770,105,105,"C7"]
[100019322,"KIT DE RACCORDEMENT EAU FROIDE","ER404",110,null,"/","/","/",3661238553408,2.2999999999999998,870,260,150,"C7"]
[7630415,"STATION SOLAIRE DKSC 6-8 MSB","ER711",469,0.17,"/","/","/",3661238631014,7.3,620,240,450,"C7"]
[100019423,"KIT TUBULURES pour DKS 6-8 sur OBS…N","ER414",131,null,"/","/","/",3661238562912,5,470,310,290,"C7"]
[7630421,"REGULATION OETROSOL-AEL","ER708",285,0.08,"/","/","/",3661238631038,0.88,290,205,92,"C7"]
[100019427,"VASE D'EXPANSION 18 L","EG117",95,null,"/","/","/",3661238563025,4.22,400,285,290,"C7"]
[100019425,"MITIGEUR THERMOSTATIQUE MMF1\" ","EC60",137,null,"/","/","/",3661238563018,0.65,125,105,90,"C7"]
[]
["OPTIONS BALLONS SOLAIRES"]
[null,"POUR PREPARATEURS SOLAIRES BASICSUN"]
[100010652,"KIT OECOPROTEC PROTECTION ACI SUR OETRONIC","EC431",121,null,"/","/","/",3661238364745,0.49,255,170,120,"C7"]
[100007832,"REGULATION POMPE DE CHARGE SLA 2","EC320",204,0.08,"/","/","/",3661238101494,0.66,225,195,85,"C0"]
[89807767,"MITIGEUR THERMOSTATIQUE 1\"","EG78",133,null,"/","/","/",3661238045149,0.65,125,105,90,"C7"]
[]
[null,"POUR PREPARATEURS SOLAIRES BASICSUN OBESL 200-300"]
[89807777,"RESISTANCE ELECTRIQUE 3,0 kW MULTI STEATITE DN 82  ","EG88",247,null,"/","/","/",3661238045071,4,800,195,200,"C7"]
[89757753,"ANODE A COURANT IMPOSE","AJ39",383,0.01,"/","/","/",3661238046832,0.4,425,100,55,"C0"]
[]
[null,"POUR PREPARATEURS SOLAIRES BASICSUN OBESL 400-500"]
[100007799,"RESISTANCE ELECTRIQUE 4,5 kW MULTI BLINDEE DN 117  ","EC413",657,null,"/","/","/",3661238156852,3.54,660,215,215,"C0"]
[89608920,"ANODE ACI CORREX UP BALLON > 300 LITRES","AM7",521,0.01,"/","/","/",3661238047440,0.44,425,100,55,"C0"]
[]
["OPTIONS BASICSUN"]
["ACCESSOIRES HYDRAULIQUES ET REGULATIONS DES SYSTEMES SOLAIRES BASICSUN"]
[7630422,"REGULATION OETROSOL-PLUS","ER709",255,0.08,"/","/","/",3661238631045,0.69,227,194,85,"C7"]
[100007832,"RÉGULATION POMPE DE CHARGE SLA 2","EC320",204,0.08,"/","/","/",3661238101494,0.66,225,195,85,"C0"]
[89804803,"VANNE 3 VOIES 3/4\" POUR 2 CIRCUITS","EC164",232,null,"/","/","/",3661238046528,1.05,205,125,90,"C7"]
[89804816,"BOITIER PARA FOUDRE POUR SONDE PANNEAUX SOLAIRES","EC176",39,null,"/","/","/",3661238046450,0.11,220,165,40,"C7"]
[100003690,"SONDE A APPLIQUE PT1000","EC171",61,0.01,"/","/","/",3661238005303,0.1,180,140,30,"C0"]
[100004651,"SONDE D'IMMERSION FK PT1000 2,5 m","EC173",61,0.01,"/","/","/",3661238002418,0.15,220,150,25,"C0"]
[100008011,"SONDE CAPTEUR  PT1000 ","EC155",57,0.01,"/","/","/",3661238101197,0.1,180,120,20,"C7"]
[100004652,"DEBIMETRE VOLUMIQUE V40 ","EC174",406,null,"/","/","/",3661238002401,1.5,240,160,110,"C7"]
[100014590,"RÉGULATION COMPTEUR D'ENERGIE WMZ 13530350 ","ER131",289,0.08,"/","/","/",3661238376014,0.6,230,195,80,"C7"]
[]
[]
["INSTALLATIONS SOLAIRES CESI COMPLETES POWERSUN SUR TOITURE"]
[100008119,"CESI POWERSUN OERTLISOL OB3S 250-4 st SUR TOITURE ","EC566",5826,3.33,"Système avec chaudière\n GMR 1000 Condens","A","XL",null,333,1200,1200,2250,"C7"]
[]
["INSTALLATIONS SOLAIRES CESI COMPLETES POWERSUN EN INTEGRATION DE TOITURE"]
[100008131,"CESI POWERSUN OERTLISOL OB3S 250-4 it INTEGRATION TOITURE ","EC568",6705,3.33,"Système avec chaudière\n GMR 1000 Condens","A","XL",null,393.5,1200,1200,2250,"C7"]
[]
[]
[100019332,"CAPTEUR SOLAIRE D230","ER405",764,null,"/","/","/",3661238554818,43.8,2265,1230,105,"C7"]
[]
["ACCESSOIRES DE RACCORDEMENT HYDRAULIQUE"]
[100019333,"KIT RACCORDEMENT HYDRAULIQUE CHAMPS DE CAPTEURS D230","ER406",131,null,"/","/","/",3661238554825,0.6,300,100,40,"C7"]
[100019334,"KIT DE LIAISON HYDRAULIQUE ENTRE 2 CAPTEURS D230","ER407",39,null,"/","/","/",3661238554832,0.2,115,60,70,"C7"]
[]
["DISPOSITIF DE MONTAGE"]
[7503818,"KIT INTEGRATION BASE V 22°  1 CAPTEUR D 230 TUILES MECANIQUES","ER628",520,null,"/","/","/",3661238600270,23,150,800,2000,"C7"]
[7503820,"KIT INTEGRATION BASE V 22°  2 CAPTEURS D 230 TUILES MECANIQUES","ER629",727,null,"/","/","/",3661238600287,38,150,800,2000,"C7"]
[7503819,"KIT EXTENSION INTEGRATION V 22° 1 CAPTEUR D 230 TUILES MECANIQUES","ER630",312,null,"/","/","/",3661238600294,15,150,800,2000,"C7"]
[7212871,"KIT INTEGRATION BASE V 17°  1 CAPTEUR D 230 TUILES CANAL","ER631",675,null,"/","/","/",3661238600300,27,150,800,2000,"C7"]
[7212878,"KIT INTEGRATION BASE V 17°  2 CAPTEURS D 230 TUILES CANAL","ER632",1090,null,"/","/","/",3661238600416,44,150,800,2000,"C7"]
[7212874,"KIT EXTENSION INTEGRATION V 17°  1 CAPTEUR D 230 TUILES CANAL","ER633",416,null,"/","/","/",3661238600423,17,150,800,2000,"C7"]
[100016513,"KIT PROFILES A CLIPER POUR 1 C250 V","ER260",136,null,"/","/","/",3661238492394,4.5,1260,155,100,"C7"]
[100016514,"KIT PROFILES A CLIPER POUR 1 C250 H","ER261",169,null,"/","/","/",3661238492400,7,2280,155,100,"C7"]
[7217048,"KIT PROFILES 45 2,5M2 HZ ","ER662",96,null,"/","/","/",3661238492288,4.5,2280,155,100,"C7"]
[7217044,"KIT PROFILES 45 MTGE VT ","ER664",78,null,"/","/","/",3661238492295,2.5,1260,155,100,"C7"]
[]
["ACCESSOIRES DE MONTAGE POUR ARDOISES ET TUILES PLATES"]
[7503269,"KIT NOQUETS POUR TUILES PLATES ET ARDOISES","ER558",135,null,"/","/","/",3661238586611,7,150,200,360,"C7"]
[]
["FERRURES D'ANCRAGE POUR MONTAGE SUR TOITURE"]
[89807311,"4 CROCHETS ALU UNIVERSEL POUR TUILES MÉCANIQUES","EG311",96,null,"/","/","/",3661238045903,2.2999999999999998,365,120,140,"C7"]
[89807312,"6 CROCHETS ALU UNIVERSEL POUR TUILES MÉCANIQUES","EG312",138,null,"/","/","/",3661238045897,3.5,365,115,140,"C7"]
[89807313,"4 CROCHETS INOX SUR CHEVRON À TUILES MÉCANIQUES","EG313",96,null,"/","/","/",3661238045880,3.4,320,220,135,"C7"]
[89807314,"6 CROCHETS INOX SUR CHEVRON À TUILES MÉCANIQUES","EG314",138,null,"/","/","/",3661238045873,4.9000000000000004,325,225,135,"C7"]
[89807315,"4 CROCHETS INOX POUR TOITURE À TUILES PLATES","EG315",96,null,"/","/","/",3661238045866,2.4,300,135,95,"C7"]
[89807316,"6 CROCHETS INOX POUR TOITURE À TUILES PLATES","EG316",138,null,"/","/","/",3661238045859,3.5,310,140,95,"C7"]
[100015314,"4 FERRURES D'ANCRAGE INOX POUR MONTAGE SUR TUILES CANAL","ER136",95,null,"/","/","/",3661238415539,4,325,260,120,"C7"]
[100015315,"6 FERRURES D'ANCRAGE INOX POUR MONTAGE SUR TUILES CANAL","ER137",138,null,"/","/","/",3661238415546,6.5,410,305,115,"C7"]
[89807317,"4 CROCHETS INOX POUR TOITURE À TUILES CANALS / ÉTERNIT","EG317",96,null,"/","/","/",3661238045842,3.6,260,215,75,"C7"]
[89807318,"6 CROCHETS INOX POUR TOITURE À TUILES CANALS / ÉTERNIT","EG318",138,null,"/","/","/",3661238045835,5.3,260,220,75,"C7"]
[89807319,"4 CROCHETS INOX POUR TOITURE ARDOISES / BARDAGE","EG319",96,null,"/","/","/",3661238045828,2.2000000000000002,280,120,80,"C7"]
[89807320,"6 CROCHETS INOX POUR TOITURE ARDOISES / BARDAGE","EG320",138,null,"/","/","/",3661238045811,3.3,305,140,95,"C7"]
[89807782,"KIT TIRE-FONDS POUR MONTAGE 2 CAPTEURS/TUILES CANAL","EG94",242,null,"/","/","/",3661238045057,2.8,405,140,80,"C7"]
[89807783,"KIT TIRE-FONDS POUR MONTAGE 3 CAPTEURS/TUILES CANAL","EG95",304,null,"/","/","/",3661238045040,3.6,405,140,80,"C7"]
[100016517,"4 FERRURES D'ANCRAGE ALU  A CRANS MTGE SUR CHEVRON","ER264",129,null,"/","/","/",3661238492431,3,2120,110,95,"C7"]
[100016518,"2 FERRURES D'ANCRAGE ALU  A CRANS MTGE SUR CHEVRON","ER265",78,null,"/","/","/",3661238492448,1.6,2120,110,95,"C7"]
[]
["SUPPORTS INCLINABLES POUR MONTAGE EN TERRASSE (OU AU SOL)"]
[100016509,"2 SUPPORTS HL AVEC CROIX  MONTAGE VERTICAL 1 C250 SANS PROFILES","ER250",306,null,"/","/","/",3661238492356,21.5,2280,155,100,"C7"]
[100016510,"1 SUPPORT HL VERTICAL POUR EXTENSION 1 C250 ","ER251",158,null,"/","/","/",3661238492363,11.5,2280,155,100,"C7"]
[100016511,"2 SUPPORTS HL AVEC CROIX  MONTAGE HORIZONTAL 1 C250 SANS PROFILES","ER252",250,null,"/","/","/",3661238492370,13.5,2280,155,100,"C7"]
[100016512,"1 SUPPORT HL HORIZONTAL POUR EXTENSION 1 C250 ","ER253",142,null,"/","/","/",3661238492387,8,2280,155,100,"C7"]
[7217038,"2 SUPPORTS SL MONTAGE VERTICAL 1 CAPTEUR","ER658",192,null,"/","/","/",3661238630710,9.5,2267,145,80,"C7"]
[7217039,"1 SUPPORT SL MTGE VERTICAL POUR EXTENSION 1 CAPTEUR","ER659",89,null,"/","/","/",3661238630277,4.5,1945,110,95,"C7"]
[7217041,"2 SUPPORTS SL HL MONTAGE HORIZONTAL 1 CAPTEUR","ER656",153,null,"/","/","/",3661238630253,5.5,1250,145,80,"C7"]
[7217042,"1 SUPPORT SL HL HORIZONTAL POUR EXTENSION 1 CAPTEUR","ER657",78,null,"/","/","/",3661238630260,3,1250,145,80,"C7"]
[]
["OPTION MONTAGE INTEGRE EN TOITURE AVEC TUILES PLATES / ARDOISES"]
[100007882,"KIT NOQUETS POUR TUILES PLATES","EG425",229,null,"/","/","/",3661238101418,3.92,315,230,130,"C7"]
[]
[]
["PACKS TOIT"]
[100019693,"PACK TOIT 1 D230- 2m² CROCHET UNIVERSEL TUILES MECANIQUES","ER430",1172,null,"/","/","/",3661238568129,134,1270,770,2200,"C7"]
[100019694,"PACK TOIT 1 D230- 2m² SUR TOITURE ARDOISES","ER431",1172,null,"/","/","/",3661238568112,134,1270,770,2200,"C7"]
[100019695,"PACK TOIT 2 D230- 5m² CROCHET UNIVERSEL TUILES MECANIQUES","ER432",1936,null,"/","/","/",3661238568136,121,1270,770,2200,"C7"]
[100019696,"PACK TOIT 2 D230- 5m² SUR TOITURE ARDOISES","ER433",1936,null,"/","/","/",3661238568143,134,1270,770,2200,"C7"]
[100019697,"PACK TOIT 2 D230- 5m² SUR CHEVRON TUILES MECANIQUES","ER434",1936,null,"/","/","/",3661238568150,134,1270,770,2200,"C7"]
[100019698,"PACK TOIT 3 D230- 7m² CROCHET UNIVERSEL TUILES MECANIQUES","ER435",3037,null,"/","/","/",3661238568167,134,1270,770,2200,"C7"]
[100019699,"PACK TOIT 3 D230- 7m² SUR TOITURE ARDOISES","ER436",3037,null,"/","/","/",3661238568174,134,1270,770,2200,"C7"]
[100019700,"PACK TOIT 3 D230- 7m² SUR CHEVRON TUILES MECANIQUES","ER437",3037,null,"/","/","/",3661238568181,134,1270,770,2200,"C7"]
[100019701,"PACK TOIT 4 D230- 9m² CROCHET UNIVERSEL TUILES MECANIQUES","ER438",4025,null,"/","/","/",3661238568198,134,1270,770,2200,"C7"]
[100019702,"PACK TOIT 4 D230- 9m² SUR TOITURE ARDOISES","ER439",4025,null,"/","/","/",3661238568204,134,1270,770,2200,"C7"]
[100019703,"PACK TOIT 4 D230- 9m² SUR CHEVRON TUILES MECANIQUES","ER440",4025,null,"/","/","/",3661238568211,134,1270,770,2200,"C7"]
[]
["PACKS TOIT IT"]
[7615855,"PACK TOIT 1 D 230- 2m² INTEGRE V 22° TUILE MECANIQUE","ER620",1376,null,"/","/","/",3661238600317,103,1330,770,2200,"C7"]
[7615859,"PACK TOIT 2 D 230- 5m² INTEGRE V 22° TUILE MECANIQUE","ER621",2344,null,"/","/","/",3661238600324,162,1330,770,2200,"C7"]
[7615861,"PACK TOIT 3 D 230- 7m² INTEGRE V 22° TUILE MECANIQUE","ER622",3567,null,"/","/","/",3661238600331,221,1330,770,2200,"C7"]
[7615863,"PACK TOIT 4 D 230- 9m² INTEGRE V 22° TUILE MECANIQUE","ER623",4565,null,"/","/","/",3661238600348,305,1330,770,2200,"C7"]
[7615864,"PACK TOIT 1 D 230- 2m² INTEGRE V 17° TUILE CANAL","ER624",1457,null,"/","/","/",3661238600355,107,1330,770,2200,"C7"]
[7615866,"PACK TOIT 2 D 230- 5m² INTEGRE V 17° TUILE CANAL","ER625",2497,null,"/","/","/",3661238600362,168,1330,770,2200,"C7"]
[7615868,"PACK TOIT 3 D 230- 7m² INTEGRE V 17° TUILE CANAL","ER626",3719,null,"/","/","/",3661238600379,229,1330,770,2200,"C7"]
[7615869,"PACK TOIT 4 D 230- 9m² INTEGRE V 17° TUILE CANAL","ER627",4636,null,"/","/","/",3661238600386,315,1330,770,2200,"C7"]
[]
[]
[100008206,"PREPARATEUR SOLAIRE POWERSUN DT 350/3 350L","EC359",3315,3.33,"/","C","XL",3661238371262,215,1075,820,2030,"C7"]
[100008208,"PREPARATEUR SOLAIRE POWERSUN DT 250/3 250L","EC360",2984,3.33,"/","C","XL",3661238371279,180,1080,785,1830,"C7"]
[]
[]
[126757,"BALLON SOLAIRE OBS 801",null,{"$f":"SUM(D1034:D1035)","v":4320},null,"Pas concerné par l'étiquettage",null,null,3661238107427,null,null,null,null,"C7"]
[126758,"BALLON SOLAIRE OBS 1001",null,{"$f":"SUM(D1036:D1037)","v":4906},null,"Pas concerné par l'étiquettage",null,null,3661238107410,null,null,null,null,"C7"]
[]
["COMPOSANTS"]
[89807234,"CUVE B 801 ","EC114",3302,null,"/","/","/",3661238046085,334,990,990,2100,"C7"]
[89807235,"HABILLAGE B 801","EC115",1018,null,"/","/","/",3661238046078,30,365,125,2090,"C7"]
[89807236,"CUVE B 1001","EC116",3736,null,"/","/","/",3661238046061,375,990,990,2200,"C7"]
[89807237,"HABILLAGE B 1001","EC117",1170,null,"/","/","/",3661238046054,34.5,2335,2385,415,"C7"]
[]
[]
[100008019,"PREPARATEUR ECS INSTANTANEE FWS 750","EC546",4709,null,"Pas concerné par l'étiquettage",null,null,3661238101111,252,1200,1200,2330,"C7"]
[100008150,"PREPARATEUR SOLAIRE OECOSUN DU 750-20 CL",null,{"$f":"SUM(D1044,D1045)","v":7383},null,"Pas concerné par l'étiquettage",null,null,null,null,null,null,null,"C0"]
[]
["COMPOSANTS"]
[100007994,"CUVE (55 kW) & HABILLAGE DU 750-20 CL","EC545",4073,null,"/","/","/",3661238101234,242,1200,1200,2250,"C7"]
[100008115,"COLIS COMPOSANTS OECOSUN DU 750-20 ","EC562",3310,null,"/","/","/",3661238372436,56,1200,1400,2295,"C7"]
[]
["OPTIONS POUR PREPARATEURS SOLAIRES  "]
[100007832,"REGULATION POMPE DE CHARGE SLA 2","EC320",204,0.08,"/","/","/",3661238101494,0.66,225,195,85,"C0"]
[89807767,"MITIGEUR THERMOSTATIQUE 1\"","EG78",133,null,"/","/","/",3661238045149,0.65,125,105,90,"C7"]
[]
["POUR PREPARATEURS SOLAIRES < 400 L"]
[89757752,"ANODE ACI CORREX UP BALLON < 300 L","AJ38",300,0.01,"/","/","/",3661238046849,0.35,250,95,50,"C0"]
[100007797,"RESISTANCE ELECTRIQUE 2,2 kW MULTI BLINDEE DN 82  ","EC410",473,null,"/","/","/",3661238116634,3.2,660,215,215,"C0"]
[100007830,"RESISTANCE ELECTRIQUE 2,4 kW MULTI STEATITE DN 82  ","EC411",337,null,"/","/","/",3661238116641,3.8,625,210,220,"C0"]
[89807777,"RESISTANCE ELECTRIQUE 3,0 kW MULTI STEATITE DN 82  ","EG88",247,null,"/","/","/",3661238045071,4,800,195,200,"C7"]
[100007798,"RESISTANCE ELECTRIQUE 3,3 kW MULTI BLNDEE DN 82  ","EC412",542,null,"/","/","/",3661238116658,3.5,660,215,215,"C0"]
[]
["POUR PREPARATEURS SOLAIRES > 400 L"]
[100007799,"RESISTANCE ELECTRIQUE 4,5 kW MULTI BLINDEE DN 117  ","EC413",657,null,"/","/","/",3661238156852,3.54,660,215,215,"C0"]
[89608920,"ANODE ACI CORREX UP BALLON > 300 LITRES","AM7",521,0.01,"/","/","/",3661238047440,0.44,425,100,55,"C0"]
[]
["POUR PREPARATEURS SOLAIRES OBS 801- 1001"]
[89757750,"RESISTANCE BLINDEE 6 KW/400V A VISSER 1''1/2","AJ36",615,null,"/","/","/",3661238046863,2.4700000000000002,695,170,180,"C0"]
[89757746,"THERMOMETRE","AJ32",50,null,"/","/","/",3661238046887,0.18,145,190,125,"C0"]
[89608920,"ANODE ACI CORREX UP BALLON > 300 LITRES","AM7",521,0.01,"/","/","/",3661238047440,0.44,425,100,55,"C0"]
[]
[]
[100006534,"PREPARATEUR SOLAIRE OECOSUN DU 500-10",null,{"$f":"SUM(D1071:D1072)","v":5918},null,"/","D stockage \nECS",null,null,null,null,null,null,"C7"]
[]
["COMPOSANTS"]
[100005800,"CUVE DE PREPARATEUR SOLAIRE MOUSSE DU/C500","EC290",3691,null,"/","/","/",3661238091924,244,950,820,1970,"C7"]
[100008117,"COLIS COMPOSANTS OECOSUN DU 500 ","EC564",2227,null,"/","/","/",3661238372450,91,1200,1400,2295,"C7"]
[]
[]
[100006535,"OECOPAC DUP 500-10 ",null,{"$f":"SUM(D1078:D1079)","v":8259},null,"/","D stockage \nECS",null,null,null,null,null,null,"C7"]
[]
["COMPOSANTS"]
[100005800,"CUVE DE PREPARATEUR SOLAIRE MOUSSE DU/C500","EC290",3691,null,"/","/","/",3661238091924,244,950,820,1970,"C7"]
[100008118,"COLIS COMPOSANTS OECOPAC DUP 500 ","EC565",4568,null,"/","/","/",3661238372467,98,1200,800,2300,"C7"]
[]
[null,"OPTIONS OECOSUN/DENS 500"]
[89807212,"MODULE HYDRAULIQUE POUR 1 CIRCUIT DIRECT","EC92",445,null,"/","/","/",3661238046276,5.15,310,210,180,"C7"]
[89807213,"MODULE HYDRAULIQUE POUR 1 CIRCUIT DIRECT AVEC VANNE MOTORISEE","EC93",701,null,"/","/","/",3661238046269,6.24,310,210,180,"C7"]
[89807214,"MODULE HYDRAULIQUE POUR 1 CIRCUIT A TEMPERATURE FIXE","EC94",624,null,"/","/","/",3661238046252,5.93,310,210,180,"C7"]
[100013447,"MODUL.HYDRAUL.CIRCUIT DIR.CLASSE A ","ER73",621,0.17,"/","/","/",3661238363908,4.25,310,210,180,"C7"]
[100013448,"MODUL.HYDRAUL.V3V CLASSE A","ER74",876,0.17,"/","/","/",3661238363915,4.25,310,210,180,"C7"]
[100013449,"MODUL.HYD.V3V THERMOSTAT CLASSE A","ER75",800,0.17,"/","/","/",3661238363922,4.25,310,210,180,"C7"]
[100005978,"KIT TUBES DE RACCORDEMENT SORTIES MODULES HYDRAULIQUES","EC296",218,null,"/","/","/",3661238091849,3,800,165,175,"C7"]
[100006500,"KIT DU APPOINT ELECTRIQUE 2,4 kW/mono ","EC310",463,null,"/","/","/",3661238091771,2.9,660,215,215,"C7"]
[100006501,"KIT DU APPOINT ELECTRIQUE 6 kW/Tri ","EC311",725,null,"/","/","/",3661238091764,3.1,660,215,215,"C7"]
[100006531,"MODULE SEPARATEUR DE CIRCUITS PAC ROE/+ < 15 kW","EC300",1081,null,"/","/","/",3661238161764,19.899999999999999,570,385,250,"C7"]
[]
[]
[100008112,"PREPARATEUR SOLAIRE OECOSUN DU 750-10 COMPLET ",null,{"$f":"SUM(D1097:D1098)","v":6745},null,"Arrêt production",null,null,null,null,null,null,null,"C7"]
[]
["COMPOSANTS"]
[100007977,"CUVE (25 kW) & HABILLAGE DE PREPARATEUR SOLAIRE DU/C 750","EC550",3754,null,"/","/","/",3661238101302,227,1200,1200,2250,"C7"]
[100008114,"COLIS COMPOSANTS OECOSUN DU 750-10 ","EC559",2991,null,"/","/","/",3661238372429,85,1200,1200,1670,"C7"]
[]
["OPTIONS POUR OECOSUN ET OECODENS"]
[89807212,"MODULE HYDRAULIQUE POUR 1 CIRCUIT DIRECT","EC92",445,null,"/","/","/",3661238046276,5.15,310,210,180,"C7"]
[89807213,"MODULE HYDRAULIQUE POUR 1 CIRCUIT DIRECT AVEC VANNE MOTORISEE","EC93",701,null,"/","/","/",3661238046269,6.24,310,210,180,"C7"]
[89807214,"MODULE HYDRAULIQUE POUR 1 CIRCUIT DIRECT AVEC VANNE THERMOSTATIQUE","EC94",624,null,"/","/","/",3661238046252,5.93,310,210,180,"C7"]
[100013447,"MODUL.HYDRAUL.CIRCUIT DIR.CLASSE A ","ER73",621,0.17,"/","/","/",3661238363908,4.25,310,210,180,"C7"]
[100013448,"MODUL.HYDRAUL.V3V CLASSE A","ER74",876,0.17,"/","/","/",3661238363915,4.25,310,210,180,"C7"]
[100013449,"MODUL.HYD.V3V THERMOSTAT CLASSE A","ER75",800,0.17,"/","/","/",3661238363922,4.25,310,210,180,"C7"]
[89807767,"MITIGEUR THERMOSTATIQUE 1\"","EG78",133,null,"/","/","/",3661238045149,0.65,125,105,90,"C7"]
[89804901,"FAISEAU DE RACCORDEMENT OETROSOL C/OECOSUN/OECODENS","EC179",117,0.01,"/","/","/",3661238046443,0.46,265,125,45,"C7"]
[]
["OPTIONS EXTENSION VOLUME TAMPON "]
[100005010,"BALLON TAMPON PSB 750","EC129",1611,null,"/","/","/",3661238001862,163,1200,1200,2100,"C7"]
[100004650,"REGULATION \"MCDB\" POUR CHARGE/DECHARGE BALLON ","EC162",264,0.08,"/","/","/",3661238002425,0.97,230,195,85,"C0"]
[7604939,"STATION TRANSFERT DMCDB ","ER468",1016,null,"/","/","/",3661238583511,9.8000000000000007,625,320,205,"C7"]
[]
[]
[100005131,"BALLON SOLAIRE COMBI CHAUFFAGE + ECS DC 750-2","EC140",3159,null,"/","/","/",3661238091993,240,1200,1200,2150,"C7"]
[120767,"BALLON SOLAIRE COMBI CHAUFFAGE + ECS DC 1000",null,{"$f":"SUM(D1120:D1121)","v":4056},null,"/","/","/",null,null,null,null,null,"C7"]
[]
["COMPOSANTS"]
[89807226,"CUVE DC 1000","EC106",3072,null,"/","/","/",3661238046160,290,740,820,2200,"C7"]
[89807227,"HABILLAGE DC 1000","EC107",984,null,"/","/","/",3661238046153,38,1385,415,2355,"C7"]
[]
["OPTIONS POUR PREPARATEURS SOLAIRES DC "]
[89757746,"THERMOMETRE","AJ32",50,null,"/","/","/",3661238046887,0.18,145,190,125,"C0"]
[89608920,"ANODE ACI CORREX UP BALLON > 300 LITRES","AM7",521,0.01,"/","/","/",3661238047440,0.44,425,100,55,"C0"]
[89807767,"MITIGEUR THERMOSTATIQUE 1\"","EG78",133,null,"/","/","/",3661238045149,0.65,125,105,90,"C7"]
[]
["OPTIONS POUR PREPARATEURS SOLAIRES DC 1000"]
[89757750,"RESISTANCE BLINDEE 6 KW/400V A VISSER 1''1/2","AJ36",615,null,"/","/","/",3661238046863,2.4700000000000002,695,170,180,"C7"]
[]
[]
[126975,"BALLON SOLAIRE TAMPON PS 500",null,{"$f":"SUM(D1140:D1141)","v":1774},null,"/","C stockage \nECS","/",3661238107403,null,null,null,null,"C7"]
[126976,"BALLON SOLAIRE TAMPON PS 800",null,{"$f":"SUM(D1142:D1143)","v":2244},null,"/","C stockage \nECS","/",3661238107397,null,null,null,null,"C7"]
[126977,"BALLON SOLAIRE TAMPON PS 1000",null,{"$f":"SUM(D1144:D1145)","v":2593},null,"/","C stockage \nECS","/",3661238107380,null,null,null,null,"C7"]
[126978,"BALLON SOLAIRE TAMPON PS 1500",null,{"$f":"SUM(D1146:D1147)","v":4230},null,"/","C stockage \nECS","/",3661238107373,null,null,null,null,"C7"]
[126979,"BALLON SOLAIRE TAMPON PS 2000",null,{"$f":"SUM(D1148:D1149)","v":5711},null,"/","C stockage \nECS","/",3661238107366,null,null,null,null,"C7"]
[126980,"BALLON SOLAIRE TAMPON PS 2500",null,{"$f":"SUM(D1150:D1151)","v":7101},null,"/","C stockage \nECS","/",3661238107359,null,null,null,null,"C7"]
[]
["COMPOSANTS"]
[89807218,"CUVE PS 500","EC98",1365,null,"/","/","/",3661238046245,118,750,720,1900,"C7"]
[89807219,"HABILLAGE PS 500","EC99",409,null,"/","/","/",3661238046238,25.5,1230,370,2100,"C7"]
[89807228,"CUVE PS 800","EC108",1727,null,"/","/","/",3661238046146,178,850,820,2200,"C7"]
[89807229,"HABILLAGE PS 800","EC109",517,null,"/","/","/",3661238046139,29.5,1240,360,2100,"C7"]
[89807230,"CUVE PS 1000","EC110",1993,null,"/","/","/",3661238046122,183,850,810,2300,"C7"]
[89807231,"HABILLAGE PS 1000","EC111",600,null,"/","/","/",3661238046115,31.5,1240,360,2100,"C7"]
[89807232,"CUVE PS 1500","EC112",3253,null,"/","/","/",3661238046108,264,1190,1190,2400,"C7"]
[89807233,"HABILLAGE PS 1500","EC113",977,null,"/","/","/",3661238046092,40,2340,1680,260,"C7"]
[89807220,"CUVE PS 2000","EC100",4393,null,"/","/","/",3661238046221,230,1400,1400,2100,"C7"]
[89807221,"HABILLAGE PS 2000","EC101",1318,null,"/","/","/",3661238046214,20,2200,1250,450,"C7"]
[89807222,"CUVE PS 2500","EC102",5463,null,"/","/","/",3661238046207,260,2470,1450,1350,"C7"]
[89807223,"HABILLAGE PS 2500","EC103",1638,null,"/","/","/",3661238046191,22,0,0,0,"C7"]
[]
[]
[100005010,"BALLON TAMPON PSB 750","EC129",1611,null,"/","/","/",3661238001862,163,1200,1200,2100,"C7"]
[7623648,"BALLON TAMPON PSB 500 ","ML91",1630,null,"/","/","/",3661238614918,130,80,80,188,"C7"]
[7623649,"BALLON TAMPON PSB 800 ","ML92",1783,null,"/","/","/",3661238614925,115,80,80,194,"C7"]
[7623650,"BALLON TAMPON PSB 1000 ","ML93",1936,null,"/","/","/",3661238614932,150,80,80,228,"C7"]
[7623652,"BALLON TAMPON PSB 1500 ","ML94",2853,null,"/","/","/",3661238614949,195,100,100,229,"C7"]
[7623653,"BALLON TAMPON PSB 2000","ML95",3872,null,"/","/","/",3661238614956,195,100,100,244,"C7"]
[]
["OPTIONS POUR PREPARATEURS SOLAIRES TAMPON"]
[89757746,"THERMOMETRE","AJ32",50,null,"/","/","/",3661238046887,0.18,145,190,125,"C0"]
[]
[]
[100012353,"1 CAPTEUR SOLAIRE SUN 3010","ER40",1622,null,"Pas concerné par l'étiquettage",null,null,null,40,1770,900,110,"C7"]
[100012354,"1 CAPTEUR SOLAIRE SUN 3015","ER41",1933,null,"Pas concerné par l'étiquettage",null,null,null,55,1770,1290,115,"C7"]
[]
["ACCESSOIRES DE MONTAGE SUN 3000"]
[100011397,"KIT DE RACCORDEMENT (EXTREMITE + BOUCHON)","EG394",110,null,"/","/","/",3661238340053,0.42,160,210,25,"C7"]
[100011396,"KIT DE LIAISON HYDRAULIQUE INTER COLLECTEUR","EG393",147,null,"/","/","/",3661238340046,0.66,260,220,100,"C7"]
[89807355,"KIT DE RACCORDEMENT FLEXIBLE CAPTEUR TUBULAIRE + SONDE CAPTEUR","EG355",193,null,"/","/","/",3661238045552,1.34,1060,165,95,"C7"]
[100011395,"KIT DE FIXATION 1 CAPTEUR","EG392",76,null,"/","/","/",3661238340039,0.56999999999999995,240,145,30,"C7"]
[100012019,"KIT DE MONTAGE 1 CAPTEUR SUN 3010","ER31",155,null,"/","/","/",3661238352179,6,1600,110,90,"C7"]
[100012020,"KIT DE MONTAGE 1 CAPTEUR SUN 3015","ER32",163,null,"/","/","/",3661238352162,5.5,1600,110,90,"C7"]
[]
["ELEMENTS DE MONTAGE SUPPLEMENTAIRES POUR TOUS TYPES DE PANNEAUX "]
[89807307,"KIT COUPLEURS (2 PCES) POUR PROFILES (FIXATION PROFILES JUXTAPOSÉS)","EG307",30,null,"/","/","/",3661238045941,0.18,195,100,20,"C7"]
[89807311,"4 FERRURES D'ANCRAGE ALU POUR MONTAGE SUR TUILES MÉCANIQUES","EG311",96,null,"/","/","/",3661238045903,2.34,365,120,140,"C7"]
[89807312,"6 FERRURES D'ANCRAGE ALU POUR MONTAGE SUR TUILES MÉCANIQUES","EG312",138,null,"/","/","/",3661238045897,3.46,365,115,140,"C7"]
[89807313,"4 FERRURES D'ANCRAGE INOX POUR MONTAGE SUR TUILES MÉCANIQUES","EG313",96,null,"/","/","/",3661238045880,3.37,320,220,135,"C7"]
[89807314,"6 FERRURES D'ANCRAGE INOX POUR MONTAGE SUR TUILES MÉCANIQUES","EG314",138,null,"/","/","/",3661238045873,4.93,325,225,135,"C7"]
[89807315,"4 FERRURES D'ANCRAGE INOX POUR MONTAGE SUR TUILES PLATES","EG315",96,null,"/","/","/",3661238045866,2.4,300,135,95,"C7"]
[89807316,"6 FERRURES D'ANCRAGE INOX POUR MONTAGE SUR TUILES PLATES","EG316",138,null,"/","/","/",3661238045859,3.5,310,140,95,"C7"]
[89807317,"4 FERRURES D'ANCRAGE INOX POUR MONTAGE SUR TOIT ETERNIT","EG317",96,null,"/","/","/",3661238045842,3.56,260,215,75,"C7"]
[89807318,"6 FERRURES D'ANCRAGE INOX POUR MONTAGE SUR TOIT ETERNIT","EG318",138,null,"/","/","/",3661238045835,5.3,260,220,75,"C7"]
[89807319,"4 FERRURES D'ANCRAGE INOX POUR MONTAGE SUR TOIT D'ARDOISES","EG319",96,null,"/","/","/",3661238045828,2.21,280,120,80,"C7"]
[89807320,"6 FERRURES D'ANCRAGE INOX POUR MONTAGE SUR TOIT D'ARDOISES","EG320",138,null,"/","/","/",3661238045811,3.3,305,140,95,"C7"]
[89807358,"3 SUPPORTS TERRASSE ET CROIX POUR 2 CAPTEUR EN VERTICAL","EG358",281,null,"/","/","/",3661238045521,8.4,1835,120,80,"C7"]
[89807359,"3 SUPPORTS TERRASSE POUR 2 CAPTEURS EN VERTICAL","EG359",240,null,"/","/","/",3661238045514,8,1825,120,80,"C7"]
[89807323,"2 SUPPORTS TERRASSE POUR 1 CAPTEUR EN VERTICAL","EG323",268,null,"/","/","/",3661238045781,6,1885,75,90,"C7"]
[89807324,"3 SUPPORTS TERRASSE POUR 2 CAPTEURS EN VERTICAL","EG324",365,null,"/","/","/",3661238045774,8,1855,145,80,"C7"]
[89807325,"2 SUPPORTS TERRASSE POUR 1 CAPTEUR EN HORIZONTAL","EG325",158,null,"/","/","/",3661238045767,3.7,1205,80,75,"C7"]
[89807358,"3 SUPPORTS AVEC CROIX STABILISATRICE POUR 2 CAPTEURS MONTAGE VERTICAL","EG358",281,null,"/","/","/",3661238045521,8.4,1835,120,80,"C7"]
[89807359,"3 SUPPORTS SANS CROIX STABILISATRICE POUR 2 CAPTEURS MONTAGE VERTICAL","EG359",240,null,"/","/","/",3661238045514,8,1825,120,80,"C7"]
[89807782,"KIT TIRE-FONDS POUR MONTAGE 2 CAPTEURS","EG94",242,null,"/","/","/",3661238045057,2.84,405,140,80,"C7"]
[89807783,"KIT TIRE-FONDS POUR MONTAGE 3 CAPTEURS","EG95",304,null,"/","/","/",3661238045040,3.73,405,140,80,"C7"]
[]
[]
[97930860,"POMPE SOLAIRE ST 20/11",null,"CPR",null,"/","/","/",3661238085664,4.16,23,17,15]
[7604939,"STATION TRANSFERT DMCDB ","ER468",1016,null,"/","/","/",3661238583511,9.8000000000000007,625,320,205,"C7"]
[7624853,"STATION SOLAIRE SKP 7-8","ER655",438,0.17,"/","/","/",3661238617018,6.32,480,300,200,"C7"]
[7630417,"STATION SOLAIRE DKSL 6-8 MSB ","ER710",550,0.17,"/","/","/",3661238631021,7.7,925,230,435,"C7"]
[]
[]
[7630422,"REGULATION OETROSOL-PLUS","ER709",255,0.08,"/","/","/",3661238631045,0.69,227,194,85,"C7"]
[7619972,"REGULATION SOL COLLECTIF SC5 ","ER672",596,0.08,"/","/","/",3661238608689,2.2999999999999998,320,230,130,"C7"]
[100004618,"RÉGULATION \"DELTASOL ES\" POUR 2 CHAMPS DE CAPTEURS ","EC158",608,0.08,"/","/","/",3661238002470,1.7,325,230,130,"C0"]
[100003690,"SONDE A APPLIQUE PT1000","EC171",61,0.01,"/","/","/",3661238005303,0.1,180,140,30,"C0"]
[100004651,"SONDE D'IMMERSION FK Pt1000 2,5 m","EC173",61,0.01,"/","/","/",3661238002418,0.15,220,150,25,"C0"]
[100008011,"SONDE CAPTEUR  PT1000 ","EC155",57,0.01,"/","/","/",3661238101197,0.1,180,120,20,"C7"]
[89804803,"VANNE 3 VOIES 3/4\" POUR 2 CIRCUITS","EC164",232,null,"/","/","/",3661238046528,1.05,205,125,90,"C7"]
[89804816,"BOITIER PARA FOUDRE POUR SONDE PANNEAUX SOLAIRES","EC176",39,null,"/","/","/",3661238046450,0.11,220,165,40,"C7"]
[100004650,"REGULATION \"MCDB\" POUR CHARGE/DECHARGE BALLON ","EC162",264,0.08,"/","/","/",3661238002425,0.97,230,195,85,"C0"]
[100011341,"KIT 2 VANNES/SONDE CAPT.EST-OUEST","EC432",445,null,"/","/","/",3661238340213,1.3,240,160,70,"C0"]
[]
["DOUBLE TUBE PREISOLE AVEC CABLE"]
[89807000,"TWIN TUBES CU DN15 10 METRES","EG106",457,null,"/","/","/",3661238046436,11,790,800,275,"C0"]
[89807001,"TWIN TUBES CU DN15 15 METRES","EG107",701,null,"/","/","/",3661238046429,16.2,800,795,275,"C0"]
[89807003,"JEU DE 4 COLLIERS DN15","EG109",22,null,"/","/","/",3661238046405,0.5,160,110,70,"C0"]
[89807002,"TWIN TUBES DN18 15 METRES","EG108",916,null,"/","/","/",3661238046412,22.41,805,805,330,"C0"]
[89807004,"COLLIER SUP. DN18 4X","EG110",26,null,"/","/","/",3661238046399,0.52,160,140,75,"C0"]
[100000417,"JEU DE 2 RACCORDS BÎCONE DN 15","EG374",24,null,"/","/","/",3661238011144,0.18,90,100,30,"C7"]
[100000418,"JEU DE 2 RACCORDS BÎCONE DN 18","EG375",24,null,"/","/","/",3661238011137,0.23,120,95,30,"C7"]
[100000419,"JEU DE 2 RÉDUCTIONS BÎCONE 18/15","EG376",11,null,"/","/","/",3661238011120,0.03,130,95,20,"C7"]
[100008020,"DUO-FLEX DN16 X 15 METRES","EG455",1081,null,"/","/","/",3661238101104,10.5,790,790,320,"C7"]
[100008021,"DUO-FLEX DN20 X 15 METRES","EG456",1261,null,"/","/","/",3661238101098,14.5,780,795,325,"C7"]
[100008022,"JEU DE RACCORDS DUOFLEX DN16/BîCONE Ø 18","EG457",26,null,"/","/","/",3661238101081,0.32,90,80,60,"C7"]
[100008023,"JEU DE RACCORDS DUOFLEX DN20/BîCONE Ø 18","EG458",26,null,"/","/","/",3661238101074,0.51,90,80,60,"C7"]
[]
["FLUIDES CALOPORTEURS"]
[89807794,"FLUIDE CALOPORTEUR \"L\" 20L. MELANGE 40/60 ","EG101",76,null,"/","/","/",3661238045019,21.72,240,290,370,"C7"]
[89807792,"FLUIDE CALOPORTEUR \"LS\" 20L HAUTES PREFORMANCES","EG100",151,null,"/","/","/",3661238045033,21.53,340,290,370,"C7"]
[100017611,"FLUIDE CALOPORTEUR HAUTE PREFORMANCE BIO (-26°C) 20 LITRES","ER316",131,null,"/","/","/",3661238496606,21.53,340,290,370,"C7"]
[89807710,"ANTIGEL ''L' CONCENTRE EN BIDON DE 10 L","EG11",97,null,"/","/","/",3661238045316,10.95,220,190,295,"C7"]
[]
["VASES D'EXPANSION"]
[89807713,"VASE D'EXPANSION SOLAIRE 18 L","EG14",97,null,"/","/","/",3661238045309,4.2300000000000004,395,290,300,"C7"]
[89807771,"VASE D'EXPANSION SOLAIRE 25 L","EG82",113,null,"/","/","/",3661238045118,5.53,455,305,305,"C7"]
[89807772,"VASE D'EXPANSION SOLAIRE 35 L","EG83",177,null,"/","/","/",3661238045101,7.34,585,335,340,"C7"]
[89807773,"VASE D'EXPANSION SOLAIRE 50 L","EG84",341,null,"/","/","/",3661238045095,12.5,700,385,390,"C7"]
[89807238,"KIT D'ACCROCHAGE POUR VASE D'EXPANSION ","EC118",59,null,"/","/","/",3661238046047,1.35,480,130,150,"C0"]
[]
[]
[100016502,"CAPTEUR PLAN MONTAGE VERTICAL PRO C250 V","ER240",781,null,"/","/","/",3661238492318,2210,1320,115,48,"C7"]
[100016503,"CAPTEUR PLAN MONTAGE HORIZONTAL PRO C250 H","ER241",803,null,"/","/","/",3661238492301,2210,1320,115,48,"C7"]
[]
["ACCESSOIRES POUR RACCORDEMENTS HYDRAULIQUES DES PANNEAUX SOLAIRES SUN C 250 "]
["RACCORDEMENT DES CAPTEURS EN MONTAGE VERTICAL JUXTAPOSES OU HORIZONTAL SUPERPOSES"]
[100016506,"KIT DE RACCORDEMENT CHAMP DE CAPTEURS","ER245",118,null,"/","/","/",3661238492325,1045,165,90,1.5,"C7"]
[100016507,"KIT DE LIAISON HYDRAULIQUE ENTRE CAPTEURS","ER246",40,null,"/","/","/",3661238492332,1045,165,90,1.5,"C7"]
[100016508,"KIT 2 FLEXIBLES CIRCUIT SOLAIRE CHAMP CAPTEURS","ER247",129,null,"/","/","/",3661238492349,1045,165,90,1.5,"C7"]
[100019224,"INTERFACE DE COMMUNICATION DL3","ER139",713,0.08,"/","/","/",3661238549548,0.68,230,195,85,"C7"]
[]
["ELEMENTS DE POSE SUR TOIT OU EN TERRASSE"]
["MONTAGE JUXTAPOSES SUPERPOSES SUR TOITURE OU SUPPORTS TERRASSE STANDARD"]
[100016513,"KIT PROFILES A CLIPER POUR 1 C250 V","ER260",136,null,"/","/","/",3661238492394,2120,110,95,8,"C7"]
[100016514,"KIT PROFILES A CLIPER POUR 1 C250 H","ER261",169,null,"/","/","/",3661238492400,2120,110,95,8,"C7"]
[7217044,"KIT PROFILES 45 MTGE VT ","ER664",78,null,"/","/","/",3661238492295,2.5,1260,155,100,"C7"]
[7217048,"KIT PROFILES 45 2,5M2 HZ ","ER662",96,null,"/","/","/",3661238492288,2210,1320,115,48,"C7"]
[100016509,"2 SUPPORTS HL AVEC CROIX  MONTAGE VERTICAL 1 C250 SANS PROFILES","ER250",306,null,"/","/","/",3661238492356,1875,75,90,6,"C7"]
[100016510,"1 SUPPORT HL VERTICAL POUR EXTENSION 1 C250 ","ER251",158,null,"/","/","/",3661238492363,1875,75,90,6,"C7"]
[100016511,"2 SUPPORTS HL AVEC CROIX  MONTAGE HORIZONTAL 1 C250 SANS PROFILES","ER252",250,null,"/","/","/",3661238492370,1875,75,90,6,"C7"]
[100016512,"1 SUPPORT HL HORIZONTAL POUR EXTENSION 1 C250 ","ER253",142,null,"/","/","/",3661238492387,1885,75,90,6,"C7"]
[7217038,"2 SUPPORTS SL MONTAGE VERTICAL 1 CAPTEUR","ER658",192,null,"/","/","/",3661238630710,9.5,2267,145,80,"C7"]
[7217039,"1 SUPPORT SL MTGE VERTICAL POUR EXTENSION 1 CAPTEUR","ER659",89,null,"/","/","/",3661238630277,4.5,1945,110,95,"C7"]
[7217041,"2 SUPPORTS SL HL MONTAGE HORIZONTAL 1 CAPTEUR","ER656",153,null,"/","/","/",3661238630253,5.5,1250,145,80,"C7"]
[7217042,"1 SUPPORT SL HL HORIZONTAL POUR EXTENSION 1 CAPTEUR","ER657",78,null,"/","/","/",3661238630260,3,1250,145,80,"C7"]
[]
["FERRURES D'ANCRAGE POUR MONTAGE SUR TOITURE"]
[89807311,"4 FERRURES D'ANCRAGE ALU POUR MONTAGE SUR TUILES MÉCANIQUES","EG311",96,null,"/","/","/",3661238045903,365,120,140,2.2999999999999998,"C7"]
[89807312,"6 FERRURES D'ANCRAGE ALU POUR MONTAGE SUR TUILES MÉCANIQUES","EG312",138,null,"/","/","/",3661238045897,3.46,365,115,140,"C7"]
[89807313,"4 FERRURES D'ANCRAGE INOX POUR MONTAGE SUR TUILES MÉCANIQUES","EG313",96,null,"/","/","/",3661238045880,3.37,320,220,135,"C7"]
[89807314,"6 FERRURES D'ANCRAGE INOX POUR MONTAGE SUR TUILES MÉCANIQUES","EG314",138,null,"/","/","/",3661238045873,4.93,325,225,135,"C7"]
[89807315,"4 FERRURES D'ANCRAGE INOX POUR MONTAGE SUR TUILES PLATES","EG315",96,null,"/","/","/",3661238045866,2.4,300,135,95,"C7"]
[89807316,"6 FERRURES D'ANCRAGE INOX POUR MONTAGE SUR TUILES PLATES","EG316",138,null,"/","/","/",3661238045859,3.5,310,140,95,"C7"]
[100015314,"4 FERRURES D'ANCRAGE INOX POUR MONTAGE SUR TUILES CANAL","ER136",95,null,"/","/","/",3661238415539,325,260,120,4,"C7"]
[100015315,"6 FERRURES D'ANCRAGE INOX POUR MONTAGE SUR TUILES CANAL","ER137",138,null,"/","/","/",3661238415546,410,305,115,6.5,"C7"]
[89807317,"4 FERRURES D'ANCRAGE INOX POUR MONTAGE SUR TOIT ETERNIT","EG317",96,null,"/","/","/",3661238045842,3.56,260,215,75,"C7"]
[89807318,"6 FERRURES D'ANCRAGE INOX POUR MONTAGE SUR TOIT ETERNIT","EG318",138,null,"/","/","/",3661238045835,5.3,260,220,75,"C7"]
[89807319,"4 FERRURES D'ANCRAGE INOX POUR MONTAGE SUR TOIT D'ARDOISES","EG319",96,null,"/","/","/",3661238045828,2.21,280,120,80,"C7"]
[89807320,"6 FERRURES D'ANCRAGE INOX POUR MONTAGE SUR TOIT D'ARDOISES","EG320",138,null,"/","/","/",3661238045811,3.3,305,140,95,"C7"]
[89807782,"KIT TIRE-FONDS POUR MONTAGE 2 CAPTEURS","EG94",242,null,"/","/","/",3661238045057,405,140,80,2.8,"C7"]
[89807783,"KIT TIRE-FONDS POUR MONTAGE 3 CAPTEURS","EG95",304,null,"/","/","/",3661238045040,3.73,405,140,80,"C7"]
[100016517,"4 FERRURES D'ANCRAGE ALU  A CRANS MTGE SUR CHEVRON","ER264",129,null,"/","/","/",3661238492431,2120,110,95,8,"C7"]
[100016518,"2 FERRURES D'ANCRAGE ALU  A CRANS MTGE SUR CHEVRON","ER265",78,null,"/","/","/",3661238492448,2120,110,95,8,"C7"]
[]
[]
[7212864,"KIT DE BASE 22° D'INTEGRATION TUILE MECANIQUE 1 C250 V","ER634",540,null,"/","/","/",3661238600430,21.8,150,800,2000,"C7"]
[7212869,"KIT DE BASE 22° D'INTEGRATION TUILE MECANIQUE 2 C250 V","ER635",779,null,"/","/","/",3661238600447,21.8,150,800,2000,"C7"]
[7212867,"KIT EXTENSION 22° INTEGRATION TUILE MECANIQUE 1 C 250 V","ER636",322,null,"/","/","/",3661238600454,16.2,150,800,2000,"C7"]
[7212866,"KIT DE BASE 22° D'INTEGRATION TUILE MECANIQUE 1 C250 H","ER637",571,null,"/","/","/",3661238600461,30.4,150,800,2000,"C7"]
[7212870,"KIT DE BASE 22° D'INTEGRATION TUILE MECANIQUE 2 C250 H","ER638",934,null,"/","/","/",3661238600478,33,150,800,2000,"C7"]
[7212868,"KIT EXTENSION 22° INTEGRATION TUILE MECANIQUE C 250 H","ER639",416,null,"/","/","/",3661238600485,23.8,150,800,2000,"C7"]
[7212872,"KIT DE BASE 17° D'INTEGRATION TUILE CANAL 1 C250 V ","ER640",706,null,"/","/","/",3661238600492,52,150,800,2000,"C7"]
[7503821,"KIT DE BASE 17° D'INTEGRATION TUILE CANAL 2 C250 V ","ER641",1090,null,"/","/","/",3661238600508,55,150,800,2000,"C7"]
[7212875,"KIT EXTENSION 17° INTEGRATION TUILE CANAL C 250 V ","ER642",416,null,"/","/","/",3661238600515,52,150,800,2000,"C7"]
[7212873,"KIT DE BASE 17° D'INTEGRATION TUILE CANAL 1 C250 H ","ER643",789,null,"/","/","/",3661238600522,52,150,800,2000,"C7"]
[7212880,"KIT DE BASE 17° D'INTEGRATION TUILE CANAL 2 C250 H ","ER644",1298,null,"/","/","/",3661238600539,55,150,800,2000,"C7"]
[7212877,"KIT EXTENSION 17° INTEGRATION TUILE CANAL C 250 H","ER645",468,null,"/","/","/",3661238600546,27.2,150,800,2000,"C7"]
[7619965,"TAMPON COMPLEMENTAIRE MODULE DB2","ER666",1142,null,"/","/","/",3661238608610,10,500,280,235,"C7"]
[]
["ACCESSOIRES DE MONTAGE POUR ARDOISES ET TUILES PLATES"]
[7503269,"KIT NOQUETS POUR TUILES PLATES ET ARDOISES","ER558",135,null,"/","/","/",3661238586611,7,150,200,360,"C7"]
[]
[]
[126757,"BALLON SOLAIRE OBS 801",null,{"$f":"SUM(D1310:D1311)","v":4320},null,"/","/","/",3661238107427,null,null,null,null,"C7"]
[126758,"BALLON SOLAIRE OBS 1001",null,{"$f":"SUM(D1312:D1313)","v":4906},null,"/","/","/",3661238107410,null,null,null,null,"C7"]
[]
["COMPOSANTS"]
[89807234,"CUVE B 801 ","EC114",3302,null,"/","/","/",3661238046085,334,990,990,2100,"C7"]
[89807235,"HABILLAGE B 801","EC115",1018,null,"/","/","/",3661238046078,30,365,125,2090,"C7"]
[89807236,"CUVE B 1001","EC116",3736,null,"/","/","/",3661238046061,375,990,990,2200,"C7"]
[89807237,"HABILLAGE B 1001","EC117",1170,null,"/","/","/",3661238046054,34.5,2335,2385,415,"C7"]
[]
[]
[100017486,"MODULE TRANSFERT SOLAIRE DRAIN BACK DB-20","ER301",2715,0.17,"/","/","/",3661238496071,10,500,280,235,"C7"]
[]
[]
[7630422,"REGULATION OETROSOL-PLUS","ER709",255,0.08,"/","/","/",3661238631045,0.69,227,194,85,"C7"]
[]
[]
[100017469,"BALLON SOLAIRE TAMPON RSB 800 NV",null,{"$f":"D1330+D1331","v":2938},null,"/","/","/",3661238510180,null,null,null,null,"C7"]
[100017472,"BALLON SOLAIRE TAMPON RSB 1000 NV",null,{"$f":"D1332+D1333","v":3282},null,"/","/","/",3661238495937,null,null,null,null,"C7"]
[100017475,"BALLON SOLAIRE TAMPON RSB 1500 NV",null,{"$f":"D1334+D1335","v":3959},null,"/","/","/",3661238495968,null,null,null,null,"C7"]
[100017476,"BALLON SOLAIRE TAMPON RSB 2000 NV",null,{"$f":"D1336+D1337","v":5201},null,"/","/","/",3661238495975,null,null,null,null,"C7"]
[100017477,"BALLON SOLAIRE TAMPON RSB 2500 N",null,{"$f":"D1338+D1339","v":5937},null,"/","/","/",3661238495982,null,null,null,null,"C7"]
[100017478,"BALLON SOLAIRE TAMPON RSB 3000 N",null,{"$f":"D1340+D1341","v":6219},null,"/","/","/",366123849599,null,null,null,null,"C7"]
[]
["COMPOSANTS"]
[100017467,"CUVE RSB 800 NV",null,2373,null,"/","/","/",3661238495791,178,850,820,2200,"C7"]
[100017468,"HABILLAGE RSB 800 NV",null,565,null,"/","/","/",3661238495807,29.5,1240,360,2100,"C7"]
[100017470,"CUVE RSB 1000 NV",null,2659,null,"/","/","/",3661238495913,218,850,820,2200,"C7"]
[100017471,"HABILLAGE RSB 1000 NV",null,623,null,"/","/","/",3661238495920,32.5,1240,360,2100,"C7"]
[100017473,"CUVE RSB 1500 NV",null,2941,null,"/","/","/",3661238495944,238,850,820,2200,"C7"]
[100017474,"HABILLAGE RSB 1500 NV",null,1018,null,"/","/","/",3661238495951,35.5,1240,360,2100,"C7"]
[100017479,"CUVE RSB 2000 NV",null,3844,null,"/","/","/",3661238496002,258,850,820,2200,"C7"]
[100017480,"HABILLAGE RSB 2000 NV",null,1357,null,"/","/","/",3661238496019,35.799999999999997,1240,360,2100,"C7"]
[100017481,"CUVE RSB 2500 NV",null,4241,null,"/","/","/",3661238496026,278,850,820,2200,"C7"]
[100017482,"HABILLAGE RSB 2500 NV",null,1696,null,"/","/","/",3661238496033,41.5,1240,360,2100,"C7"]
[100017483,"CUVE RSB 3000 NV",null,4410,null,"/","/","/",3661238496040,298,850,820,2200,"C7"]
[100017484,"HABILLAGE RSB 3000 NV",null,1809,null,"/","/","/",3661238496057,44.5,1240,360,2100,"C7"]
[]
["OPTIONS"]
[89757750,"RESIST.ELECT.6KW+THERM RSB800-3000","AJ36",615,null,"/","/","/",3661238046863,2.5,695,170,180,"C7"]
[100019313,"KIT ELECTRIQUE 9 KW/400V 1 1/2 ( POUR RSB 1000 A 3000 )","AJ47",637,null,"/","/","/",3661238553316,4.5,695,170,180,"C7"]
[100019314,"KIT ELECTRIQUE 12 KW/400V  1 1/2  ( POUR RSB 1500 A 3000 )","ER335",713,null,"/","/","/",3661238553323,2.8,1210,190,140,"C7"]
[]
["ACCESSOIRES"]
[100008733,"VASE D'EXPANSION 100 l","EG120",394,null,"/","/","/",3661238166424,17,800,460,470,"C7"]
[100008735,"VASE D'EXPANSION 200 l","EG122",624,null,"/","/","/",3661238166417,36,1020,560,570,"C7"]
[100008736,"VASE D'EXPANSION 300 l","EG123",1119,null,"/","/","/",3661238166400,68,1180,640,640,"C7"]
[100012031,"VALISE DE CONTROLE PR.INST. SOLAIRE","ER50",498,null,"/","/","/",3661238352315,2.5,225,130,60,"C7"]
[]
[]
[100008019,"PREPARATEUR ECS INSTANTANEE FWS 750","EC546",4709,null,"Pas concerné par l'étiquettage",null,null,3661238101111,252,1200,1200,2330,"C7"]
[100008150,"PREPARATEUR SOLAIRE OECOSUN DU 750-20 CL",null,{"$f":"SUM(D1360,D1361)","v":7383},null,"Pas concerné par l'étiquettage",null,null,3661238101232,null,null,null,null,"C0"]
[100017466,"PREPARATEUR SOLAIRE FWS 1500 COMPLET",null,{"$f":"D1362+D1363","v":6956},null,"Pas concerné par l'étiquettage",null,null,3661238495784,292,null,null,null,"C7"]
[]
["COMPOSANTS"]
[100007994,"CUVE (55 kW) & HABILLAGE DU 750-20 CL","EC545",4073,null,"/","/","/",3661238101234,242,1200,1200,2250,"C7"]
[100008115,"COLIS COMPOSANTS OECOSUN DU 750-20 ","EC562",3310,null,"/","/","/",3661238372436,56,1200,1400,2295,"C7"]
[100017463,"CUVE PREPARATEUR ECS FWS 1500","ER181",5881,null,"/","/","/",3661238495760,252,1200,1200,2330,"C7"]
[100017465,"HABILLAGE PREPARATEUR FWS 1500","ER182",1075,null,"/","/","/",3661238495777,40,1200,350,2100,"C7"]
[]
["OPTIONS"]
[100015099,"KIT DE BOUCLAGE ECS","ER29",174,null,"/","/","/",3661238496194,2.4,410,300,40,"C7"]
[89757746,"THERMOMETRE","AJ32",50,null,"/","/","/",3661238046887,0.18,145,190,125,"C0"]
[]
["ACCESSOIRES HYDRAULIQUES"]
["STATIONS SOLAIRES"]
[7619964,"STATION SOLAIRE SKS 13-45","ER665",662,0.17,"/","/","/",3661238608627,27.8,680,430,250,"C7"]
[100017486,"MODULE TRANSFERT SOLAIRE DRAIN BACK DB-20","ER301",2715,0.17,"/","/","/",3661238496071,10,500,280,235,"C7"]
[7619966,"STATION SOLAIRE STS 14-30 CME","ER667",2649,0.17,"/","/","/",3661238608634,19.8,670,370,310,"C7"]
[7619967,"STATION SOLAIRE STS 14-50 CME","ER668",3057,0.17,"/","/","/",3661238608641,35,860,675,380,"C7"]
[7619968,"STATION SOLAIRE STS 14-100 CME","ER669",6114,0.17,"/","/","/",3661238608658,44,860,680,365,"C7"]
["RÉGULATIONS SOLAIRES OETROSOL/DELTASOL",null,null,null,null,null,null,null,null,""]
[7619972,"RÉGULATION \"DELTASOL E\" POUR STATION TRANSFERT SOLAIRE","ER315",702,0.08,"/","/","/",3661238496217,230,200,90,1.3,"C7"]
[7630422,"REGULATION OETROSOL-PLUS","ER709",255,0.08,"/","/","/",3661238631045,0.69,227,194,85,"C7"]
[]
["COMPTAGE D'ENERGIE"]
[100014590,"RÉGULATION COMPTEUR D'ENERGIE WMZ 13530350 ","ER131",289,0.08,"/","/","/",3661238376014,0.6,230,195,80,"C7"]
[100013514,"DATALOGGER DL2 POUR GRS","ER55",451,0.08,"/","/","/",3661238364394,110,90,40,0.1,"C7"]
[100017498,"CENTRALE DE MESURE D'ENERGIE CME","ER313",1641,0.08,"/","/","/",3661238496194,1.18,280,210,120,"C7"]
["RÉGULATION CHARGE BALLON"]
[100004650,"REGULATION \"MCDB\" POUR CHARGE/DECHARGE BALLON ","EC162",264,0.08,"/","/","/",3661238002425,0.97,230,195,85,"C0"]
[100007832,"RÉGULATION POMPE DE CHARGE SLA 2","EC320",204,0.08,"/","/","/",3661238101494,225,195,85,0.7,"C0"]
[]
["OPTIONS"]
[null,"OPTIONS POUR REGULATION CIRCUIT SOLAIRE"]
[7630423,"KIT RACCORDEMENT PMW 2e POMPE SOLAIRE OETROSOL-PLUS","ER712",51,0.01,"/","/","/",3661238631052,null,null,null,null,"C7"]
[7630424,"KIT CABLE DE LIAISON ModBUS (3m) OETROSOL-PLUS","ER713",31,0.01,"/","/","/",3661238631069,null,null,null,null,"C7"]
[100017499,"MODULE REPORT DE PANNE OETROSOL AM1","ER314",176,0.08,"/","/","/",3661238496200,0.13,170,100,30,"C7"]
[100011341,"KIT 2 VANNES/SONDE CAPT.EST-OUEST","EC432",445,null,"/","/","/",3661238340213,1.3,240,160,70,"C0"]
[89804803,"VANNE 3 VOIES 3/4\" POUR 2 CIRCUITS","EC164",232,null,"/","/","/",3661238046528,205,125,90,1.1000000000000001,"C7"]
[89804816,"BOITIER PARA FOUDRE POUR SONDE PANNEAUX SOLAIRES","EC176",39,null,"/","/","/",3661238046450,0.11,220,165,40,"C7"]
[89804815,"SONDE D'IRRADIATION CS10","EC175",142,null,"/","/","/",3661238046467,0.05,190,120,30,"C7"]
[100008011,"SONDE CAPTEUR  PT1000 ","EC155",57,0.01,"/","/","/",3661238101197,0.1,180,120,20,"C7"]
[null,"OPTIONS POUR COMPTAGE D'ENERGIE "]
[100004652,"DEBIMETRE VOLUMIQUE V40-15","EC174",406,null,"/","/","/",3661238002401,1.5,240,160,110,"C7"]
[100017493,"COMPTEUR EAU FROIDE ACS 5m3/H","ER308",747,null,"/","/","/",3661238496149,10,500,280,235,"C7"]
[100017492,"COMPTEUR EAU FROIDE ACS 3,5m3/H","ER307",678,null,"/","/","/",3661238496132,10,500,280,235,"C7"]
[100017494,"COMPTEUR EAU FROIDE ACS 10m3/H","ER309",961,null,"/","/","/",3661238496156,10,500,280,235,"C7"]
[100017495,"COMPT.FLU.CHAUD US ECHO 1.5M3","ER310",430,null,"/","/","/",3661238496163,10,500,280,235,"C7"]
[100017496,"COMPT.FLU.CHAUD US ECHO 2.5M3","ER311",476,null,"/","/","/",3661238496170,10,500,280,235,"C7"]
[100017497,"COMPT.FLU.CHAUD US ECHO 3.5M3/H ","ER312",531,null,"/","/","/",3661238496187,10,500,280,235,"C7"]
[100017498,"CENTRALE DE MESURE D'ENERGIE CME","ER313",1641,0.08,"/","/","/",3661238496194,1.18,280,210,120,"C7"]
[]
["OPTIONS POUR INSTALLATIONS SOLAIRES"]
[89807349,"POIGNETS DE TRANSPORT ET DE MANUTENTION (4 PIECES)","EG349",141,null,"/","/","/",3661238045606,1.22,220,220,80,"C7"]
[89807769,"POMPE A MAIN POUR AJOUT DE FLUIDE","EG80",173,null,"/","/","/",3661238045132,1.01,215,150,80,"C7"]
[89807797,"DENSIMETRE (ANTIGEL \"L\") A CADRAN","EG102",51,null,"/","/","/",3661238045002,0.14000000000000001,160,125,40,"C7"]
[89807798,"DENSIMETRE (AEROMETRE) FLUIDE \"L\"+\"LS\"","EG103",173,null,"/","/","/",3661238044999,0.31,230,130,60,"C7"]
[89807799,"REFRACTOMETRE POUR FLUIDE \"L\"+\"LS\"","EG104",362,null,"/","/","/",3661238044982,0.32,210,80,55,"C7"]
[89807770,"STATION DE REMPLISSAGE (POMPE)","EG81",1043,0.17,"/","/","/",3661238045125,24.1,1020,465,495,"C7"]
[]
["FAMILLE:","CHAUDIERE  MURALE GAZ A CONDENSATION"]
[]
[]
[100020008,"GMX-M 2024 CONDENS HOR",null,{"$f":"D1427+D1430","v":2106},null,"A","A","XL",null,null,null,null,null,"C5"]
[100020009,"GMX-M 2024 CONDENS VER",null,{"$f":"D1427+D1431+D1432","v":2168},null,"A","A","XL",null,null,null,null,null,"C5"]
[100020011,"GMX-M 2024 COMBI CONDENS HOR",null,{"$f":"D1428+D1430","v":2283},null,"A","A","XL",null,null,null,null,null,"C5"]
[100020012,"GMX-M 2024 COMBI CONDENS VER",null,{"$f":"D1428+D1431+D1432","v":2345},null,"A","A","XL",null,null,null,null,null,"C5"]
[100020013,"GMX-M 2030 COMBI CONDENS HOR",null,{"$f":"D1429+D1430","v":2770},null,"A","A","XL",null,null,null,null,null,"C5"]
[100020014,"GMX-M 2030 COMBI CONDENS VER",null,{"$f":"D1429+D1431+D1432","v":2832},null,"A","A","XL",null,null,null,null,null,"C5"]
[]
["COMPOSANTS"]
[90864,"GMX-M 2024 CONDENS ","HR64",1992,null,"A","A","XL",8713809255831,39,600,400,510,"C5"]
[90865,"GMX-M 2024 COMBI CONDENS ","HR65",2169,null,"A","A","XL",8713809255848,40,600,400,510,"C5"]
[90866,"GMX-M 2030 COMBI CONDENS ","HR66",2656,null,"A","A","XL",8713809255855,41.5,600,400,510,"C5"]
[100008296,"TERMINAL HORIZONTAL PPS Ø 60/100 MM LG=800 MM","DY871",114,null,"/","/","/",3661238168022,2.8,1200,200,200,"C0"]
["S101688","ADAPTATEUR AIR/FUMEES D80/125","HR68",24,null,"/","/","/",8713809243722,0.3,175,180,130,"C0"]
[100002732,"TERMINAL VERTICAL PPS Ø 80/125 MM NOIR","DY843",152,null,"/","/","/",3661238006621,4.2,1210,270,240,"C0"]
[]
[]
[100020015,"GMX-M 2024 Condens HOR BM 80",null,{"$f":"D1441+D1442+D1443+D1446+D1447","v":2992},null,"A","A","XL",null,91.2,null,null,null,"C5"]
[100020016,"GMX-M 2024 Condens VER BM 80",null,{"$f":"D1441+D1442+D1443+D1446+D1448+D1449","v":3054},null,"A","A","XL",null,92.9,null,null,null,"C5"]
[100020017,"GMX-M 2024 Condens HOR OBU 130",null,{"$f":"D1441+D1444+D1445+D1446+D1447","v":3161},null,"A","A","XL",null,110.2,null,null,null,"C5"]
[100020018,"GMX-M 2024 Condens VER OBU 130",null,{"$f":"D1440+D1441+D1444+D1445+D1446+D1448+D1449","v":3223},null,"A","A","XL",null,111.9,null,null,null,"C5"]
[]
["COMPOSANTS"]
[90864,"GMX-M 2024 CONDENS ","HR64",1992,null,"A","A","XL",8713809255831,39,600,390,520,"C5"]
[100005562,"BALLON JUXTAPOSABLE  BMR 80  ROND","EE53",735,null,"/","/","/",3661238092013,48,510,490,1040,"C0"]
[7601255,"KIT DE RACCORDEMENT POUR BMR 80","HR93",105,null,"/","/","/",3661238572317,1.6,405,210,110,"C5"]
[89539164,"OBU 130","EE29",938,null,"/","/","/",3661238047617,67.5,700,700,980,"C0"]
[7600413,"KIT DE RACCORDEMENT POUR BALLON DE 130 L","HR92",71,null,"/","/","/",3661238572324,0.96,400,210,110,"C5"]
[100005661,"SONDE BALLON 5M LONG NTC 12K","AD226",46,0.01,"/","/","/",3661238109452,0.1,140,70,115,"C5"]
[100008296,"TERMINAL HORIZONTAL PPS Ø 60/100 MM LG=800 MM","DY871",114,null,"/","/","/",3661238168022,2.8,1200,200,200,"C0"]
["S101688","ADAPTATEUR AIR/FUMEES D80/125","HR68",24,null,"/","/","/",8713809243722,0.2,175,180,130,"C0"]
[100002732,"TERMINAL VERTICAL PPS Ø 80/125 MM NOIR","DY843",152,null,"/","/","/",3661238006621,4.2,1210,270,240,"C0"]
[]
[]
[7614687,"GMR 2024 CONDENS HOR FILAIRE",null,{"$f":"D1460+D1463+D1466+D1467+D1468","v":2391},null,"A+ avec sonde\next. et int."," /"," /",null,null,null,null,null,"C5"]
[7614688,"GMR 2024 CONDENS VER FILAIRE",null,{"$f":"D1460+D1464+D1465+D1466+D1467+D1468","v":2453},null,"A+ avec sonde\next. et int."," /"," /",null,null,null,null,null,"C5"]
[7614689,"GMR 2024 COMBI CONDENS HOR FILAIRE",null,{"$f":"D1461+D1463+D1466+D1467+D1468","v":2568},null,"A+ avec sonde\next. et int.","A","XL",null,null,null,null,null,"C5"]
[7614690,"GMR 2024 COMBI CONDENS VER FILAIRE",null,{"$f":"D1461+D1464+D1465+D1466+D1467+D1468","v":2630},null,"A+ avec sonde\next. et int.","A","XL",null,null,null,null,null,"C5"]
[7614691,"GMR 2030 COMBI CONDENS HOR FILAIRE",null,{"$f":"D1462+D1463+D1466+D1467+D1468","v":3055},null,"A+ avec sonde\next. et int.","A","XL",null,null,null,null,null,"C5"]
[7614692,"GMR 2030 COMBI CONDENS VER FILAIRE",null,{"$f":"D1462+D1464+D1465+D1466+D1467+D1468","v":3117},null,"A+ avec sonde\next. et int.","A","XL",null,null,null,null,null,"C5"]
[]
["COMPOSANTS"]
[90864,"GMX-M 2024 CONDENS ","HR64",1992,null,"A"," /"," /",8713809255831,39,600,400,510,"C5"]
[90865,"GMX-M 2024 COMBI CONDENS ","HR65",2169,null,"A","A","XL",8713809255848,40,600,400,510,"C5"]
[90866,"GMX-M 2030 COMBI CONDENS ","HR66",2656,null,"A","A","XL",8713809255855,41.5,600,400,510,"C5"]
[100008296,"TERMINAL HORIZONTAL PPS Ø 60/100 MM LG=800 MM","DY871",114,null,"/","/","/",3661238168022,2.8,1200,200,200,"C0"]
["S101688","ADAPTATEUR AIR/FUMEES D80/125","HR68",24,null,"/","/","/",8713809243722,0.3,175,180,130,"C0"]
[100002732,"TERMINAL VERTICAL PPS Ø 80/125 MM NOIR","DY843",152,null,"/","/","/",3661238006621,4.2,1210,270,240,"C0"]
[7609765,"THERMOSTAT D'AMBIANCE MODULANT FILAIRE RS200 -3","AD306",202,0.08,"/","/","/",8713809266462,0.35099999999999998,150,100,50,"C0"]
["S103361","CACHE TUYAUTERIE","HR72",43,null,"/","/","/",8713809260972,0.84,370,370,150,"C0"]
[85757741,"SONDE EXTERIEURE","FM46",40,0.01,"/","/","/",3661238022751,0.12,200,150,40,"C0"]
[]
[]
[7614693,"GMR 2024 CONDENS HOR RADIO",null,{"$f":"D1479+D1482+D1485+D1486+D1487","v":2522},null,"A+ avec sonde\next. et int.","/","/",null,null,null,null,null,"C5"]
[7614694,"GMR 2024 CONDENS VER RADIO",null,{"$f":"D1479+D1483+D1484+D1485+D1486+D1487","v":2584},null,"A+ avec sonde\next. et int."," /"," /",null,null,null,null,null,"C5"]
[7614695,"GMR 2024 COMBI CONDENS HOR RADIO",null,{"$f":"D1480+D1482+D1485+D1486+D1487","v":2699},null,"A+ avec sonde\next. et int.","A","XL",null,null,null,null,null,"C5"]
[7614696,"GMR 2024 COMBI CONDENS VER RADIO",null,{"$f":"D1480+D1483+D1484+D1485+D1486+D1487","v":2761},null,"A+ avec sonde\next. et int.","A","XL",null,null,null,null,null,"C5"]
[7614697,"GMR 2030 COMBI CONDENS HOR RADIO",null,{"$f":"D1481+D1482+D1485+D1486+D1487","v":3186},null,"A+ avec sonde\next. et int.","A","XL",null,null,null,null,null,"C5"]
[7614698,"GMR 2030 COMBI CONDENS VER RADIO",null,{"$f":"D1481+D1483+D1484+D1485+D1486+D1487","v":3248},null,"A+ avec sonde\next. et int.","A","XL",null,null,null,null,null,"C5"]
[]
["COMPOSANTS"]
[90864,"GMX-M 2024 CONDENS ","HR64",1992,null,"A","/","/",8713809255831,39,600,400,510,"C5"]
[90865,"GMX-M 2024 COMBI CONDENS ","HR65",2169,null,"A","A","XL",8713809255848,40,600,400,510,"C5"]
[90866,"GMX-M 2030 COMBI CONDENS ","HR66",2656,null,"A","A","XL",8713809255855,41.5,600,400,510,"C5"]
[100008296,"TERMINAL HORIZONTAL PPS Ø 60/100 MM LG=800 MM","DY871",114,null,"/","/","/",3661238168022,2.8,1200,200,200,"C0"]
["S101688","ADAPTATEUR AIR/FUMEES D80/125","HR68",24,null,"/","/","/",8713809243722,0.3,175,180,130,"C0"]
[100002732,"TERMINAL VERTICAL PPS Ø 80/125 MM NOIR","DY843",152,null,"/","/","/",3661238006621,4.2,1210,270,240,"C0"]
[7609764,"THERMOSTAT D'AMBIANCE MODULANT RADIO RS200 -3R","AD305",333,0.08,"/","/","/",8713809266455,0.76600000000000001,150,100,110,"C0"]
["S103361","CACHE TUYAUTERIE","HR72",43,null,"/","/","/",8713809260972,0.84,370,370,150,"C0"]
[85757741,"SONDE EXTERIEURE","FM46",40,0.01,"/","/","/",3661238022751,0.12,200,150,40,"C0"]
[]
[]
[7614699,"GMR 2024 CONDENS HOR FILAIRE BM 80",null,{"$f":"D1496+D1497+D1498+D1501+D1502+D1505+D1506+D1507","v":3277},null,"A+ avec sonde\next. et int.","A","XL",null,91.2,null,null,null,"C5"]
[7614700,"GMR 2024 CONDENS VER FILAIRE BM 80",null,{"$f":"D1496+D1497+D1498+D1501+D1503+D1504+D1505+D1506+D1507","v":3339},null,"A+ avec sonde\next. et int.","A","XL",null,92.9,null,null,null,"C5"]
[7614701,"GMR 2024 CONDENS HOR FILAIRE OBU 130",null,{"$f":"D1496+D1499+D1500+D1501+D1502+D1505+D1506+D1507","v":3446},null,"A+ avec sonde\next. et int.","A","XL",null,110.2,null,null,null,"C5"]
[7614702,"GMR 2024 Condens VER FILAIRE OBU 130",null,{"$f":"D1495+D1496+D1499+D1500+D1501+D1503+D1504+D1505+D1506+D1507","v":3508},null,"A+ avec sonde\next. et int.","A","XL",null,111.9,null,null,null,"C5"]
[]
["COMPOSANTS"]
[90864,"GMX-M 2024 CONDENS ","HR64",1992,null,"A","/","/",8713809255831,39,600,390,520,"C5"]
[100005562,"BALLON JUXTAPOSABLE  BMR 80  ROND","EE53",735,null,"/","/","/",3661238092013,48,510,490,1040,"C0"]
[7601255,"KIT DE RACCORDEMENT POUR BMR 80","HR93",105,null,"/","/","/",3661238572317,1.6,405,210,110,"C5"]
[89539164,"OBU 130","EE29",938,null,"/","/","/",3661238047617,67.5,700,700,980,"C0"]
[7600413,"KIT DE RACCORDEMENT POUR BALLON DE 130 L","HR92",71,null,"/","/","/",3661238572324,0.96,400,210,110,"C5"]
[100005661,"SONDE BALLON 5M LONG NTC 12K","AD226",46,0.01,"/","/","/",3661238109452,0.1,140,70,115,"C5"]
[100008296,"TERMINAL HORIZONTAL PPS Ø 60/100 MM LG=800 MM","DY871",114,null,"/","/","/",3661238168022,2.8,1200,200,200,"C0"]
["S101688","ADAPTATEUR AIR/FUMEES D80/125","HR68",24,null,"/","/","/",8713809243722,0.2,175,180,130,"C0"]
[100002732,"TERMINAL VERTICAL PPS Ø 80/125 MM NOIR","DY843",152,null,"/","/","/",3661238006621,4.2,1210,270,240,"C0"]
[7609765,"THERMOSTAT D'AMBIANCE MODULANT FILAIRE RS200 -3","AD306",202,0.08,"/","/","/",8713809266462,0.35099999999999998,150,100,50,"C0"]
["S103361","CACHE TUYAUTERIE","HR72",43,null,"/","/","/",8713809260972,0.84,370,370,150,"C0"]
[85757741,"SONDE EXTERIEURE","FM46",40,0.01,"/","/","/",3661238022751,0.12,200,150,40,"C0"]
[]
[]
[7614703,"GMR 2024 CONDENS HOR RADIO BM 80",null,{"$f":"D1516+D1517+D1518+D1521+D1522+D1525+D1526+D1527","v":3408},null,"A+ avec sonde\next. et int.","A","XL",null,91.2,null,null,null,"C5"]
[7614704,"GMR 2024 CONDENS VER RADIO BM 80",null,{"$f":"D1516+D1517+D1518+D1521+D1523+D1524+D1525+D1526+D1527","v":3470},null,"A+ avec sonde\next. et int.","A","XL",null,92.9,null,null,null,"C5"]
[7614705,"GMR 2024 CONDENS HOR RADIO OBU 130",null,{"$f":"D1516+D1519+D1520+D1521+D1522+D1525+D1526+D1527","v":3577},null,"A+ avec sonde\next. et int.","A","XL",null,110.2,null,null,null,"C5"]
[7614706,"GMR 2024 CONDENS VER RADIO OBU 130",null,{"$f":"D1515+D1516+D1519+D1520+D1521+D1523+D1524+D1525+D1526+D1527","v":3639},null,"A+ avec sonde\next. et int.","A","XL",null,111.9,null,null,null,"C5"]
[]
["COMPOSANTS"]
[90864,"GMX-M 2024 CONDENS ","HR64",1992,null,"A","/","/",8713809255831,39,600,390,520,"C5"]
[100005562,"BALLON JUXTAPOSABLE  BMR 80  ROND","EE53",735,null,"/","/","/",3661238092013,48,510,490,1040,"C0"]
[7601255,"KIT DE RACCORDEMENT POUR BMR 80","HR93",105,null,"/","/","/",3661238572317,1.6,405,210,110,"C5"]
[89539164,"OBU 130","EE29",938,null,"/","/","/",3661238047617,67.5,700,700,980,"C0"]
[7600413,"KIT DE RACCORDEMENT POUR BALLON DE 130 L","HR92",71,null,"/","/","/",3661238572324,0.96,400,210,110,"C5"]
[100005661,"SONDE BALLON 5M LONG NTC 12K","AD226",46,0.01,"/","/","/",3661238109452,0.1,140,70,115,"C5"]
[100008296,"TERMINAL HORIZONTAL PPS Ø 60/100 MM LG=800 MM","DY871",114,null,"/","/","/",3661238168022,2.8,1200,200,200,"C0"]
["S101688","ADAPTATEUR AIR/FUMEES D80/125","HR68",24,null,"/","/","/",8713809243722,0.2,175,180,130,"C0"]
[100002732,"TERMINAL VERTICAL PPS Ø 80/125 MM NOIR","DY843",152,null,"/","/","/",3661238006621,4.2,1210,270,240,"C0"]
[7609764,"THERMOSTAT D'AMBIANCE MODULANT RADIO RS200 -3R","AD305",333,0.08,"/","/","/",8713809266455,0.76600000000000001,150,100,110,"C0"]
["S103361","CACHE TUYAUTERIE","HR72",43,null,"/","/","/",8713809260972,0.84,370,370,150,"C0"]
[85757741,"SONDE EXTERIEURE","FM46",40,0.01,"/","/","/",3661238022751,0.12,200,150,40,"C0"]
[]
["OPTIONS CHAUDIERES"]
["S103219","CADRE RÉHAUSSEUR ","HR79",120,null,"/","/","/",8713809261085,1.9,605,410,170,"C0"]
["S101703","KIT TUBULURE DE RACCORDEMENT POUR CADRE REHAUSSEUR","HR80",105,null,"/","/","/",8713809261092,1.2,650,200,130,"C0"]
["S103361","CACHE TUYAUTERIE","HR72",43,null,"/","/","/",8713809260972,0.84,370,370,150,"C0"]
["S101711","ADAPTATEUR BI-FLUX   2x80","HR70",29,null,"/","/","/",8713809243753,0.22,240,180,180,"C0"]
[100020019,"KIT DE RACCORDEMENT 3CEP Ø 80/125MM","DY921",143,null,"/","/","/",3661238571815,2.2000000000000002,650,205,200,"C0"]
[7600374,"DOSSERET DE MONTAGE CHAUFFAGE SEUL","HR75",186,null,"/","/","/",8713809261054,2.5499999999999998,350,260,150,"C0"]
[7600371,"DOSSERET DE MONTAGE CHAUDIÈRE MIXTE","HR74",220,null,"/","/","/",8713809261047,2,350,260,150,"C0"]
[7600630,"KIT TUBULURE DE RACCORDEMENT NEUF","HR77",44,null,"/","/","/",8713809261061,0.4,200,100,50,"C0"]
[7600394,"KIT REMPLACEMENT  A VISSER - C&M NECTRA","HR88",73,null,"/","/","/",8713809261108,1.7,320,240,180,"C0"]
[7600407,"KIT REMPLACEMENT  A VISSER - ELM","HR89",73,null,"/","/","/",8713809261115,1.5,320,240,180,"C0"]
[7600409,"KIT REMPLACEMENT  A VISSER - C&M CELTIC","HR90",73,null,"/","/","/",8713809261122,1.64,320,240,180,"C0"]
[7600410,"KIT REMPLACEMENT  A VISSER - SD","HR91",73,null,"/","/","/",8713809261139,1.62,320,240,180,"C0"]
["S101706","POMPE CLASSE A","HR78",253,null,"/","/","/",8713809261078,1.18,150,150,125,"C0"]
[7601016,"CACHE TUBULURE POUR KIT DE REMPLACEMENT A VISSER","HR73",66,null,"/","/","/",8713809260965,2,375,345,260,"C0"]
["S101690","KIT SONDE TEMPERATURE FUMEE","HR71",66,0.01,"/","/","/",8713809261030,0.1,200,130,50,"C0"]
["S101707","BROSSE DE NETTOYAGE ECHANGEUR","HR81",29,null,"/","/","/",8713809259976,0.2,365,290,50,"C0"]
["S101708","KIT DE NETTOYAGE ECHANGEUR A PLAQUES","HR82",230,null,"/","/","/",8713809243746,0.9,300,155,140,"C0"]
["S101739","OUTIL DE SERVICE ","HR83",154,0.08,"/","/","/",8713809259952,0.23,180,100,80,"C0"]
[7613605,"STATION DE NEUTRALISATION DN1","SA1",337,null,"/","/","/",3661238592117,14.5,350,230,350,"C0"]
[7613606,"SUPPORT FIXATION MURAL","SA2",62,null,"/","/","/",3661238592124,2.1,300,240,160,"C0"]
[7613609,"STATION DE NEUTRALISATION DN2 ","SA3",591,null,"/","/","/",3661238592131,29.5,450,320,400,"C0"]
[85317025,"RECHARGE 2 KG POUR NEUTRALISATION","HC35",137,null,"/","/","/",3661238091610,3.7,510,315,190,"C0"]
[100019963,"VENTOUSE HORIZONTALE PPS 60/100 SANS COUDE ","DY920",76,null,"/","/","/",3661238571211,2.2999999999999998,1210,265,250,"C0"]
["S101712","COUDE REDUIT POUR VENTOUSE HORIZONTALE","HR67",29,null,"/","/","/",8713809243760,0.4,250,200,180,"C0"]
[100020045,"KIT FILTRE FERNOX TF1",null,253,null,null,null,null,null,null,null,null,null,"C0"]
[]
["REGULATIONS",null,null,null,null,null,null,null,""]
[88017904,"THERMOSTAT AMBIANCE PROGRAMMABLE","AD191",158,0.08,"/","/","/",3661238102415,0.25,135,90,55,"C0"]
[88017010,"THERMOSTAT D'AMBIANCE PROGRAMMABLE (SANS FILS)","AD192",280,0.08,"/","/","/",3661238102439,0.42499999999999999,180,150,90,"C0"]
[85757741,"SONDE EXTERIEURE","FM46",40,0.01,"/","/","/",3661238022751,0.1,200,150,40,"C0"]
[7609764,"THERMOSTAT D'AMBIANCE MODULANT RADIO RS200 -3R","AD305",333,0.08,"/","/","/",8713809266455,0.76600000000000001,150,100,110,"C0"]
[7609765,"THERMOSTAT D'AMBIANCE MODULANT FILAIRE RS200 -3","AD306",202,0.08,"/","/","/",8713809266462,0.35099999999999998,150,100,50,"C0"]
[7612346," COMMANDE A DISTANCE SIMPLIFIEE RS20-OT FILAIRE","AD302",104,0.08,"/","/","/",3661238599666,0.151,109,90,48,"C0"]
[]
["FUMISTERIE"]
[null,"ALU Ø 80 MM"]
[84887600,"TUBE D'INSPECTION Ø 80 mm ","DY600",47,null,"/","/","/",3661238013094,0.49,300,145,150,"C0"]
[84887738,"TE DE VISITE Ø 80 mm ","DY738",70,null,"/","/","/",3661238011755,0.66,285,215,165,"C0"]
[84887604,"RALLONGE Ø 80 mm    L= 250 mm  (2 PIECES)","DY604",36,null,"/","/","/",3661238013056,0.65,255,170,175,"C0"]
[84887605,"RALLONGE Ø 80 mm    L=  500 mm  (2 PIECES)","DY605",44,null,"/","/","/",3661238013049,1.26,520,175,170,"C0"]
[84887606,"RALLONGE 1000 mm  (2 PIECES)","DY606",71,null,"/","/","/",3661238013032,2.52,1020,175,175,"C0"]
[84887607,"RALLONGE Ø 80 mm    L=  1950 mm   (2 PIECES)","DY607",118,null,"/","/","/",3661238013025,5,1985,170,175,"C0"]
[84887608,"COUDE A 90°","DY608",23,null,"/","/","/",3661238013018,0.34,155,160,160,"C0"]
[84887609,"COUDE A 45°  (2 PIECES)","DY609",39,null,"/","/","/",3661238013001,0.48,200,200,150,"C0"]
[null,"PPS/ALU 60/100"]
[100008296,"TERMINAL HORIZONTAL PPS  Ø 60/100 mm LG = 800 mm","DY871",114,null,"/","/","/",3661238168022,2.78,1200,200,200,"C0"]
[100017526,"TERMINAL REFTROFIT Ø 60/100","DY912",113,null,"/","/","/",3661238496323,0.9,1200,180,110,"C0"]
[84887681,"PPS-ALU RALLONGE CONCENTRIQUE  ø 60/100 mm L=  500 mm","DY681",40,null,"/","/","/",3661238012288,0.72,510,135,140,"C0"]
[84887682,"PPS-ALU RALLONGE CONCENTRIQUE ø 60/100 mm L=1000 mm","DY682",50,null,"/","/","/",3661238012271,1.38,1010,130,135,"C0"]
[84887683,"PPS-ALU RALLONGE CONCENTRIQUE ø 60/100mm L=1950mm","DY683",102,null,"/","/","/",3661238012264,2.81,1960,150,150,"C0"]
[84887684,"PPS-ALU COUDE CONCENTRIQUE MOULE à 87° ø 60/100 mm","DY684",42,null,"/","/","/",3661238012257,0.53,200,200,150,"C0"]
[84887685,"PPS-ALU COUDE CONCENTRIQUE MOULE à 45° ø 60/100 mm (2 PIECES)","DY685",79,null,"/","/","/",3661238012240,0.65,250,185,150,"C0"]
[84887686,"PPS-ALU COUDE CONCENTRIQUE MOULE à 30° ø 60/100 mm (2 PIECES)","DY686",156,null,"/","/","/",3661238012233,0.63,250,190,155,"C0"]
[84887687,"PPS-ALU COUDE CONCENTRIQUE MOULE à 15° ø 60/100 mm (2 PIECES)","DY687",156,null,"/","/","/",3661238012226,0.64,255,195,150,"C0"]
[84887688,"PPS-ALU MANCHON DE COMPENSATION DE 50 à 250 mm","DY688",70,null,"/","/","/",3661238012219,0.51,515,135,140,"C0"]
[84887689,"PPS-ALU  PIECE DE REVISIONDROITE  Ø 60/100 mm","DY689",129,null,"/","/","/",3661238012202,0.56999999999999995,255,185,150,"C0"]
[84887737,"PPS-ALU  Té DE REVISION  Ø 60/100 mm","DY737",129,null,"/","/","/",3661238011762,0.6,255,185,145,"C0"]
[84887702,"KIT DE RACCORDEMENT CHAUDIERE ALU/PPS Ø 60/100 mm","DY702",177,null,"/","/","/",3661238012080,1.94,500,290,260,"C0"]
[null,"FLEXIBLE PPS Ø 80"]
[84887716,"KIT N° 3 RACCORDEMENT CHAUDIERE  PPS ø 80/125 mm","DY716",141,null,"/","/","/",3661238011953,2.36,500,290,260,"C0"]
[100015325,"KIT N° 1 RACCORDEMENT CHEMINÉE FLEXIBLE PPS Ø 80 mm","DY895",231,null,"/","/","/",3661238380110,2.87,395,395,380,"C0"]
[100015327,"TUBE FLEXIBLE LG=12,5M","DY897",347,null,"/","/","/",3661238380134,8.6999999999999993,1200,1220,250,"C0"]
[100015326,"TUBE FLEXIBLE LG=50M","DY896",1216,null,"/","/","/",3661238380127,35,1600,1660,410,"C0"]
[84887618,"ETOILE DE CENTRAGE POUR FLEXIBLE Ø 80 MM (5 PIÈCES)","DY618",36,null,"/","/","/",3661238012912,0.2,300,300,70,"C0"]
[100015328,"PIÈCE DE COUPLAGE FLEXIBLE Ø 80 mm","DY898",70,null,"/","/","/",3661238380141,0.25,150,150,150,"C0"]
[100015331,"OUTIL D'AIDE À L'INSERTION Ø 80 mm","DY901",174,null,"/","/","/",3661238380172,1.4,300,210,185,"C0"]
[100015330,"PIÈCE D'INSPECTION POUR TUBE FLEXIBLE","DY900",125,null,"/","/","/",3661238380165,0.5,295,140,140,"C0"]
[100015329,"TERMINAL AVEC SOLIN FLEX. Ø 80 mm","DY899",174,null,"/","/","/",3661238380158,1.74,385,385,250,"C0"]
[100015880,"ADAPTATEUR PPS FLEX Ø 80 mm","DY904",41,null,"/","/","/",3661238417632,0.125,316,236,152,"C0"]
[100015881,"ADAPTATEUR PPS  Ø 110","DY905",49,null,"/","/","/",3661238417625,1.6,396,296,263,"C0"]
[84887589,"TERMINAL AVEC SOLIN PPS D100-110","DY189",225,null,"/","/","/",3661238013100,1.51,390,395,275,"C0"]
[300007172,"GRILLE DE PROTECTION INOX D.90MM",null,null,null,"/","/","/"]
[300007173,"GRILLE DE PROTECTION INOX D.120MM"]
[null,"CONDUITS 80 PPS"]
[84887701,"KIT  RACCORDEMENT CHEMINEE PPS Ø 60/80 MM ","DY701",264,null,"/","/","/",3661238012097,2.83,395,400,385,"C0"]
[100017527,"KIT DE BASE PPS/ALU Ø 80/125 ","DY913",163,null,"/","/","/",3661238496330,3.7,600,400,275,"C0"]
[84887717,"KIT N° 1 KIT DE RACCORDEMENT CHEMINEE PPS Ø 80 mm","DY717",154,null,"/","/","/",3661238011946,2.89,395,405,390,"C0"]
[84887546,"PIÈCE DE VISITE Ø 80 mm droite","DY146",57,null,"/","/","/",3661238013506,0.28999999999999998,300,145,150,"C0"]
[100008301,"COUDE DE REVISION 87° PPS Ø80mm","DY877",40,null,"/","/","/",3661238102026,0.24,190,195,145,"C0"]
[84887613,"RALLONGE PPS Ø 80 mm   L= 250 mm (2 PCS)","DY613",39,null,"/","/","/",3661238012967,0.37,250,170,175,"C0"]
[84887614,"RALLONGE PPS  Ø 80 mm   L=  500 mm (2 PCS)","DY614",37,null,"/","/","/",3661238012950,0.68,500,160,150,"C0"]
[84887615,"RALLONGE PPS  Ø 80 mm   L=  1000 mm (2 PCS)","DY615",50,null,"/","/","/",3661238012943,1.25,1000,160,145,"C0"]
[84887550,"RALLONGE PPS Ø 80 mm   L=  2000 mm  (2 PIECES)","DY150",76,null,"/","/","/",3661238013469,2.4900000000000002,1960,150,150,"C0"]
[84887552,"COUDE PPS à 90°","DY152",15,null,"/","/","/",3661238013445,0.2,255,145,150,"C0"]
[84887554,"COUDE PPS à 45°  (2 PCS)","DY154",34,null,"/","/","/",3661238013421,0.32,200,200,150,"C0"]
[84887563,"T PPS  AVEC COUVERCLE D'INSPECTION","DY163",57,null,"/","/","/",3661238013353,0.39,290,220,170,"C0"]
[84887551,"COLLIER DE CENTRAGE Ø 80 mm (2 PIECES)","DY151",13,null,"/","/","/",3661238013452,0.1,300,300,40,"C0"]
[null,"PPS/ALU 80/125"]
[100002732,"TERMINAL VERTICAL PPS Ø 80/125 mm NOIR","DY843",152,null,"/","/","/",3661238006621,4.2,1210,270,240,"C0"]
[100002733,"TERMINAL VERTICAL PPS Ø 80/125 mm ROUGE","DY844",151,null,"/","/","/",3661238006614,4.2,1210,265,240,"C0"]
[84887524,"PIECE D'INSPECTION DROITE ALU/PPS Ø 80/125 mm","DY124",108,null,"/","/","/",3661238013704,0.55000000000000004,300,145,150,"C0"]
[84887525,"T D'INSPECTION ALU/PPS Ø 80/125 mm","DY125",124,null,"/","/","/",3661238013698,0.82,315,235,150,"C0"]
[100008311,"COUDE DE REVISION ALU/PPS Ø 80/125 mm","DY875",113,null,"/","/","/",3661238101920,0.68,195,195,145,"C0"]
[84887526,"RALLONGE CONCENTRIQUE ALU/PPS  80/125 L= 250 mm","DY126",40,null,"/","/","/",3661238013681,0.47,255,145,150,"C0"]
[84887527,"RALLONGE CONCENTRIQUE ALU/PPS 80/125 L= 500mm","DY127",46,null,"/","/","/",3661238013674,0.9,520,140,140,"C0"]
[84887528,"RALLONGE CONCENTRIQUE ALU/PPS 80/125 L=1000 mm","DY128",68,null,"/","/","/",3661238013667,1.7,1010,135,140,"C0"]
[84887529,"RALLONGE CONCENTRIQUE ALU/PPS 80/125 L=1950 mm","DY129",118,null,"/","/","/",3661238013650,3.5,1960,150,150,"C0"]
[84887531,"COUDE A 87° ALU/PPS  Ø 80/125 mm","DY131",50,null,"/","/","/",3661238013636,0.66,200,200,150,"C0"]
[84887532,"COUDE CONCENTRIQUE 45° ALU/PPS Ø 80/125 mm (2 PCES)","DY132",76,null,"/","/","/",3661238013629,1,315,235,150,"C0"]
[84887708,"ADAPTATEUR ALU Ø 60/100 MM SUR 80/125 MM","DY708",57,null,"/","/","/",3661238012028,0.33,255,145,150,"C0"]
[100011367,"KIT DE TRANSFORMATION 3CE PRESSION ","DY884",39,null,"/","/","/",3661238415362,0.15,180,130,15,"C0"]
[null,"Divers"]
[84887411,"SORTIE HORIZONTALE TOIT PENTE DE 30° A 45° ( uniquement pour tuiles mécaniques)","DY11",175,null,"/","/","/",3661238013940,3.57,1020,700,370,"C0"]
[84837729,"SORTIE DE TOIT EN PENTE DE 40° A 60° ( uniquement pour tuiles mécaniques)","CX49",175,null,"/","/","/",3661238014367,3.5,920,700,320,"C0"]
[84837731,"EMBASE D'ETANCHE TOIT PLAT","CX51",42,null,"/","/","/",3661238014343,0.5,400,400,155,"C0"]
[84837121,"TUILE A DOUILLE 5 A 25 NOIRE","CX121",110,null,"/","/","/",3661238014428,2.96,510,250,145,"C0"]
[84837732,"TUILE A DOUILLE 25A35' NOIRE","CX52",76,null,"/","/","/",3661238014336,3,520,250,145,"C0"]
[84837734,"TUILE A DOUILLE 35 A 55° NOIRE ","CX63",95,null,"/","/","/",3661238014312,3.17,510,265,180,"C0"]
[84837120,"TUILE A DOUILLE 5 A 25° ROUGE","CX120",110,null,"/","/","/",3661238014435,3.02,515,245,145,"C0"]
[84837783,"TUILE A DOUILLE 25 A 35 ROUGE","CX83",76,null,"/","/","/",3661238014213,3,515,250,150,"C0"]
[84837784,"TUILE A DOUILLE 25 A 55 ROUGE","CX84",95,null,"/","/","/",3661238014206,2.95,520,265,180,"C0"]
[84837738,"MANCHON DE COMPENS LG 300","CX67",57,null,"/","/","/",3661238014275,1,515,135,140,"C0"]
[84837741,"PLATINE DE FINITION INTER","CX72",16,null,"/","/","/",3661238014251,0.54,245,210,3,"C0"]
[84887566,"PANIER DE PROTECTION INOX","DY166",79,null,"/","/","/",3661238013339,1.38,220,210,200,"C0"]
[84887752,"PLAQUE DE FINITION CHEMINEE ","DY752",35,null,"/","/","/",3661238011649,0.2,310,230,140,"C0"]
[]
[]
[7631981,"GMR 1024 CONDENS HOR-2",null,{"$f":"D1657+D1661","v":2181},null,"A"," /"," /",3661238635913,null,null,null,null,"C5"]
[7631983,"GMR 1024 CONDENS VER-2",null,{"$f":"D1657+D1663+D1662","v":2273},null,"A"," /"," /",3661238636019,null,null,null,null,"C5"]
[7631984,"GMR 1024 COMBI CONDENS HOR-2",null,{"$f":"D1658+D1661","v":2359},null,"A","A","XL",3661238636026,null,null,null,null,"C5"]
[7631985,"GMR 1024 COMBI CONDENS VER-2",null,{"$f":"D1658+D1662+D1663","v":2451},null,"A","A","XL",3661238636033,null,null,null,null,"C5"]
[7631986,"GMR 1030 COMBI CONDENS HOR-2",null,{"$f":"D1659+D1661","v":2839},null,"A","A","XL",3661238636040,null,null,null,null,"C5"]
[7631987,"GMR 1030 COMBI CONDENS VER-2",null,{"$f":"D1659+D1662+D1663","v":2931},null,"A","A","XL",3661238636057,null,null,null,null,"C5"]
[7631988,"GMR 1034 COMBI CONDENS HOR-2",null,{"$f":"D1660+D1661","v":2988},null,"A","A","XL",3661238636064,null,null,null,null,"C5"]
[7631989,"GMR 1034 COMBI CONDENS VER-2",null,{"$f":"D1660+D1662+D1663","v":3080},null,"A","A","XL",3661238636071,null,null,null,null,"C5"]
[]
["COMPOSANTS"]
[7625487,"GMR 1024 CONDENS -2","HG132",2067,null,"A"," /"," /",8713809270605,38,870,450,350,"C5"]
[7625488,"GMR 1024  COMBI CONDENS -2","HG133",2245,null,"A","A","XL",8713809270612,39,870,450,350,"C5"]
[7625489,"GMR 1030 COMBI CONDENS -2","HG134",2725,null,"A","A","XL",8713809270629,41,870,450,350,"C5"]
[7625490,"GMR 1034 COMBI CONDENS -2","HG135",2874,null,"A","A","XL",8713809270636,42,870,450,350,"C5"]
[100008296,"TERMINAL HORIZONTAL PPS  Ø 60/100 mm LG = 800 mm","DY871",114,null,"/","/","/",3661238168022,2.78,1200,200,200,"C0"]
["S100465","ADAPTATEUR AIR/FUMEES Ø 80/125","HR38",54,null,"/","/","/",3661238369917,1,190,190,130,"C0"]
[100002732,"TERMINAL VERTICAL PPS Ø 80/125 mm NOIR","DY843",152,null,"/","/","/",3661238006621,4.2,1210,270,240,"C0"]
[]
["GMR 1000 CONDENS-2 AVEC ECS PAR BALLON SEPARE"]
[7631990,"GMR 1024 CONDENS HOR BM 80-2",null,{"$f":"D1672+D1673+D1674+D1677+D1678","v":3067},null,"A","A","XL",3661238636132,null,null,null,null,"C5"]
[7631991,"GMR 1024 CONDENS VER BM 80-2",null,{"$f":"D1672+D1673+D1674+D1677+D1679+D1680","v":3159},null,"A","A","XL",3661238636125,null,null,null,null,"C5"]
[7631992,"GMR 1024 CONDENS HOR OBU 130-2",null,{"$f":"D1672+D1675+D1676+D1677+D1678","v":3240},null,"A","A","XL",3661238636118,null,null,null,null,"C5"]
[7631993,"GMR 1024 CONDENS VER OBU 130-2",null,{"$f":"D1672+D1675+D1676+D1677+D1679+D1680","v":3332},null,"A","A","XL",3661238636101,null,null,null,null,"C5"]
[]
["COMPOSANTS"]
[7625487,"GMR 1024 CONDENS -2","HG132",2067,null,"A"," /"," /",8713809270605,38,870,450,350,"C5"]
[100005562,"BALLON JUXTAPOSABLE  BMR 80  ROND","EE53",735,null,"/","/","/",3661238092013,48,510,490,1040,"C0"]
[100011287,"KIT DE RACCORDEMENT BMR 80","HG56",105,null,"/","/","/",3661238338371,1.27,400,210,110,"C5"]
[89539164,"OBU 130","EE29",938,null,"/","/","/",3661238092112,67.5,700,700,980,"C0"]
[100011288,"KIT DE RACCORDEMENT POUR BALLON DE 130 L","HG57",75,null,"/","/","/",3661238338388,0.76,400,210,110,"C5"]
[100005661,"SONDE BALLON 5M LONG NTC 12K","AD226",46,0.01,"/","/","/",3661238109452,0.15,140,70,115,"C5"]
[100008296,"TERMINAL HORIZONTAL PPS  Ø 60/100 mm LG = 800 mm","DY871",114,null,"/","/","/",3661238168022,2.78,1200,200,200,"C0"]
["S100465","ADAPTATEUR AIR/FUMEES Ø 80/125","HR38",54,null,"/","/","/",3661238369917,1,190,190,130,"C0"]
[100002732,"TERMINAL VERTICAL PPS Ø 80/125 mm NOIR","DY843",152,null,"/","/","/",3661238006621,4.2,1210,270,240,"C0"]
[]
[]
[7631994,"GMR 1024 CS CONDENS HOR-2",null,{"$f":"SUM(D1688+D1687)","v":3143},null,"A","A","XL",3661238636095,null,null,null,null,"C5"]
[7631995,"GMR 1024 CS CONDENS VER-2",null,{"$f":"D1687+D1690+D1691","v":3235},null,"A","A","XL",3661238636088,null,null,null,null,"C5"]
[]
["COMPOSANTS"]
[7625453,"GMR 1024  CS CONDENS-2","HG150",3029,null,"A","A","XL",3661238630932,75,680,1150,630,"C5"]
[100008296,"TERMINAL HORIZONTAL PPS Ø 60/100 mm LG=800 mm","DY871",114,null,"/","/","/",3661238168022,2.78,1200,200,200,"C0"]
[84887708,"ADAPTATEUR ALU Ø 60/100 MM SUR 80/125 MM","DY708",57,null,"/","/","/",3661238012028,0.33,255,145,150,"C0"]
["S100465","ADAPTATEUR AIR/FUMEES Ø 80/125","HR38",54,null,"/","/","/",3661238369917,1,190,190,130,"C0"]
[100002732,"TERMINAL VERTICAL PPS Ø 80/125 mm NOIR","DY843",152,null,"/","/","/",3661238006621,4.2,1210,270,240,"C0"]
[]
[]
[100011296,"GMR 1024 CONDENS HOR",null,{"$f":"D1704+D1708","v":2079},null,"A"," /"," /",3661238554214,null,null,null,null,"C5"]
[100017704,"GMR 1024 CONDENS VER",null,{"$f":"D1704+D1710+D1709","v":2171},null,"A"," /"," /",3661238497818,null,null,null,null,"C5"]
[100011298,"GMR 1024 COMBI CONDENS HOR",null,{"$f":"D1705+D1708","v":2257},null,"A","A","XL",3661238554221,null,null,null,null,"C5"]
[100017705,"GMR 1024 COMBI CONDENS VER",null,{"$f":"D1705+D1709+D1710","v":2349},null,"A","A","XL",3661238497825,null,null,null,null,"C5"]
[100011300,"GMR 1030 COMBI CONDENS HOR",null,{"$f":"D1706+D1708","v":2737},null,"A","A","XL",3661238554238,null,null,null,null,"C5"]
[100017706,"GMR 1030 COMBI CONDENS VER",null,{"$f":"D1706+D1709+D1710","v":2829},null,"A","A","XL",3661238497832,null,null,null,null,"C5"]
[100011302,"GMR 1034 COMBI CONDENS HOR",null,{"$f":"D1707+D1708","v":2886},null,"A","A","XL",3661238554245,null,null,null,null,"C5"]
[100017707,"GMR 1034 COMBI CONDENS VER",null,{"$f":"D1707+D1709+D1710","v":2978},null,"A","A","XL",3661238497849,null,null,null,null,"C5"]
[]
["COMPOSANTS"]
[100011304,"GMR 1024 CONDENS ","HG65",1965,null,"A"," /"," /",3661238554252,38,870,450,350,"C5"]
[100011305,"GMR 1024 COMBI CONDENS ","HG66",2143,null,"A","A","XL",3661238554269,39,870,450,350,"C5"]
[100011306,"GMR 1030 COMBI CONDENS ","HG67",2623,null,"A","A","XL",3661238554276,41,870,450,350,"C5"]
[100011307,"GMR 1034 COMBI CONDENS ","HG68",2772,null,"A","A","XL",3661238554290,42,870,450,350,"C5"]
[100008296,"TERMINAL HORIZONTAL PPS  Ø 60/100 mm LG = 800 mm","DY871",114,null,"/","/","/",3661238168022,2.78,1200,200,200,"C0"]
["S100465","ADAPTATEUR AIR/FUMEES Ø 80/125","HR38",54,null,"/","/","/",3661238369917,1,190,190,130,"C0"]
[100002732,"TERMINAL VERTICAL PPS Ø 80/125 mm NOIR","DY843",152,null,"/","/","/",3661238006621,4.2,1210,270,240,"C0"]
[]
["GMR 1000 AVEC ECS PAR BALLON SEPARE"]
[100011308,"GMR 1024 CONDENS HOR BM 80",null,{"$f":"D1719+D1720+D1721+D1724+D1725","v":2965},null,"A","A","XL",3661238554306,null,null,null,null,"C5"]
[100017708,"GMR 1024 CONDENS VER BM 80",null,{"$f":"D1719+D1720+D1721+D1724+D1726+D1727","v":3057},null,"A","A","XL",3661238497856,null,null,null,null,"C5"]
[100011320,"GMR 1024 CONDENS HOR OBU 130",null,{"$f":"D1719+D1722+D1723+D1724+D1725","v":3138},null,"A","A","XL",3661238554313,null,null,null,null,"C5"]
[100017709,"GMR 1024 CONDENS VER OBU 130",null,{"$f":"D1719+D1722+D1723+D1724+D1726+D1727","v":3230},null,"A","A","XL",3661238497863,null,null,null,null,"C5"]
[]
["COMPOSANTS"]
[100011304,"GMR 1024 CONDENS ","HG65",1965,null,"A"," /"," /",3661238554252,38,870,450,350,"C5"]
[100005562,"BALLON JUXTAPOSABLE  BMR 80  ROND","EE53",735,null,"/","/","/",3661238092013,48,510,490,1040,"C0"]
[100011287,"KIT DE RACCORDEMENT BMR 80","HG56",105,null,"/","/","/",3661238338371,1.27,400,210,110,"C5"]
[89539164,"OBU 130","EE29",938,null,"/","/","/",3661238092112,67.5,700,700,980,"C0"]
[100011288,"KIT DE RACCORDEMENT POUR BALLON DE 130 L","HG57",75,null,"/","/","/",3661238338388,0.76,400,210,110,"C5"]
[100005661,"SONDE BALLON 5M LONG NTC 12K","AD226",46,0.01,"/","/","/",3661238109452,0.15,140,70,115,"C5"]
[100008296,"TERMINAL HORIZONTAL PPS  Ø 60/100 mm LG = 800 mm","DY871",114,null,"/","/","/",3661238168022,2.78,1200,200,200,"C0"]
["S100465","ADAPTATEUR AIR/FUMEES Ø 80/125","HR38",54,null,"/","/","/",3661238369917,1,190,190,130,"C0"]
[100002732,"TERMINAL VERTICAL PPS Ø 80/125 mm NOIR","DY843",152,null,"/","/","/",3661238006621,4.2,1210,270,240,"C0"]
[]
["OPTIONS"]
[100005628,"CADRE REHAUSSEUR","HG19",176,null,"/","/","/",3661238109513,5.0999999999999996,715,425,145,"C0"]
[100009391,"KIT  TUYAUX POUR CADRE REHAUSSEUR 16/18","HG43",93,null,"/","/","/",3661238338302,0.69,365,270,30,"C0"]
[100014501,"DOSSERET REHAUSSE 80MM ","HG104",155,null,"/","/","/",3661238378926,3.9,715,420,115,"C0"]
[100005630,"CACHE TUYAUTERIE","HG21",54,null,"/","/","/",3661238109490,0.77,420,230,55,"C0"]
[100005637,"KIT COLLECTEUR D'ECOULEMENT","HG28",47,null,"/","/","/",3661238109476,0.36,305,160,140,"C0"]
[100005825,"ADAPTATEUR BI-FLUX   2x80","DY868",63,null,"/","/","/",3661238162204,0.42,310,160,140,"C0"]
[100011289,"DOSSERET DE MONTAGE SEPARE AVEC DISCONECTEUR POUR CHAUFFAGE SEUL (POUR prémontage)","HG58",352,null,"/","/","/",3661238338319,5.5,720,430,140,"C0"]
[100011290,"DOSSERET DE MONTAGE SEPARE AVEC DISCONECTEUR POUR CHAUDIERE MIXTE (POUR PREMONTAGE)","HG59",310,null,"/","/","/",3661238338326,6,null,null,null,"C0"]
[100005824,"BRULEUR PROPANE POUR 34/39 kW","HG31",119,null,"/","/","/",3661238162211,0.52,305,160,140,"C0"]
[7613605,"STATION DE NEUTRALISATION DN1","SA1",337,null,"/","/","/",3661238592117,14.5,350,230,350,"C0"]
[7613606,"SUPPORT FIXATION MURAL","SA2",62,null,"/","/","/",3661238592124,2.1,300,240,160,"C0"]
[85317025,"RECHARGE 2 KG POUR NEUTRALISATION","HC35",137,null,"/","/","/",3661238091610,3.65,510,315,190,"C0"]
[100009334,"KIT DE REMPLACEMENT GMR 1000 A VISSER ELM","HG36",77,null,"/","/","/",3661238338333,1.35,410,210,120,"C0"]
[100009335,"KIT  REMPLAC A VISSER GMR 1000 SAUNIER DUVAL","HG37",77,null,"/","/","/",3661238338340,1.34,410,210,120,"C0"]
[100009336,"KIT  REMPLAC A VISSER GMR 1000 C &M Nectra","HG38",77,null,"/","/","/",3661238338357,1.49,410,210,120,"C0"]
[100009337,"KIT  REMPLAC A VISSER GMR 1000 C &M Celtic","HG39",77,null,"/","/","/",3661238338364,1.19,410,210,120,"C0"]
[100013114,"KIT  REMP. A VIS. SAUNIER DUV (avec rattrap sortie ventouse) ","HG97",77,null,"/","/","/",3661238363144,1.45,410,210,120,"C0"]
[100013115,"KIT  REMP. A VIS. C&M CELTIC (avec rattrap sortie ventouse) ","HG98",77,null,"/","/","/",3661238362246,1.41,410,210,120,"C0"]
[100014110,"KIT  REMP. A VIS. ELM GVM720  (avec rattrap sortie ventouse) ","HG99",77,null,"/","/","/",3661238369177,1.1299999999999999,410,210,120,"C0"]
[100012812,"CACHE TUBULURES","HG94",70,null,"/","/","/",3661238361416,2,420,420,200,"C0"]
[100011367,"KIT DE TRANSFORMATION 3CE PRESSION","DY884",39,null,"/","/","/",3661238415362,0.15,180,130,15,"C0"]
[100009893,"KIT DE CONVERSION PROPANE GMR 1000","HG44",14,null,"/","/","/",3661238339910,0.02,220,140,10,"C0"]
[100011888,"VENT. HORIZ. RECENTRE Ø 60/100 ","DY885",153,null,"/","/","/",3661238374959,2.86,1170,190,195,"C0"]
[100013303,"VENT. HORIZ. RECENTRE/REH Ø 60/100 (rehaussé)","DY886",153,null,"/","/","/",3661238368095,1.9,1015,190,190,"C0"]
[]
["REGULATIONS "]
[88017904,"THERMOSTAT AMBIANCE PROGRAMMABLE","AD191",158,0.08,"/","/","/",3661238102415,0.25,135,90,55,"C0"]
[88017010,"THERMOSTAT D'AMBIANCE PROGRAMMABLE (SANS FILS)","AD192",280,0.08,"/","/","/",3661238102439,0.42499999999999999,180,150,90,"C0"]
[100005660,"SONDE EXTERIEURE RH","AD225",47,0.01,"/","/","/",3661238109469,0.11,140,70,115,"C0"]
[7609764,"THERMOSTAT D'AMBIANCE MODULANT RADIO RS200 -3R","AD305",333,0.08,"/","/","/",8713809266455,0.76600000000000001,150,100,110,"C0"]
[7609765,"THERMOSTAT D'AMBIANCE MODULANT FILAIRE RS200 -3","AD306",202,0.08,"/","/","/",8713809266462,0.35099999999999998,150,100,50,"C0"]
[7612346," COMMANDE A DISTANCE SIMPLIFIEE RS20-OT FILAIRE","AD302",104,0.08,"/","/","/",3661238599666,0.151,109,90,48,"C0"]
[]
[]
[100011443,"GMR 1024 CS CONDENS HOR",null,{"$f":"SUM(D1769+D1768)","v":3042},null,"A","A","XL",3661238554320,null,null,null,null,"C5"]
[100017710,"GMR 1024 CS CONDENS VER",null,{"$f":"D1768+D1771+D1772","v":3134},null,"A","A","XL",3661238497870,null,null,null,null,"C5"]
[]
["COMPOSANTS"]
[100011065,"GMR 1024  CS CONDENS","HG50",2928,null,"A","A","XL",8713809227166,75,680,1150,630,"C5"]
[100008296,"TERMINAL HORIZONTAL PPS Ø 60/100 mm LG=800 mm","DY871",114,null,"/","/","/",3661238168022,2.78,1200,200,200,"C0"]
[84887708,"ADAPTATEUR ALU Ø 60/100 MM SUR 80/125 MM","DY708",57,null,"/","/","/",3661238012028,0.33,255,145,150,"C0"]
["S100465","ADAPTATEUR AIR/FUMEES Ø 80/125","HR38",54,null,"/","/","/",3661238369917,1,190,190,130,"C0"]
[100002732,"TERMINAL VERTICAL PPS Ø 80/125 mm NOIR","DY843",152,null,"/","/","/",3661238006621,4.2,1210,270,240,"C0"]
[]
["OPTIONS CHAUDIERES"]
[100009391,"KIT TUBULURE DE RACCORDEMENT POUR CADRE RÉHAUSSEUR","HG43",93,null,"/","/","/",3661238338302,0.69,365,270,30,"C0"]
[100005825,"ADAPTATEUR BI-FLUX   2x80","DY868",63,null,"/","/","/",3661238162204,0.42,310,160,140,"C0"]
[100009893,"KIT DE CONVERSION PROPANE GMR 1000","HG44",14,null,"/","/","/",3661238339910,0.02,220,140,10,"C0"]
[7613605,"STATION DE NEUTRALISATION DN1","SA1",337,null,"/","/","/",3661238592117,14.5,350,230,350,"C0"]
[7613606,"SUPPORT FIXATION MURAL","SA2",62,null,"/","/","/",3661238592124,2.1,300,240,160,"C0"]
[85317025,"RECHARGE 2 KG POUR NEUTRALISATION","HC35",137,null,"/","/","/",3661238091610,3.65,510,315,190,"C0"]
[100020045,"KIT FILTRE FERNOX TF1",null,253,null,"/","/","/",null,null,null,null,null,"C0"]
[]
["OPTIONS SPECIFIQUES"]
[117422,"CADRE RÉHAUSSEUR POUR MCR BIC","HG75",197,null,"/","/","/",3661238350960,7,1070,690,160,"C0"]
[117433,"CACHE TUYAUTERIE MCR BIC","HG76",70,null,"/","/","/",3661238350977,1.3,650,380,170,"C0"]
[117167,"VASE D'EXPANSION SANITAIRE","HG77",95,null,"/","/","/",3661238350953,1.5,310,210,130,"C0"]
[]
["FUMISTERIE"]
[null,"ALU/ALU  Ø 60/100 mm "]
[100016485,"TERMINAL HORIZONTAL D60/100 L800 ","DY908",95,null,null,null,null,3661238494619,3,1000,160,155,"C0"]
[84887735,"TERMINAL VERTICAL D80/125 NOIR ","DY735",164,null,null,null,null,3661238011786,5,1350,255,290,"C0"]
[84887736,"TERMINAL VERTICAL D80/125 ROUGE","DY736",164,null,null,null,null,3661238011779,5,1350,255,290,"C0"]
[84887746,"RALLONGE LG 250 mm ","DY746",35,null,"/","/","/",3661238011687,0.49,260,145,150,"C0"]
[84887652,"RALLONGE ALU Ø 60/100 L 500MM","DY652",42,null,"/","/","/",3661238012578,0.96,515,135,140,"C0"]
[84887653,"RALLONGE CONCENTRIQUE Ø 60/100 mm  L1000 mm ","DY653",57,null,"/","/","/",3661238012561,1.86,1020,135,140,"C0"]
[84887654,"RALLONGE CONCENTRIQUE Ø 60/100 mm  L 1950 mm ","DY654",106,null,"/","/","/",3661238012554,3.66,1960,150,150,"C0"]
[84887655,"COUDE ALU 87° Ø  60/100 ","DY655",43,null,"/","/","/",3661238012547,0.69,200,200,150,"C0"]
[84887656,"2 COUDES 45°  ALU Ø  60/100 ","DY656",81,null,"/","/","/",3661238012530,0.83,255,185,150,"C0"]
[84887659,"MANCHON DE COMPENSATION DE 50 A 250 mm ","DY659",61,null,"/","/","/",3661238012509,0.83,510,135,140,"C0"]
[84887660,"TE DE VISITE Ø 60/100 mm ","DY660",137,null,"/","/","/",3661238012493,0.85,500,405,160,"C0"]
[100016487,"RECUPERATEUR CONDENSATS 60/100 ","DY910",91,null,null,null,null,3661238494633,0.66,320,240,155,"C0"]
[100016488,"RACCORD 3CE (C42) D60/100 L250 ","DY911",98,null,null,null,null,3661238494640,1.67,510,160,155,"C0"]
[300007172,"GRILLE DE PROTECTION INOX D.90MM",null,"CPR",null,null,null,null,3661238123632,0.19,15,15,16]
[null,"ALU Ø 80 MM"]
[84887600,"TUBE D'INSPECTION Ø 80 mm ","DY600",47,null,"/","/","/",3661238013094,0.49,300,145,150,"C0"]
[84887738,"TE DE VISITE Ø 80 mm ","DY738",70,null,"/","/","/",3661238011755,0.66,285,215,165,"C0"]
[84887604,"RALLONGE Ø 80 mm    L= 250 mm  (2 PIECES)","DY604",36,null,"/","/","/",3661238013056,0.65,255,170,175,"C0"]
[84887605,"RALLONGE Ø 80 mm    L=  500 mm  (2 PIECES)","DY605",44,null,"/","/","/",3661238013049,1.26,520,175,170,"C0"]
[84887606,"RALLONGE 1000 mm  (2 PIECES)","DY606",71,null,"/","/","/",3661238013032,2.52,1020,175,175,"C0"]
[84887607,"RALLONGE Ø 80 mm    L=  1950 mm   (2 PIECES)","DY607",118,null,"/","/","/",3661238013025,5,1985,170,175,"C0"]
[84887608,"COUDE A 90°","DY608",23,null,"/","/","/",3661238013018,0.34,155,160,160,"C0"]
[84887609,"COUDE A 45°  (2 PIECES)","DY609",39,null,"/","/","/",3661238013001,0.48,200,200,150,"C0"]
[null,"ALU/ALU Ø 80/125 mm"]
[84837735,"RALLONGE LG 250mm ","CX64",43,null,"/","/","/",3661238014305,0.61,255,145,150,"C0"]
[84837736,"RALLONGE LG 500 mm ","CX65",49,null,"/","/","/",3661238014299,1.18,510,135,140,"C0"]
[84837737,"RALLONGE LG 1000 mm ","CX66",73,null,"/","/","/",3661238014282,2.2999999999999998,1020,130,140,"C0"]
[84837793,"RALLONGE CONCENTRIQUE 80/125 L=1950 mm ","CX93",141,null,"/","/","/",3661238014169,4.5599999999999996,1960,150,150,"C0"]
[84837738,"MANCHON DE COMPENS LG 300","CX67",57,null,"/","/","/",3661238014275,1,515,135,140,"C0"]
[84837743,"COUDE 87'VENT.VERT80/125mm ","CX76",72,null,"/","/","/",3661238014244,0.82,200,200,145,"C0"]
[84837739,"2 COUDES 45 °","CX68",111,null,"/","/","/",3661238014268,1.24,315,235,150,"C0"]
[100016486,"RECUPERATEUR COND 60/100 80/125 ","DY909",88,null,null,null,null,3661238494626,1.26,290,220,170,"C0"]
[84887460,"KIT D'INSTALLATION MONTAGE EXT.  ","DY60",368,null,null,null,null,3661238013810,5.16,590,400,410,"C0"]
[null,"PPS/ALU 60/100"]
[100008296,"TERMINAL HORIZONTAL PPS  Ø 60/100 mm LG = 800 mm","DY871",114,null,"/","/","/",3661238168022,2.78,1200,200,200,"C0"]
[100017526,"TERMINAL REFTROFIT Ø 60/100","DY912",113,null,"/","/","/",3661238496323,0.9,1200,180,110,"C0"]
[84887681,"PPS-ALU RALLONGE CONCENTRIQUE  ø 60/100 mm L=  500 mm","DY681",40,null,"/","/","/",3661238012288,0.72,510,135,140,"C0"]
[84887682,"PPS-ALU RALLONGE CONCENTRIQUE ø 60/100 mm L=1000 mm","DY682",50,null,"/","/","/",3661238012271,1.38,1010,130,135,"C0"]
[84887683,"PPS-ALU RALLONGE CONCENTRIQUE ø 60/100mm L=1950mm","DY683",102,null,"/","/","/",3661238012264,2.81,1960,150,150,"C0"]
[84887684,"PPS-ALU COUDE CONCENTRIQUE MOULE à 87° ø 60/100 mm","DY684",42,null,"/","/","/",3661238012257,0.53,200,200,150,"C0"]
[84887685,"PPS-ALU COUDE CONCENTRIQUE MOULE à 45° ø 60/100 mm (2 PIECES)","DY685",79,null,"/","/","/",3661238012240,0.65,250,185,150,"C0"]
[84887686,"PPS-ALU COUDE CONCENTRIQUE MOULE à 30° ø 60/100 mm (2 PIECES)","DY686",156,null,"/","/","/",3661238012233,0.63,250,190,155,"C0"]
[84887687,"PPS-ALU COUDE CONCENTRIQUE MOULE à 15° ø 60/100 mm (2 PIECES)","DY687",156,null,"/","/","/",3661238012226,0.64,255,195,150,"C0"]
[84887688,"PPS-ALU MANCHON DE COMPENSATION DE 50 à 250 mm","DY688",70,null,"/","/","/",3661238012219,0.51,515,135,140,"C0"]
[84887689,"PPS-ALU  PIECE DE REVISIONDROITE  Ø 60/100 mm","DY689",129,null,"/","/","/",3661238012202,0.56999999999999995,255,185,150,"C0"]
[84887737,"PPS-ALU  Té DE REVISION  Ø 60/100 mm","DY737",129,null,"/","/","/",3661238011762,0.6,255,185,145,"C0"]
[84887702,"KIT DE RACCORDEMENT CHAUDIERE ALU/PPS Ø 60/100 mm","DY702",177,null,"/","/","/",3661238012080,1.94,500,290,260,"C0"]
[null,"FLEXIBLE PPS Ø 80"]
[84887716,"KIT N° 3 RACCORDEMENT CHAUDIERE  PPS ø 80/125 mm","DY716",141,null,"/","/","/",3661238011953,2.36,500,290,260,"C0"]
[100015325,"KIT N° 1 RACCORDEMENT CHEMINÉE FLEXIBLE PPS Ø 80 mm","DY895",231,null,"/","/","/",3661238380110,2.87,395,395,380,"C0"]
[100015327,"TUBE FLEXIBLE LG=12,5M","DY897",347,null,"/","/","/",3661238380134,8.6999999999999993,1200,1220,250,"C0"]
[100015326,"TUBE FLEXIBLE LG=50M","DY896",1216,null,"/","/","/",3661238380127,35,1600,1660,410,"C0"]
[84887618,"ETOILE DE CENTRAGE POUR FLEXIBLE Ø 80 MM (5 PIÈCES)","DY618",36,null,"/","/","/",3661238012912,0.2,300,300,70,"C0"]
[100015328,"PIÈCE DE COUPLAGE FLEXIBLE Ø 80 mm","DY898",70,null,"/","/","/",3661238380141,0.25,150,150,150,"C0"]
[100015331,"OUTIL D'AIDE À L'INSERTION Ø 80 mm","DY901",174,null,"/","/","/",3661238380172,1.4,300,210,185,"C0"]
[100015330,"PIÈCE D'INSPECTION POUR TUBE FLEXIBLE","DY900",125,null,"/","/","/",3661238380165,0.5,295,140,140,"C0"]
[100015329,"TERMINAL AVEC SOLIN FLEX. Ø 80 mm","DY899",174,null,"/","/","/",3661238380158,1.74,385,385,250,"C0"]
[100015318,"ADAPTATEUR PPS D80M-110F","DY902",51,null,"/","/","/",3661238379909,0.25,150,150,150,"C0"]
[100015880,"ADAPTATEUR PPS FLEX Ø 80 mm","DY904",41,null,"/","/","/",3661238417632,0.125,316,236,152,"C0"]
[100015881,"ADAPTATEUR PPS  Ø 110","DY905",49,null,"/","/","/",3661238417625,1.6,396,296,263,"C0"]
[null,"CONDUITS 80 PPS"]
[84887701,"KIT  RACCORDEMENT CHEMINEE PPS Ø 60/80 MM ","DY701",264,null,"/","/","/",3661238012097,2.83,395,400,385,"C0"]
[100017527,"KIT DE BASE PPS/ALU Ø 80/125 ","DY913",163,null,"/","/","/",3661238496330,3.7,600,400,275,"C0"]
[84887717,"KIT N° 1 KIT DE RACCORDEMENT CHEMINEE PPS Ø 80 mm","DY717",154,null,"/","/","/",3661238011946,2.89,395,405,390,"C0"]
[84887546,"PIÈCE DE VISITE Ø 80 mm droite","DY146",57,null,"/","/","/",3661238013506,0.28999999999999998,300,145,150,"C0"]
[100008301,"COUDE DE REVISION 87° PPS Ø80mm","DY877",40,null,"/","/","/",3661238102026,0.24,190,195,145,"C0"]
[84887613,"RALLONGE PPS Ø 80 mm   L= 250 mm (2 PCS)","DY613",39,null,"/","/","/",3661238012967,0.37,250,170,175,"C0"]
[84887614,"RALLONGE PPS  Ø 80 mm   L=  500 mm (2 PCS)","DY614",37,null,"/","/","/",3661238012950,0.68,500,160,150,"C0"]
[84887615,"RALLONGE PPS  Ø 80 mm   L=  1000 mm (2 PCS)","DY615",50,null,"/","/","/",3661238012943,1.25,1000,160,145,"C0"]
[84887550,"RALLONGE PPS Ø 80 mm   L=  2000 mm  (2 PIECES)","DY150",76,null,"/","/","/",3661238013469,2.4900000000000002,1960,150,150,"C0"]
[84887552,"COUDE PPS à 90°","DY152",15,null,"/","/","/",3661238013445,0.2,255,145,150,"C0"]
[84887554,"COUDE PPS à 45°  (2 PCS)","DY154",34,null,"/","/","/",3661238013421,0.32,200,200,150,"C0"]
[84887563,"T PPS  AVEC COUVERCLE D'INSPECTION","DY163",57,null,"/","/","/",3661238013353,0.39,290,220,170,"C0"]
[84887551,"COLLIER DE CENTRAGE Ø 80 mm (2 PIECES)","DY151",13,null,"/","/","/",3661238013452,0.1,300,300,40,"C0"]
[null,"PPS/ALU 80/125"]
[100002732,"TERMINAL VERTICAL PPS Ø 80/125 mm NOIR","DY843",152,null,"/","/","/",3661238006621,4.2,1210,270,240,"C0"]
[100002733,"TERMINAL VERTICAL PPS Ø 80/125 mm ROUGE","DY844",151,null,"/","/","/",3661238006614,4.2,1210,265,240,"C0"]
[84887524,"PIECE D'INSPECTION DROITE ALU/PPS Ø 80/125 mm","DY124",108,null,"/","/","/",3661238013704,0.55000000000000004,300,145,150,"C0"]
[84887525,"T D'INSPECTION ALU/PPS Ø 80/125 mm","DY125",124,null,"/","/","/",3661238013698,0.82,315,235,150,"C0"]
[100008311,"COUDE DE REVISION ALU/PPS Ø 80/125 mm","DY875",113,null,"/","/","/",3661238101920,0.68,195,195,145,"C0"]
[84887526,"RALLONGE CONCENTRIQUE ALU/PPS  80/125 L= 250 mm","DY126",40,null,"/","/","/",3661238013681,0.47,255,145,150,"C0"]
[84887527,"RALLONGE CONCENTRIQUE ALU/PPS 80/125 L= 500mm","DY127",46,null,"/","/","/",3661238013674,0.9,520,140,140,"C0"]
[84887528,"RALLONGECONCENTRIQUE ALU/PPS 80/125 L=1000 mm","DY128",68,null,"/","/","/",3661238013667,1.7,1010,135,140,"C0"]
[84887529,"RALLONGE CONCENTRIQUE ALU/PPS 80/125 L=1950 mm","DY129",118,null,"/","/","/",3661238013650,3.5,1960,150,150,"C0"]
[84887531,"COUDE A 87° ALU/PPS  Ø 80/125 mm","DY131",50,null,"/","/","/",3661238013636,0.66,200,200,150,"C0"]
[84887532,"COUDE CONCENTRIQUE 45° ALU/PPS Ø 80/125 mm (2 PCES)","DY132",76,null,"/","/","/",3661238013629,1,315,235,150,"C0"]
[84887708,"ADAPTATEUR ALU Ø 60/100 MM SUR 80/125 MM","DY708",57,null,"/","/","/",3661238012028,0.33,255,145,150,"C0"]
[100011367,"KIT DE TRANSFORMATION 3CE PRESSION ","DY884",39,null,"/","/","/",3661238415362,0.15,180,130,15,"C0"]
[null,"Divers"]
[84887411,"SORTIE HORIZONTALE TOIT PENTE DE 30° A 45° ( uniquement pour tuiles mécaniques)","DY11",175,null,"/","/","/",3661238013940,3.57,1020,700,370,"C0"]
[84837729,"SORTIE DE TOIT EN PENTE DE 40° A 60° ( uniquement pour tuiles mécaniques)","CX49",175,null,"/","/","/",3661238014367,3.5,920,700,320,"C0"]
[84837731,"EMBASE D'ETANCHE TOIT PLAT","CX51",42,null,"/","/","/",3661238014343,0.5,400,400,155,"C0"]
[84837121,"TUILE A DOUILLE 5 A 25 NOIRE","CX121",110,null,"/","/","/",3661238014428,2.96,510,250,145,"C0"]
[84837732,"TUILE A DOUILLE 25A35' NOIRE","CX52",76,null,"/","/","/",3661238014336,3,520,250,145,"C0"]
[84837734,"TUILE A DOUILLE 35 A 55° NOIRE ","CX63",95,null,"/","/","/",3661238014312,3.17,510,265,180,"C0"]
[84837120,"TUILE A DOUILLE 5 A 25° ROUGE","CX120",110,null,"/","/","/",3661238014435,3.02,515,245,145,"C0"]
[84837783,"TUILE A DOUILLE 25 A 35 ROUGE","CX83",76,null,"/","/","/",3661238014213,3,515,250,150,"C0"]
[84837784,"TUILE A DOUILLE 25 A 55 ROUGE","CX84",95,null,"/","/","/",3661238014206,2.95,520,265,180,"C0"]
[84837738,"MANCHON DE COMPENS LG 300","CX67",57,null,"/","/","/",3661238014275,1,515,135,140,"C0"]
[84837741,"PLATINE DE FINITION INTER","CX72",16,null,"/","/","/",3661238014251,0.54,245,210,3,"C0"]
[84887566,"PANIER DE PROTECTION INOX","DY166",79,null,"/","/","/",3661238013339,1.38,220,210,200,"C0"]
[84887752,"PLAQUE DE FINITION CHEMINEE ","DY752",35,null,"/","/","/",3661238011649,0.2,310,230,140,"C0"]
[]
[]
[100014281,"GMR 3015 Condens HOR  ",null,{"$f":"D1919+D1928","v":3063},null,"A","/","/",3661238554337,null,null,null,null,"C0"]
[100014283,"GMR 3015 CondensVER ",null,{"$f":"D1919+D1929+D1930","v":3086},null,"A","/","/",3661238554344,null,null,null,null,"C0"]
[100014284,"GMR 3025 Condens HOR",null,{"$f":"D1920+D1928","v":3239},null,"A","/","/",3661238554351,null,null,null,null,"C0"]
[100014286,"GMR 3025 Condens VER",null,{"$f":"D1920+D1929+D1930","v":3262},null,"A","/","/",3661238554368,null,null,null,null,"C0"]
[100014287,"GMR 3025 Combi Condens HOR",null,{"$f":"+D1921+D1928","v":3314},null,"A","A","XL",3661238554375,null,null,null,null,"C0"]
[100014288,"GMR 3025 Combi Condens VER",null,{"$f":"D1921+D1929+D1930","v":3337},null,"A","A","XL",3661238554382,null,null,null,null,"C0"]
[100014289,"GMR 3025 CS Condens HOR",null,{"$f":"D1922+D1928","v":4246},null,"A","A","XL",3661238554399,null,null,null,null,"C0"]
[100014290,"GMR 3025 CS Condens VER",null,{"$f":"D1922+D1929+D1930","v":4269},null,"A","A","XL",3661238554405,null,null,null,null,"C0"]
[100014292,"GMR 3035 Condens HOR",null,{"$f":"D1923+D1928","v":3476},null,"A","/","/",3661238554412,null,null,null,null,"C0"]
[100014293,"GMR 3035 Condens VER",null,{"$f":"D1923+D1929+D1930","v":3499},null,"A","/","/",3661238554429,null,null,null,null,"C0"]
[]
[100014294,"GMR 3015 Condens HOR BS 60 ",null,{"$f":"D1919+D1924+D1925+D1928","v":4083},null,"A","A","XL",3661238554436,null,null,null,null,"C0"]
[100014295,"GMR 3015 Condens VER BS 60",null,{"$f":"D1919+D1924+D1925+D1929+D1930","v":4106},null,"A","A","XL",3661238554450,null,null,null,null,"C0"]
[100014296,"GMR 3015 Condens HOR OBU 130",null,{"$f":"D1919+D1926+D1927+D1928+D1931","v":4166},null,"A","A","XL",3661238554467,null,null,null,null,"C0"]
[100014297,"GMR 3015 Condens  VER OBU 130",null,{"$f":"D1919+D1926+D1927+D1929+D1930+D1931","v":4189},null,"A","A","XL",3661238554474,null,null,null,null,"C0"]
[100014298,"GMR 3025 Condens HOR BS 60 ",null,{"$f":"D1920+D1924+D1925+D1928","v":4259},null,"A","A","XL",3661238554481,null,null,null,null,"C0"]
[100014299,"GMR 3025 Condens VER BS 60",null,{"$f":"D1920+D1924+D1925+D1929+D1930","v":4282},null,"A","A","XL",3661238554498,null,null,null,null,"C0"]
[100014300,"GMR 3025 Condens HOR OBU 130",null,{"$f":"D1920+D1926+D1927+D1928+D1931","v":4342},null,"A","A","XL",3661238554504,null,null,null,null,"C0"]
[100014301,"GMR 3025 Condens  VER OBU 130",null,{"$f":"D1920+D1926+D1927+D1929+D1930+D1931","v":4365},null,"A","A","XL",3661238554511,null,null,null,null,"C0"]
[100014302,"GMR 3035 Condens HOR BS 60 ",null,{"$f":"D1923+D1924+D1925+D1928","v":4496},null,"A","A","XL",3661238554528,null,null,null,null,"C0"]
[100014303,"GMR 3035 Condens VER BS 60",null,{"$f":"D1923+D1924+D1925+D1929+D1930","v":4519},null,"A","A","XL",3661238554535,null,null,null,null,"C0"]
[100014304,"GMR 3035 Condens HOR OBU 130",null,{"$f":"D1923+D1926+D1927+D1928+D1931","v":4579},null,"A","A","XL",3661238554542,null,null,null,null,"C0"]
[100014305,"GMR 3035 Condens  VER OBU 130",null,{"$f":"D1923+D1926+D1927+D1929+D1930+D1931","v":4602},null,"A","A","XL",3661238554559,null,null,null,null,"C0"]
[]
["COMPOSANTS"]
[100013631,"GMR 3015 Condens","HR23",2880,null,"A","/","/",3661238368958,40,930,530,470,"C0"]
[100013632,"GMR 3025 Condens","HR24",3056,null,"A","/","/",3661238368972,40,930,530,470,"C0"]
[100013630,"GMR 3025 Combi Condens","HR22",3131,null,"A","A","XL",3661238368965,40,930,530,470,"C0"]
[100013634,"GMR 3025 CS Condens","HR26",4063,null,"A","A","XL",3661238414860,86,1120,700,550,"C0"]
[100013633,"GMR 3035 Condens","HR25",3293,null,"A","/","/",3661238414853,40,930,520,460,"C0"]
[100013755,"BS 60","EE54",898,null,"/","/","/",3661238365889,50,515,515,905,"C0"]
[100013746,"KIT DE LIAISON BS 60","EA138",122,null,"/","/","/",3661238365803,0.85,700,100,160,"C0"]
[89539164,"OBU 130","EE29",938,null,"/","/","/",3661238092112,67.5,700,700,980,"C0"]
[100013532,"KIT DE LIAISON OBU130/GMR 3000 ","EA137",117,null,"/","/","/",3661238364462,0.8,700,100,160,"C0"]
[100013756,"TERMINAL HORIZONTAL PPS/GALVA Ø 60/100 mm","HR48",183,null,"/","/","/",3661238370883,3.37,1200,200,200,"C0"]
["S100465","ADAPTATEUR AIR/FUMEES Ø 80/125","HR38",54,null,"/","/","/",3661238369917,1,190,190,130,"C0"]
[100002732,"TERMINAL VERTICAL PPS Ø 80/125 mm NOIR","DY843",152,null,"/","/","/",3661238006621,4.2,1210,270,240,"C0"]
[100000030,"COLIS OPTION SONDE ECS","AD212",48,0.01,"/","/","/",3661238011168,0.16,200,150,30,"C0"]
[]
["OPTIONS CHAUDIERES"]
[100005825,"ADAPTATEUR BI-FLUX   2x80","DY868",63,null,"/","/","/",3661238162204,0.42,310,160,140,"C0"]
["S100465","ADAPTATEUR AIR/FUMEES Ø 80/125","HR38",54,null,"/","/","/",3661238369917,1,190,190,130,"C0"]
["S100675","CADRE REHAUSSEUR","HR39",202,null,"/","/","/",3661238368217,6,840,455,175,"C0"]
[" S101239","CADRE REHAUSSEURPOUR GMR 3025 CS CONDENS","HR50",232,null,"/","/","/",3661238377523,10,1100,640,180,"C0"]
["S100935","KIT TUBULURE POUR CADRE REHAUSSEUR FR","HR40",85,null,"/","/","/",3661238368224,1.3,400,320,90,"C0"]
["S100676","CACHE TUBULURE","HR42",54,null,"/","/","/",3661238369924,1.5,460,350,175,"C0"]
["S101205","CACHE TUBULURE POUR GMR 3025 CS CONDENS ","HR52",74,null,"/","/","/",3661238377547,1.44,610,380,175,"C0"]
["S100310","THERMOSTAT FUMEE","HR43",67,0.01,"/","/","/",3661238369931,0.1,180,130,30,"C0"]
["S101232","THERMOSTAT FUMEE POUR GMR 3025 CS CONDENS","HR53",68,0.01,"/","/","/",3661238377554,0.1,200,120,30,"C0"]
["S100761","OUIL DE NETTOYAGE ECHANGEUR A PLAQUES","HR44",111,null,"/","/","/",3661238368255,0.28000000000000003,170,170,40,"C0"]
["S100931","OUTIL DE NETTOYAGE CORPS CHAUDIERE","HR45",85,null,"/","/","/",3661238369948,0.73,310,320,160,"C0"]
[7613605,"STATION DE NEUTRALISATION DN1","SA1",337,null,"/","/","/",3661238592117,14.5,350,230,350,"C0"]
[7613606,"SUPPORT FIXATION MURAL","SA2",62,null,"/","/","/",3661238592124,2.1,300,240,160,"C0"]
[85317025,"RECHARGE 2 KG POUR NEUTRALISATION","HC35",137,null,"/","/","/",3661238091610,3.65,510,315,190,"C0"]
[100020164,"COLLECTEUR 2/3 CIRCUITS ","EA140",341,null,"/","/","/",3661238575011,6.6,660,180,200,"C0"]
[100020165,"CONSOLE MUR COLLECTEUR ","EA141",43,null,"/","/","/",3661238575028,1.2,220,125,70,"C0"]
[100020166,"CONSOLE MUR 1 MODULE ","EA142",114,null,"/","/","/",3661238575035,1.6,220,125,70,"C0"]
[100020167,"CIRCUIT DIRECT P.ELEC CLASSE A  ","EA143",631,0.17,"/","/","/",3661238575042,5.0999999999999996,460,270,235,"C0"]
[100020168,"CIRCUIT V3V P.ELEC","EA144",897,0.17,"/","/","/",3661238575059,6,460,270,235,"C0"]
[100020169,"MODULE HYDR COMPACT 2 CIRCUITS HEE","EA145",1122,0.17399999999999999,"/","/","/",3661238575066,9,525,415,210,"C0"]
[89557009,"KIT DE TRANSFORMATION G/R 3/4 '' ET 1 ''","BH84",31,null,"/","/","/",3661238047563,0.32500000000000001,200,140,45,"C0"]
[7613605,"STATION DE NEUTRALISATION DN1","SA1",337,null,"/","/","/",3661238592117,14.5,350,230,350,"C0"]
[7613606,"SUPPORT FIXATION MURAL","SA2",62,null,"/","/","/",3661238592124,2.1,300,240,160,"C0"]
[85317025,"RECHARGE 2 KG POUR NEUTRALISATION","HC35",137,null,"/","/","/",3661238091610,3.65,510,315,190,"C0"]
[100020045,"KIT FILTRE FERNOX TF1",null,253,null,"/","/","/",null,null,null,null,null,"C0"]
[]
["OPTIONS REGULATIONS"]
[100013304,"COLIS OPTION V3V OE-TRONIC 4","AD249",155,0.01,"/","/","/",3661238363519,0.42,260,170,130,"C0"]
[100013305,"COLIS SONDE SYSTÈME OE-TRONIC 4","AD250",45,0.01,"/","/","/",3661238363588,0.13400000000000001,150,210,25,"C0"]
[100013306,"SONDE EXTERIEURE RADIO ","AD251",76,0.08,"/","/","/",3661238363595,0.15,150,210,40,"C0"]
[100013307,"MODULE CHAUDIERE RADIO (EMETTEUR)","AD252",121,0.08,"/","/","/",3661238363601,0.32,260,160,130,"C0"]
[100013472,"CDE A DISTANCE RADIO RS 400R     ","AD255",233,0.08,"/","/","/",3661238364233,0.253,175,122,60,"C0"]
[100013477,"CDE A DISTANCE FILAIRE RS 400   ","AD257",174,0.08,"/","/","/",3661238364257,0.253,175,122,60,"C0"]
[88017851,"CABLE DE LIAISON BUS LG 12 M","AD134",108,0.01,"/","/","/",3661238048850,0.37,350,260,30,"C0"]
[88017878,"MODULE DE TELESURVEILLANCE VOCAL TELCOM 2","AD152",690,0.08,"/","/","/",3661238048751,1.05,210,190,105,"C0"]
[88017017,"SONDE DEPART v3v","AD199",79,0.01,"/","/","/",3661238049185,0.21,150,200,40,"C0"]
[100000030,"COLIS OPTION SONDE ECS","AD212",48,0.01,"/","/","/",3661238011168,0.16,200,150,30,"C0"]
["S103303","MODULE DE COMMANDE 2 CIRCUITS ","AD290",406,0.01,"/","/","/",3661238549517,1.73,420,305,85,"C0"]
[]
["FUMISTERIE"]
[null,"ALU Ø 80 MM"]
[84887600,"TUBE D'INSPECTION Ø 80 mm ","DY600",47,null,"/","/","/",3661238013094,0.49,300,145,150,"C0"]
[84887738,"TE DE VISITE Ø 80 mm ","DY738",70,null,"/","/","/",3661238011755,0.66,285,215,165,"C0"]
[84887604,"RALLONGE Ø 80 mm    L= 250 mm  (2 PIECES)","DY604",36,null,"/","/","/",3661238013056,0.65,255,170,175,"C0"]
[84887605,"RALLONGE Ø 80 mm    L=  500 mm  (2 PIECES)","DY605",44,null,"/","/","/",3661238013049,1.26,520,175,170,"C0"]
[84887606,"RALLONGE 1000 mm  (2 PIECES)","DY606",71,null,"/","/","/",3661238013032,2.52,1020,175,175,"C0"]
[84887607,"RALLONGE Ø 80 mm    L=  1950 mm   (2 PIECES)","DY607",118,null,"/","/","/",3661238013025,5,1985,170,175,"C0"]
[84887608,"COUDE A 90°","DY608",23,null,"/","/","/",3661238013018,0.34,155,160,160,"C0"]
[84887609,"COUDE A 45°  (2 PIECES)","DY609",39,null,"/","/","/",3661238013001,0.48,200,200,150,"C0"]
[84887681,"PPS-ALU RALLONGE CONCENTRIQUE  ø 60/100 mm L=  500 mm","DY681",40,null,"/","/","/",3661238012288,0.72,510,135,140,"C0"]
[84887682,"PPS-ALU RALLONGE CONCENTRIQUE ø 60/100 mm L=1000 mm","DY682",50,null,"/","/","/",3661238012271,1.38,1010,130,135,"C0"]
[84887683,"PPS-ALU RALLONGE CONCENTRIQUE ø 60/100mm L=1950mm","DY683",102,null,"/","/","/",3661238012264,2.81,1960,150,150,"C0"]
[84887684,"PPS-ALU COUDE CONCENTRIQUE MOULE à 87° ø 60/100 mm","DY684",42,null,"/","/","/",3661238012257,0.53,200,200,150,"C0"]
[84887685,"PPS-ALU COUDE CONCENTRIQUE MOULE à 45° ø 60/100 mm (2 PIECES)","DY685",79,null,"/","/","/",3661238012240,0.65,250,185,150,"C0"]
[84887686,"PPS-ALU COUDE CONCENTRIQUE MOULE à 30° ø 60/100 mm (2 PIECES)","DY686",156,null,"/","/","/",3661238012233,0.63,250,190,155,"C0"]
[84887687,"PPS-ALU COUDE CONCENTRIQUE MOULE à 15° ø 60/100 mm (2 PIECES)","DY687",156,null,"/","/","/",3661238012226,0.64,255,195,150,"C0"]
[84887688,"PPS-ALU MANCHON DE COMPENSATION DE 50 à 250 mm","DY688",70,null,"/","/","/",3661238012219,0.51,515,135,140,"C0"]
[84887689,"PPS-ALU  PIECE DE REVISIONDROITE  Ø 60/100 mm","DY689",129,null,"/","/","/",3661238012202,0.56999999999999995,255,185,150,"C0"]
[84887737,"PPS-ALU  Té DE REVISION  Ø 60/100 mm","DY737",129,null,"/","/","/",3661238011762,0.6,255,185,145,"C0"]
[84887702,"KIT DE RACCORDEMENT CHAUDIERE ALU/PPS Ø 60/100 mm","DY702",177,null,"/","/","/",3661238012080,1.94,500,290,260,"C0"]
[null,"FLEXIBLE PPS Ø 80"]
[84887716,"KIT N° 3 RACCORDEMENT CHAUDIERE  PPS ø 80/125 mm","DY716",141,null,"/","/","/",3661238011953,2.36,500,290,260,"C0"]
[100015325,"KIT N° 1 RACCORDEMENT CHEMINÉE FLEXIBLE PPS Ø 80 mm","DY895",231,null,"/","/","/",3661238380110,2.87,395,395,380,"C0"]
[100015327,"TUBE FLEXIBLE LG=12,5M","DY897",347,null,"/","/","/",3661238380134,8.6999999999999993,1200,1220,250,"C0"]
[100015326,"TUBE FLEXIBLE LG=50M","DY896",1216,null,"/","/","/",3661238380127,35,1600,1660,410,"C0"]
[84887618,"ETOILE DE CENTRAGE POUR FLEXIBLE Ø 80  mm (2 PIÈCES)","DY618",36,null,"/","/","/",3661238012912,0.2,300,300,70,"C0"]
[100015328,"PIÈCE DE COUPLAGE FLEXIBLE Ø 80 mm","DY898",70,null,"/","/","/",3661238380141,0.25,150,150,150,"C0"]
[100015331,"OUTIL D'AIDE À L'INSERTION Ø 80 mm","DY901",174,null,"/","/","/",3661238380172,1.4,300,210,185,"C0"]
[100015330,"PIÈCE D'INSPECTION POUR TUBE FLEXIBLE","DY900",125,null,"/","/","/",3661238380165,0.5,295,140,140,"C0"]
[100015329,"TERMINAL AVEC SOLIN FLEX. Ø 80 mm","DY899",174,null,"/","/","/",3661238380158,1.74,385,385,250,"C0"]
[null,"CONDUITS 80 PPS"]
[84887701,"KIT  RACCORDEMENT CHEMINEE PPS Ø 60/80 MM ","DY701",264,null,"/","/","/",3661238012097,2.83,395,400,385,"C0"]
[100017527,"KIT DE BASE PPS/ALU Ø 80/125 ","DY913",163,null,"/","/","/",3661238496330,3.7,600,400,275,"C0"]
[84887717,"KIT N° 1 KIT DE RACCORDEMENT CHEMINEE PPS Ø 80 mm","DY717",154,null,"/","/","/",3661238011946,2.89,395,405,390,"C0"]
[84887546,"PIÈCE DE VISITE Ø 80 mm droite","DY146",57,null,"/","/","/",3661238013506,0.28999999999999998,300,145,150,"C0"]
[100008301,"COUDE DE REVISION 87° PPS Ø80mm","DY877",40,null,"/","/","/",3661238102026,0.24,190,195,145,"C0"]
[84887613,"RALLONGE PPS Ø 80 mm   L= 250 mm (2 PCS)","DY613",39,null,"/","/","/",3661238012967,0.37,250,170,175,"C0"]
[84887614,"RALLONGE PPS  Ø 80 mm   L=  500 mm (2 PCS)","DY614",37,null,"/","/","/",3661238012950,0.68,500,160,150,"C0"]
[84887615,"RALLONGE PPS  Ø 80 mm   L=  1000 mm (2 PCS)","DY615",50,null,"/","/","/",3661238012943,1.25,1000,160,145,"C0"]
[84887550,"RALLONGE PPS Ø 80 mm   L=  2000 mm  (2 PIECES)","DY150",76,null,"/","/","/",3661238013469,2.4900000000000002,1960,150,150,"C0"]
[84887552,"COUDE PPS à 90°","DY152",15,null,"/","/","/",3661238013445,0.2,255,145,150,"C0"]
[84887554,"COUDE PPS à 45°  (2 PCS)","DY154",34,null,"/","/","/",3661238013421,0.32,200,200,150,"C0"]
[84887563,"T PPS  AVEC COUVERCLE D'INSPECTION","DY163",57,null,"/","/","/",3661238013353,0.39,290,220,170,"C0"]
[84887551,"COLLIER DE CENTRAGE Ø 80 mm (2 PIECES)","DY151",13,null,"/","/","/",3661238013452,0.1,300,300,40,"C0"]
[null,"PPS/ALU 80/125"]
[100002732,"TERMINAL VERTICAL PPS Ø 80/125 mm NOIR","DY843",152,null,"/","/","/",3661238006621,4.2,1210,270,240,"C0"]
[100002733,"TERMINAL VERTICAL PPS Ø 80/125 mm ROUGE","DY844",151,null,"/","/","/",3661238006614,4.2,1210,265,240,"C0"]
[84887524,"PIECE D'INSPECTION DROITE ALU/PPS Ø 80/125 mm","DY124",108,null,"/","/","/",3661238013704,0.55000000000000004,300,145,150,"C0"]
[84887525,"T D'INSPECTION ALU/PPS Ø 80/125 mm","DY125",124,null,"/","/","/",3661238013698,0.82,315,235,150,"C0"]
[100008311,"COUDE DE REVISION ALU/PPS Ø 80/125 mm","DY875",113,null,"/","/","/",3661238101920,0.68,195,195,145,"C0"]
[84887526,"RALLONGE CONCENTRIQUE ALU/PPS  80/125 L= 250 mm","DY126",40,null,"/","/","/",3661238013681,0.47,255,145,150,"C0"]
[84887527,"RALLONGE CONCENTRIQUE ALU/PPS 80/125 L= 500mm","DY127",46,null,"/","/","/",3661238013674,0.9,520,140,140,"C0"]
[84887528,"RALLONGECONCENTRIQUE ALU/PPS 80/125 L=1000 mm","DY128",68,null,"/","/","/",3661238013667,1.7,1010,135,140,"C0"]
[84887529,"RALLONGE CONCENTRIQUE ALU/PPS 80/125 L=1950 mm","DY129",118,null,"/","/","/",3661238013650,3.5,1960,150,150,"C0"]
[84887531,"COUDE A 87° ALU/PPS  Ø 80/125 mm","DY131",50,null,"/","/","/",3661238013636,0.66,200,200,150,"C0"]
[84887532,"COUDE CONCENTRIQUE 45° ALU/PPS Ø 80/125 mm (2 PCES)","DY132",76,null,"/","/","/",3661238013629,1,315,235,150,"C0"]
[84887708,"ADAPTATEUR ALU Ø 60/100 MM SUR 80/125 MM","DY708",57,null,"/","/","/",3661238012028,0.33,255,145,150,"C0"]
[100014000,"KIT DE RACCORDEMENT 3CEP Ø 80/125mm","DY887",148,null,"/","/","/",3661238368989,2.0499999999999998,625,215,225,"C0"]
[null,"Divers"]
[84887411,"SORTIE HORIZONTALE TOIT PENTE DE 30° A 45° ( uniquement pour tuiles mécaniques)","DY11",175,null,"/","/","/",3661238013940,3.57,1020,700,370,"C0"]
[84837729,"SORTIE DE TOIT EN PENTE DE 40° A 60° ( uniquement pour tuiles mécaniques)","CX49",175,null,"/","/","/",3661238014367,3.5,920,700,320,"C0"]
[84837731,"EMBASE D'ETANCHE TOIT PLAT","CX51",42,null,"/","/","/",3661238014343,0.5,400,400,155,"C0"]
[84837121,"TUILE A DOUILLE 5 A 25 NOIRE","CX121",110,null,"/","/","/",3661238014428,2.96,510,250,145,"C0"]
[84837732,"TUILE A DOUILLE 25 A 35 NOIRE","CX52",76,null,"/","/","/",3661238014336,3,520,250,145,"C0"]
[84837734,"TUILE A DOUILLE 35 A 55° NOIRE ","CX63",95,null,"/","/","/",3661238014312,3.17,510,265,180,"C0"]
[84837120,"TUILE A DOUILLE 5 A 25° ROUGE","CX120",110,null,"/","/","/",3661238014435,3.02,515,245,145,"C0"]
[84837783,"TUILE A DOUILLE 25 A 35 ROUGE","CX83",76,null,"/","/","/",3661238014213,3,515,250,150,"C0"]
[84837784,"TUILE A DOUILLE 25 A 55 ROUGE","CX84",95,null,"/","/","/",3661238014206,2.95,520,265,180,"C0"]
[84837738,"MANCHON DE COMPENS LG 300","CX67",57,null,"/","/","/",3661238014275,1,515,135,140,"C0"]
[84837741,"PLATINE DE FINITION INTER","CX72",16,null,"/","/","/",3661238014251,0.54,245,210,3,"C0"]
[84887566,"PANIER DE PROTECTION INOX","DY166",79,null,"/","/","/",3661238013339,1.38,220,210,200,"C0"]
[]
[]
[100016211,"GMR 5045 CONDENS OE-CONTROL",null,{"$f":"D2057+$D$2061","v":3745},null,"A","/","/",3661238419926,null,null,null,null,"C0"]
[100016212,"GMR 5065 CONDENS OE-CONTROL",null,{"$f":"D2058+$D$2061","v":4347},null,"A","/","/",3661238419933,null,null,null,null,"C0"]
[100016213,"GMR 5090 CONDENS OE-CONTROL",null,{"$f":"D2059+$D$2061","v":6279},null,"Pas concerné par l'étiquetage",null,null,3661238419940,null,null,null,null,"C0"]
[100016214,"GMR 5115 CONDENS OE-CONTROL",null,{"$f":"D2060+$D$2061","v":7295},null,"Pas concerné par l'étiquetage",null,null,3661238419957,null,null,null,null,"C0"]
[100016215,"GMR 5045 CONDENS OE-TRONIC4",null,{"$f":"D2057+$D$2062","v":3906},null,"A","/","/",3661238419964,null,null,null,null,"C0"]
[100016216,"GMR 5065 CONDENS OE-TRONIC4",null,{"$f":"D2058+$D$2062","v":4508},null,"A","/","/",3661238419971,null,null,null,null,"C0"]
[100016217,"GMR 5090 CONDENS OE-TRONIC4",null,{"$f":"D2059+$D$2062","v":6440},null,"Pas concerné par l'étiquetage",null,null,3661238419988,null,null,null,null,"C0"]
[100016218,"GMR 5115 CONDENS OE-TRONIC4",null,{"$f":"D2060+$D$2062","v":7456},null,"Pas concerné par l'étiquetage",null,null,3661238419995,null,null,null,null,"C0"]
[]
["COMPOSANTS"]
[90547,"GMR 5045 CONDENS","HC226",3620,null,"A","/","/",3661238419728,61,1120,550,400,"C0"]
[90548,"GMR 5065 CONDENS","HC227",4222,null,"A","/","/",3661238419735,68,1120,550,400,"C0"]
[90549,"GMR 5090 CONDENS","HC228",6154,null,"Pas concerné par l'étiquettage",null,null,3661238419742,74,1120,550,480,"C0"]
[90550,"GMR 5115 CONDENS","HC229",7170,null,"Pas concerné par l'étiquettage",null,null,3661238419759,74,1120,550,480,"C0"]
[100016093,"HMI OE-CONTROL","AD271",125,null,"/","/","/",3661238418424,0.3,190,140,125,"C0"]
[100016095,"HMI OE-TRONIC4","AD273",286,null,"/","/","/",3661238418448,0.36,190,140,125,"C0"]
[]
["OPTIONS REGULATIONS"]
[null,"Œ-TRONIC 4"]
[100013304,"COLIS OPTION V3V OE-TRONIC 4","AD249",155,0.01,"/","/","/",3661238363519,0.42,260,170,130,"C0"]
[100013305,"COLIS SONDE SYSTÈME OE-TRONIC 4","AD250",45,0.01,"/","/","/",3661238363588,0.13400000000000001,150,210,25,"C0"]
[100013306,"SONDE EXTERIEURE RADIO ","AD251",76,0.08,"/","/","/",3661238363595,0.15,150,210,40,"C0"]
[100013307,"MODULE CHAUDIERE RADIO (EMETTEUR)","AD252",121,0.08,"/","/","/",3661238363601,0.32,260,160,130,"C0"]
[100013472,"CDE A DISTANCE RADIO RS 400R     ","AD255",233,0.08,"/","/","/",3661238364233,0.253,175,122,60,"C0"]
[100013477,"CDE A DISTANCE FILAIRE RS 400   ","AD257",174,0.08,"/","/","/",3661238364257,0.253,175,122,60,"C0"]
[88017851,"CABLE DE LIAISON BUS LG 12 M","AD134",108,0.01,"/","/","/",3661238048850,0.37,350,260,30,"C0"]
[88017878,"MODULE DE TELESURVEILLANCE VOCAL TELCOM 2","AD152",690,0.08,"/","/","/",3661238048751,1.05,210,190,105,"C0"]
[88017017,"SONDE DEPART v3v","AD199",79,0.01,"/","/","/",3661238049185,0.21,150,200,40,"C0"]
[100000030,"COLIS OPTION SONDE ECS","AD212",48,0.01,"/","/","/",3661238011168,0.16,200,150,30,"C0"]
[100005130,"SONDE POUR BALLON TAMPON ","AD216",93,0.01,"/","/","/",3661238001855,0.26,210,170,35,"C0"]
["S101477","INTERFACE SCU-X03","HC258",121,0.01,"/","/","/",3661238508415,0.55000000000000004,230,120,105,"C0"]
[null,"Œ-CONTROL"]
[88017838,"SONDE EXTERIEURE AF 40","AD122",81,0.01,"/","/","/",3661238048898,0.1,200,150,50,"C0"]
[100000030,"COLIS OPTION SONDE ECS","AD212",48,0.01,"/","/","/",3661238011168,0.16,200,150,30,"C0"]
[]
["OPTIONS ECS"]
[100007827,"KIT LIAISON CHAUDIERE / BALLON","EA121",590,null,"/","/","/",3661238116528,6.5,600,500,135,"C0"]
[100000030,"COLIS OPTION SONDE ECS","AD212",48,0.01,"/","/","/",3661238011168,0.16,200,150,30,"C0"]
["OPTIONS "]
[100002310,"KIT DE RACCORDEMENT HYDRAULIQUE FRANCE GMR 5065 ET 5090 ","HC139",326,null,"/","/","/",3661238007604,4.0999999999999996,310,215,130,"C0"]
["S101539","CACHE TUBULURE","HC242",61,null,"/","/","/",3661238420090,2,510,390,260,"C0"]
[111920,"ISOLATION RACCORDEMENT CHAUDIÈRE","HC214",67,null,"/","/","/",3661238338838,0.41,530,470,250,"C0"]
[122441,"ISOLATION ARRIERE KIT DE RACCORDEMENT HYDRAULIQUE","HC252",67,null,"/","/","/",3661238509597,0.55000000000000004,530,255,470,"C0"]
[123182,"ISOLATION ARRIERE RACCORDEMENT CHAUDIÈRE","HC243",10,null,"/","/","/",3661238494411,0.39,940,540,8,"C0"]
["S100310","THERMOSTAT FUMEE","HR43",67,0.01,"/","/","/",3661238369931,0.1,180,130,30,"C0"]
[84887768,"ADAPTATEUR  80 X 100MM ","DY768",54,null,"/","/","/",3661238011489,0.24,150,145,155,"C0"]
["S100762","ADAPTATEUR BIFLUX 2 X 80mm","DY906",63,null,"/","/","/",8713809218959,0.7,320,210,260,"C0"]
["S101626","ADAPTATEUR BIFLUX 2 X 100MM","DY907",72,null,"/","/","/",3661238420106,1.6,320,210,260,"C0"]
[100004641,"ROBINET GAZ 3/4\" DROIT","HC158",43,null,"/","/","/",3661238002432,0.82,200,150,125,"C0"]
[100002313,"POMPE GMR 5045 ELECTRONIQUE","HC142",317,null,"/","/","/",3661238007574,3.1,310,210,130,"C0"]
[7630016,"POMPE ERP 65-90-115 KW ","SA13",397,null,"/","/","/",3661238630727,3,null,null,null,"C0"]
[100002323,"POMPE PRIMAIRE POUR GMR 5045-5065-5090","HC147",347,null,"/","/","/",3661238007499,4.5999999999999996,310,210,130,"C0"]
[85317005,"VANNE TROIS VOIES AVEC MOTEUR 1\"","HC15",379,null,"/","/","/",3661238091696,2.36,265,170,120,"C0"]
[100019346,"BOUTEILLE DE DECOUPLAGE  60/60-1''  ","GV45",358,null,"/","/","/",3661238555013,3.83,690,375,205,"C0"]
[100019347,"BOUTEILLE DE DECOUPLAGE  80/60-1'' 1/4 ","GV46",429,null,"/","/","/",3661238555020,5.42,690,375,205,"C0"]
[100019348,"BOUTEILLE DE DECOUPLAGE  120/80-2''   ","GV47",577,null,"/","/","/",3661238555037,11.96,970,375,205,"C0"]
["S101463","RAIL DE MONTAGE CHAUDIERE GMR 5000 SUR SYSTEME CASCADE MC","HC245",48,null,"/","/","/",3661238420113,1.6,560,290,10,"C0"]
["S101655","FILTRE GAZ Ø 50 mm","HC255",507,null,"/","/","/",8713809234331,4.9000000000000004,465,280,230,"C0"]
[7613605,"STATION DE NEUTRALISATION DN1","SA1",337,null,"/","/","/",3661238592117,14.5,350,230,350,"C0"]
[7613606,"SUPPORT FIXATION MURAL","SA2",62,null,"/","/","/",3661238592124,2.1,300,240,160,"C0"]
[85317025,"RECHARGE 2 KG POUR NEUTRALISATION","HC35",137,null,"/","/","/",3661238091610,3.65,510,315,190,"C0"]
[83877009,"SYSTEME DE NEUTRALISATION DES CONDENSATS (avec pompe de relevage)","DU13",895,null,"/","/","/",3661238015081,15,350,230,360,"C0"]
[83877010,"STATION NEUTRALISATION","DU14",1246,null,"/","/","/",3661238015074,26,450,330,350,"C0"]
[83877011,"STATION NEUTRALISATION","DU15",1326,null,"/","/","/",3661238015067,20,660,455,270,"C0"]
[100019369,"POMPE MOD UPM2 15-70 RES CLASSE A  J","JA44",230,null,"/","/","/",3661238563810,1.8,215,155,155,"C0"]
[100005002,"PANIER DE PROTECTION INOX  Ø 80/125","DY865",172,null,"/","/","/",3661238001886,2.59,275,270,270,"C0"]
[100005004,"PANIER DE PROTECTION INOX D100/150","DY866",176,null,"/","/","/",3661238001879,3.1,305,310,270,"C0"]
["S52484","OUTIL DE NETTOYAGE POUR GMR 5045 -5065 (L= 360 mm)","HC246",83,null,"/","/","/",3661238382466,0.17399999999999999,50,3,3,"C0"]
["S58286","OUTIL DE NETTOYAGE POUR GMR 5090 - 5115 (L=460 mm)","HC247",87,null,"/","/","/",8713809017453,0.18,725,35,50,"C0"]
[94225601,"RECHARGE DE GRANULATS DE NEUTRALISATION 10 KG**","CPR","P/R",null,"/","/","/",3661238075597,10,25,25,21.5]
[100018981,"RECUPERATEUR DE CONDENSATS  Ø 80/125 mm PPs/Alu","DY916",54,null,"/","/","/",3661238547711,0.86,200,200,150,"C0"]
[100018983,"RECUPERATEUR DE CONDENSATS  Ø 110 mm PPs","DY917",63,null,"/","/","/",3661238547728,0.31,400,400,275,"C0"]
[100018984,"RECUPERATEUR DE CONDENSATS  Ø 110/150 mm PPs/Alu","DY918",112,null,"/","/","/",3661238547735,0.76,260,170,180,"C0"]
[100018985,"RECUPERATEUR DE CONDENSATS  Ø 80 mm PPs","DY919",33,null,"/","/","/",3661238547742,0.18,260,145,150,"C0"]
["S101614","POMPE CHAUFFAGE EEI UPM2 25-70 130MM",null,297,null,"/","/","/",8713809243432,5,300,150,130,"C0"]
[7608398,"POMPE CHAUFFAGE UPML 25-115 130 MM",null,384,null,"/","/","/",8713809264796,3.4,305,155,140,"C0"]
[7606393,"VANNE GAS S GMR 5090 PROPANE",null,"P/R",null,"/","/","/"]
[]
["MONTAGE MURAL (LW)"]
["SYSTÈME DE CASCADE POUR 2 CHAUDIÈRES"]
[null,"LW.0080kW.2000",null,3349,null,"Pas concerné par l'étiquettage"]
[null,"LW.0122kW.0200",null,3409,null,"Pas concerné par l'étiquettage"]
[null,"LW.0168kW.0020",null,3677,null,"Pas concerné par l'étiquettage"]
[null,"LW.0214kW.0002",null,3677,null,"Pas concerné par l'étiquettage"]
["SYSTÈME DE CASCADE POUR 3 CHAUDIÈRES"]
[null,"LW.0120kW.3000",null,4518,null,"Pas concerné par l'étiquettage"]
[null,"LW.0183kW.0300",null,4608,null,"Pas concerné par l'étiquettage"]
[null,"LW.0252kW.0030",null,5010,null,"Pas concerné par l'étiquettage"]
[null,"LW.0321kW.0003",null,5010,null,"Pas concerné par l'étiquettage"]
["SYSTÈME DE CASCADE POUR 4 CHAUDIÈRES"]
[null,"LW.0160kW.4000",null,5884,null,"Pas concerné par l'étiquettage"]
[null,"LW.0244kW.0400",null,6004,null,"Pas concerné par l'étiquettage"]
[null,"LW.0336kW.0040",null,6540,null,"Pas concerné par l'étiquettage"]
[null,"LW.0428kW.0004",null,6962,null,"Pas concerné par l'étiquettage"]
["ALIGNEMENT AU SOL (LV)"]
["SYSTÈME DE CASCADE POUR 2 CHAUDIÈRES"]
[null,"LV.0080kW.2000",null,3750,null,"Pas concerné par l'étiquettage"]
[null,"LV.0122kW.0200",null,3810,null,"Pas concerné par l'étiquettage"]
[null,"LV.0168kW.0020",null,4078,null,"Pas concerné par l'étiquettage"]
[null,"LV.0214kW.0002",null,4078,null,"Pas concerné par l'étiquettage"]
["SYSTÈME DE CASCADE POUR 3 CHAUDIÈRES"]
[null,"LV.0120kW.3000",null,5090,null,"Pas concerné par l'étiquettage"]
[null,"LV.0183kW.0300",null,5180,null,"Pas concerné par l'étiquettage"]
[null,"LV.0252kW.0030",null,5582,null,"Pas concerné par l'étiquettage"]
[null,"LV.0321kW.0003",null,5582,null,"Pas concerné par l'étiquettage"]
["SYSTÈME DE CASCADE POUR 4 CHAUDIÈRES"]
[null,"LV.0160kW.4000",null,6618,null,"Pas concerné par l'étiquettage"]
[null,"LV.0244kW.0400",null,6738,null,"Pas concerné par l'étiquettage"]
[null,"LV.0336kW.0040",null,7274,null,"Pas concerné par l'étiquettage"]
[null,"LV.0428kW.0004",null,7696,null,"Pas concerné par l'étiquettage"]
[]
["COMPOSANTS DE BASE DES CASCADES"]
[120918,"CHASSIS DE MONTAGE GMR 5000","HC248",91,null,"/","/","/",3661238420120,5.5,500,660,65,"C0"]
[120842,"MONTANT-SUPPORT L GMR 5000","HC249",139,null,"/","/","/",3661238420137,6,1500,450,50,"C0"]
[120900,"MONTANT-SUPPORT I GMR 5000","HC250",87,null,"/","/","/",3661238420144,4.5,1500,50,50,"C0"]
[90777,"COLLECTEUR DN65 - 2 CHAUDIERES ","HC259",648,null,"/","/","/",3661238553019,61,1200,500,640,"C0"]
[90778,"COLLECTEUR DN65 - 3 CHAUDIERES ","HC260",878,null,"/","/","/",3661238553026,77,1705,500,640,"C0"]
[111688,"RAIL DE MONTAGE MURAL 2 CHAUDIÈRES ","HC192",42,null,"/","/","/",3661238339002,1.32,970,80,50,"C0"]
[111689,"RAIL DE MONTAGE MURAL 3 CHAUDIÈRES ","HC193",49,null,"/","/","/",3661238338999,2.0699999999999998,1500,80,50,"C0"]
[111690,"RAIL DE MONTAGE MURAL 4 CHAUDIÈRES ","HC194",65,null,"/","/","/",3661238338982,2.72,2030,800,50,"C0"]
[111708,"JEU DE BOUCHONS ","HC195",40,null,"/","/","/",3661238338937,0.67,200,130,30,"C0"]
[111701,"BRIDES PLEINES EAU DN65","HC198",145,null,"/","/","/",3661238338951,4.83,370,170,50,"C0"]
[114311,"BOUTEILLE DE DÉCOUPLAGE DN65 < 350 kW","HC222",604,null,"/","/","/",3661238362215,26.6,660,170,310,"C0"]
[111712,"BOUTEILLE DE DÉCOUPLAGE DN65","HC200",1003,null,"/","/","/",3661238338920,46.5,900,630,160,"C0"]
[111022,"KIT DE RACCORDEMENT AVANT FR + BE","HC202",593,null,"/","/","/",3661238339057,7.39,450,315,150,"C0"]
[100002312,"CIRCULATEUR 3 VITESSES GMR 5045","HC141",216,null,"/","/","/",3661238007581,3.1,310,210,130,"C0"]
[100002314,"CIRCULATEUR 3 VITESSES GMR 5065 ","HC143",246,null,"/","/","/",3661238007567,3.2,305,210,130,"C0"]
[100002316,"POMPE GMR 5090 3 VITESSES","HC145",380,null,"/","/","/",3661238007550,4.5,310,210,130,"C0"]
[100013027,"SONDE DE DÉPART + DOIGT DE GANT-BOUTEILLE < 350 kW","HC223",129,0.01,"/","/","/",3661238362239,0.2,150,210,30,"C0"]
[100008701,"SONDE DE DÉPART + DOIGT DE GANT","HC206",152,0.01,"/","/","/",3661238339255,0.21,210,160,25,"C0"]
[88017836,"CABLE BUS RX11  LG 1,5 M","AD124",83,0.01,"/","/","/",3661238048911,0.06,210,160,5,"C0"]
["S103345","JEUX DE BRIDES À SOUDER DN50 POUR FILTRE A GAZ","HC261",83,null,"/","/","/",null,6,320,320,165,"C0"]
[]
["OPTIONS CASCADE"]
[111788,"COUDES DN65","HC209",650,null,"/","/","/",3661238338883,14,700,300,170,"C0"]
[111069,"ISOLATION COLLECTEUR","HC213",85,null,"/","/","/",3661238339026,0.66,530,480,280,"C0"]
[111920,"ISOLATION RACCORDEMENT CHAUDIÈRE","HC214",67,null,"/","/","/",3661238338838,0.41,530,470,250,"C0"]
[123182,"ISOLATION ARRIERE RACCORDEMENT CHAUDIÈRE","HC243",10,null,"/","/","/",3661238494411,0.39,940,540,8,"C0"]
[115269,"ISOLATION BOUTEILLE DE DÉCOUPLAGE < 350 kW","HC224",37,null,"/","/","/",3661238362222,0.6,660,280,220,"C0"]
[111067,"ISOLATION BOUTEILLE DE DÉCOUPLAGE","HC215",237,null,"/","/","/",3661238339033,3.2,300,620,960,"C0"]
[111167,"ISOLATION COUDES 90°C","HC216",101,null,"/","/","/",3661238339019,1.1100000000000001,610,300,500,"C0"]
[112632,"JEU DE CONTRE-BRIDES À SOUDER DN65","HC217",150,null,"/","/","/",3661238338821,6.58,160,160,120,"C0"]
[111807,"PIED REGLABLE","HC219",4,null,"/","/","/",3661238338845,0.09,230,115,5,"C0"]
[100003347,"COMMANDE EXTERNE ALARME VANNE","GR12",87,0.01,"/","/","/",3661238005358,0.36,195,150,125,"C0"]
[84887768,"ADAPTATEUR  80 X 100MM ","DY768",54,null,"/","/","/",3661238011489,0.24,150,145,155,"C0"]
[]
["FUMISTERIE"]
[null,"ALU 80"]
[84887600,"TUBE D'INSPECTION Ø 80 mm ","DY600",47,null,"/","/","/",3661238013094,0.49,300,145,150,"C0"]
[84887738,"TE DE VISITE Ø 80 mm ","DY738",70,null,"/","/","/",3661238011755,0.66,285,215,165,"C0"]
[84887604,"RALLONGE Ø 80 mm    L= 250 mm  (2 PIECES)","DY604",36,null,"/","/","/",3661238013056,0.65,255,170,175,"C0"]
[84887605,"RALLONGE Ø 80 mm    L=  500 mm  (2 PIECES)","DY605",44,null,"/","/","/",3661238013049,1.26,520,175,170,"C0"]
[84887606,"RALLONGE 1000 mm  (2 PIECES)","DY606",71,null,"/","/","/",3661238013032,2.52,1020,175,175,"C0"]
[84887607,"RALLONGE Ø 80 mm    L=  1950 mm   (2 PIECES)","DY607",118,null,"/","/","/",3661238013025,5,1985,170,175,"C0"]
[84887551,"COLLIER DE CENTRAGE Ø 80mm  (2 PIECES)","DY151",13,null,"/","/","/",3661238013452,0.1,300,300,40,"C0"]
[84887608,"COUDE A 90°","DY608",23,null,"/","/","/",3661238013018,0.34,155,160,160,"C0"]
[84887609,"COUDE A 45°  (2 PIECES)","DY609",39,null,"/","/","/",3661238013001,0.48,200,200,150,"C0"]
[84887711,"KIT N° 1 RACCORDEMENT CHEMINEE Ø  80 ","DY711",181,null,"/","/","/",3661238011991,3.66,595,400,410,"C0"]
[null," PIECE  SPECIFIQUE POUR RACCORDEMENT EN  BIFLUX C53 Ø 80"]
[100002361,"PIECE D'ADAPTATION BIFLUX 2x80","DY819",43,null,"/","/","/",3661238007338,0.1,340,240,30,"C0"]
[84887438,"PRISE D'AIR EXTERIEURE LG=500 mm","DY38",97,null,"/","/","/",3661238013858,1.23,690,245,145,"C0"]
[null,"FLEXIBLE PPS Ø 80"]
[84887716,"KIT N° 3 RACCORDEMENT CHAUDIERE  PPS Ø 80/125 mm","DY716",141,null,"/","/","/",3661238011953,2.36,500,290,260,"C0"]
[100015325,"KIT N° 1 RACCORDEMENT CHEMINÉE FLEXIBLE PPS Ø 80 mm","DY895",231,null,"/","/","/",3661238380110,2.87,395,395,380,"C0"]
[100015327,"TUBE FLEXIBLE LG=12,5M","DY897",347,null,"/","/","/",3661238380134,8.6999999999999993,1200,1220,250,"C0"]
[100015326,"TUBE FLEXIBLE LG=50M","DY896",1216,null,"/","/","/",3661238380127,35,1600,1660,410,"C0"]
[84887618,"ETOILE DE CENTRAGE POUR FLEXIBLE Ø 80  mm (2 PIÈCES)","DY618",36,null,"/","/","/",3661238012912,0.2,300,300,70,"C0"]
[100015328,"PIÈCE DE COUPLAGE FLEXIBLE Ø 80 mm","DY898",70,null,"/","/","/",3661238380141,0.25,150,150,150,"C0"]
[100015331,"OUTIL D'AIDE À L'INSERTION Ø 80 mm","DY901",174,null,"/","/","/",3661238380172,1.4,300,210,185,"C0"]
[100015330,"PIÈCE D'INSPECTION POUR TUBE FLEXIBLE","DY900",125,null,"/","/","/",3661238380165,0.5,295,140,140,"C0"]
[100015329,"TERMINAL AVEC SOLIN FLEX. Ø 80 mm","DY899",174,null,"/","/","/",3661238380158,1.74,385,385,250,"C0"]
[null,"B23 EN DIAMETRE 80 PPS"]
[100017527,"KIT DE BASE PPS/ALU Ø 80/125 ","DY913",163,null,"/","/","/",3661238496330,3.7,600,400,275,"C0"]
[84887717,"KIT N° 1 KIT DE RACCORDEMENT CHEMINEE PPS Ø 80 mm","DY717",154,null,"/","/","/",3661238011946,2.89,395,405,390,"C0"]
[84887546,"PIÈCE DE VISITE Ø 80 mm droite","DY146",57,null,"/","/","/",3661238013506,0.28999999999999998,300,145,150,"C0"]
[84887613,"RALLONGE PPS Ø 80 mm   L= 250 mm (2 PCS)","DY613",39,null,"/","/","/",3661238012967,0.37,250,170,175,"C0"]
[84887614,"RALLONGE PPS  Ø 80 mm   L=  500 mm (2 PCS)","DY614",37,null,"/","/","/",3661238012950,0.68,500,160,150,"C0"]
[84887615,"RALLONGE PPS  Ø 80 mm   L=  1000 mm (2 PCS)","DY615",50,null,"/","/","/",3661238012943,1.25,1000,160,145,"C0"]
[84887550,"RALLONGE PPS Ø 80 mm   L=  2000 mm  (2 PIECES)","DY150",76,null,"/","/","/",3661238013469,2.4900000000000002,1960,150,150,"C0"]
[84887552,"COUDE PPS à 90°","DY152",15,null,"/","/","/",3661238013445,0.2,255,145,150,"C0"]
[84887554,"COUDE PPS a 45°  (2 PCS)","DY154",34,null,"/","/","/",3661238013421,0.32,200,200,150,"C0"]
[84887563,"T PPS  AVEC COUVERCLE  D'INSPECTION","DY163",57,null,"/","/","/",3661238013353,0.39,290,220,170,"C0"]
[84887551,"COLLIER DE CENTRAGE Ø 80mm (2 PIECES)","DY151",13,null,"/","/","/",3661238013452,0.1,300,300,40,"C0"]
[null,"PPS 80/125"]
[100011365,"KIT VENTOUSE HOR PPS/ALU Ø 80/125mm","DY882",204,null,"/","/","/",3661238374768,4.4000000000000004,1210,265,250,"C0"]
[100002732,"TERMINAL VERTICAL PPS Ø 80/125 mm NOIR","DY843",152,null,"/","/","/",3661238006621,4.2,1210,270,240,"C0"]
[100002733,"TERMINAL VERTICAL PPS Ø 80/125 mm ROUGE","DY844",151,null,"/","/","/",3661238006614,4.2,1210,265,240,"C0"]
[100008311,"COUDE DE REVISION ALU/PPS Ø 80/125 mm","DY875",113,null,"/","/","/",3661238101920,0.68,195,195,145,"C0"]
[100003271,"KIT DE RACCORDEMENT CHAUDIÈRE PERPENDICULAIRE","DY849",220,null,"/","/","/",3661238005600,3.5,595,395,410,"C0"]
[100003272,"KIT DE RACCORDEMENT CHAUDIÈRE SOUS CONDUIT","DY850",165,null,"/","/","/",3661238005594,1.44,500,290,260,"C0"]
[100011365,"KIT VENTOUSE HOR PPS/ALU Ø 80/125mm","DY882",204,null,"/","/","/",3661238374768,4.4000000000000004,1210,265,250,"C0"]
[84887524,"PIECE D'INSPECTION DROITE ALU/PPS Ø 80/125 mm","DY124",108,null,"/","/","/",3661238013704,0.55000000000000004,300,145,150,"C0"]
[84887525,"T D'INSPECTION ALU/PPS Ø 80/125 mm","DY125",124,null,"/","/","/",3661238013698,0.82,315,235,150,"C0"]
[84887526,"RALLONGE CONCENTRIQUE ALU/PPS  80/125 L= 250 mm","DY126",40,null,"/","/","/",3661238013681,0.47,255,145,150,"C0"]
[84887527,"RALLONGE CONCENTRIQUE ALU/PPS 80/125 L= 500mm","DY127",46,null,"/","/","/",3661238013674,0.9,520,140,140,"C0"]
[84887528,"RALLONGECONCENTRIQUE ALU/PPS 80/125 L=1000 mm","DY128",68,null,"/","/","/",3661238013667,1.7,1010,135,140,"C0"]
[84887529,"RALLONGE CONCENTRIQUE ALU/PPS 80/125 L=1950 mm","DY129",118,null,"/","/","/",3661238013650,3.5,1960,150,150,"C0"]
[84887531,"COUDE A 87° ALU/PPS  Ø 80/125 mm","DY131",50,null,"/","/","/",3661238013636,0.66,200,200,150,"C0"]
[84887532,"COUDE CONCENTRIQUE 45° ALU/PPS Ø 80/125 mm (2 PCES)","DY132",76,null,"/","/","/",3661238013629,1,315,235,150,"C0"]
[null,"Divers"]
[84837119,"TERMINAL HORIZONTAL ALU/ALU D.80/125 MM L=730 MM","CX119",98,null,"/","/","/",3661238014442,2.96,1025,170,170,"C0"]
[84887411,"SORTIE HORIZONTALE TOIT PENTE DE 30° A 45° ( uniquement pour tuiles mécaniques)","DY11",175,null,"/","/","/",3661238013940,3.57,1020,700,370,"C0"]
[84837729,"SORTIE DE TOIT EN PENTE DE 40° A 60° ( uniquement pour tuiles mécaniques)","CX49",175,null,"/","/","/",3661238014367,3.5,920,700,320,"C0"]
[84837731,"EMBASE D'ETANCHE TOIT PLAT","CX51",42,null,"/","/","/",3661238014343,0.5,400,400,155,"C0"]
[84837121,"TUILE A DOUILLE 5 A 25 NOIRE","CX121",110,null,"/","/","/",3661238014428,2.96,510,250,145,"C0"]
[84837732,"TUILE A DOUILLE 25 A 35' NOIRE","CX52",76,null,"/","/","/",3661238014336,3,520,250,145,"C0"]
[84837734,"TUILE A DOUILLE 35 A 55° NOIRE ","CX63",95,null,"/","/","/",3661238014312,3.17,510,265,180,"C0"]
[84837120,"TUILE A DOUILLE 5 A 25° ROUGE","CX120",110,null,"/","/","/",3661238014435,3.02,515,245,145,"C0"]
[84837783,"TUILE A DOUILLE 25 A 35 ROUGE","CX83",76,null,"/","/","/",3661238014213,3,515,250,150,"C0"]
[84837784,"TUILE A DOUILLE 25 A 55 ROUGE","CX84",95,null,"/","/","/",3661238014206,2.95,520,265,180,"C0"]
[84837741,"PLATINE DE FINITION INTER","CX72",16,null,"/","/","/",3661238014251,0.54,245,210,3,"C0"]
[84887566,"PANIER DE PROTECTION INOX","DY166",79,null,"/","/","/",3661238013339,1.38,220,210,200,"C0"]
[null,"ALU / ALU Ø 100/150 mm VERTICALE"]
[84827103,"EMBASE D'ETANCHEITE POUR TOIT PLAT","CX103",57,null,"/","/","/",3661238014589,0.49,470,470,100,"C0"]
[84827104,"TUILE A DOUILLE NOIRE AVEC ROTULE PENTE DE 25 ° A 45 °","CX104",108,null,"/","/","/",3661238014572,2.97,510,260,180,"C0"]
[84827106,"TUILE A DOUILLE ROUGE AVEC ROTULE PENTE DE 25 ° A 45 °","CX106",108,null,"/","/","/",3661238014565,2.98,510,260,180,"C0"]
[84827111,"COLLIER DIAMETRE 150 MM","CX111",12,null,"/","/","/",3661238014527,0.12,200,170,20,"C0"]
[84827115,"PLATINES DE FINITION ( 2 PIECES )","CX115",26,null,"/","/","/",3661238014480,0.52,250,210,3,"C0"]
[null,"ALU 100"]
[84887624,"TUBE D'INSPECTION L=300 mm","DY624",106,null,"/","/","/",3661238012851,0.56000000000000005,305,150,150,"C0"]
[84887739,"T DE VISITE ø 100 mm","DY739",91,null,"/","/","/",3661238011748,0.84,310,230,145,"C0"]
[84887625,"RALLONGE  ø 100 mm   L=  500 mm (2 PIECES)","DY625",75,null,"/","/","/",3661238012844,1.63,1010,135,140,"C0"]
[84887626,"RALLONGE  ø 100 mm   L=  1000 mm (2 PIECES)","DY626",127,null,"/","/","/",3661238012837,3.37,1005,290,150,"C0"]
[84887627,"RALLONGE  ø 100 mm   L=  1950 mm  (2 PIECES)","DY627",238,null,"/","/","/",3661238012820,7.5,1970,300,190,"C0"]
[84887628,"ETOILE DE CENTRAGE ø 100 mm (2 PIECES)","DY628",39,null,"/","/","/",3661238012813,0.1,300,300,35,"C0"]
[84887629,"COUDE  90°","DY629",46,null,"/","/","/",3661238012806,0.41,250,145,150,"C0"]
[84887630,"COUDE 45°  (2 PIECES)","DY630",91,null,"/","/","/",3661238012790,0.63,255,190,150,"C0"]
[84887768,"ADAPTATEUR  80 X 100MM ","DY768",54,null,"/","/","/",3661238011489,0.24,150,145,155,"C0"]
[84887633,"KIT N° 1  RACCORDEMENT CHEMINEE Ø  100 ","DY633",280,null,"/","/","/",3661238012769,3.63,590,395,410,"C0"]
[null,"RACCORDEMENT biFLUX C53 Ø 100"]
[100002362,"PIECE D'ADAPTATION BIFLUX 2x100","DY820",43,null,"/","/","/",3661238007321,0.09,340,240,35,"C0"]
[100002285,"PRISE D'AIR EXTERIEUR Lg 500 mm Ø 100","DY810",95,null,"/","/","/",3661238007659,1.4,1005,110,110,"C0"]
[84887633,"KIT N° 1 RACCORDEMENT CHEMINEE Ø  100 ","DY633",280,null,"/","/","/",3661238012769,3.63,590,395,410,"C0"]
[null,"FLEXIBLE PPS 110"]
[100015287,"KIT N° 1 RACCORDEMENT CHEMINÉE FLEXIBLE PPS Ø 110 mm","DY888",347,null,"/","/","/",3661238380035,3.4,590,390,400,"C0"]
[100015288,"FLEXIBLE PPS Ø 110 mm LG= 15 M","DY889",522,null,"/","/","/",3661238380042,8.6999999999999993,1320,1280,355,"C0"]
[100015289,"FLEXIBLE PPS Ø 110 mm LG= 25 M","DY890",870,null,"/","/","/",3661238380059,750,1610,1610,400,"C0"]
[100002280,"ETOILES DE CENTRAGE  Ø 110 mm POUR FLEXIBLE (4 PIÈCES)","DY805",41,null,"/","/","/",3661238007697,0.1,325,360,80,"C0"]
[100015321,"PIÈCE DE COUPLAGE FLEXIBLE Ø 110 mm","DY891",162,null,"/","/","/",3661238380073,0.25,195,195,140,"C0"]
[100015323,"TUBE DE VISITE Ø 110 mm POUR FLEXIBLE PPS","DY893",231,null,"/","/","/",3661238380097,0.5,295,140,140,"C0"]
[100015324,"OUTIL D'AIDE À L'INSERTION  Ø 110 mm","DY894",267,null,"/","/","/",3661238380103,1.4,190,210,165,"C0"]
[100015322,"TERMINAL AVEC SOLIN POUR FLEX Ø 110","DY892",256,null,"/","/","/",3661238380080,3,590,400,265,"C0"]
[null,"PPS/ALU 110/150"]
[100002734,"TERMINAL VERTICAL PPS/GALV Ø 110/150 mm NOIR","DY845",263,null,"/","/","/",3661238006607,6.2,1210,265,240,"C0"]
[100002360,"KIT N° 3 RACCORDEMENT CHAUDIERE  PPS ø 100/150 mm","DY818",291,null,"/","/","/",3661238007345,3.7,390,295,1010,"C0"]
[100002351,"RALLONGE PPS-ALU  ø 110/150 mm L=  500 mm","DY811",68,null,"/","/","/",3661238007437,1.5,525,195,200,"C0"]
[100002352,"RALLONGE PPS-ALU ø 110/150 mm L=1000 mm","DY812",102,null,"/","/","/",3661238007420,2.7,1025,195,200,"C0"]
[100002353,"COUDE PPS-ALU  87° ø 110/150 mm  ","DY813",121,null,"/","/","/",3661238007413,1.6,345,265,190,"C0"]
[100002354,"COUDE PPS-ALU  45° ø 110/150 mm (2 PIECES)","DY814",214,null,"/","/","/",3661238007406,2.25,390,290,260,"C0"]
[100002355,"PIECE DE REVISION DROITE PPS-ALU  ø 110/150 mm","DY815",129,null,"/","/","/",3661238007390,1.25,340,265,190,"C0"]
[84827104,"TUILE A DOUILLE NOIRE AVEC ROTULE PENTE DE 25 ° A 45 °","CX104",108,null,"/","/","/",3661238014572,2.97,510,260,180,"C0"]
[84827106,"TUILE A DOUILLE ROUGE AVEC ROTULE PENTE DE 25 ° A 45 °","CX106",108,null,"/","/","/",3661238014565,2.98,510,260,180,"C0"]
[84827111,"COLLIER DIAMETRE 150 MM","CX111",12,null,"/","/","/",3661238014527,0.12,200,170,20,"C0"]
[84827115,"PLATINES DE FINITION ( 2 PIECES )","CX115",26,null,"/","/","/",3661238014480,0.52,250,210,3,"C0"]
[84827103,"EMBASE D'ETANCHEITE POUR TOIT PLAT","CX103",57,null,"/","/","/",3661238014589,0.49,470,470,100,"C0"]
[100002356,"T DE REVISION PPS-ALU  ø 110/150 mm","DY816",184,null,"/","/","/",3661238007383,1.25,345,265,190,"C0"]
[100002357,"ADAPTATEUR PPS-ALU  100/150 - 110/150 mm","DY817",110,null,"/","/","/",3661238007376,0.49,255,170,180,"C0"]
[100011364,"PPs/ALU KIT VENTOUSE HORIZONTALE ø 110/150 mm","DY881",446,null,"/","/","/",3661238367821,6.25,1500,400,300,"C0"]
[null,"B 23 EN DIAMETRE  PPS 110"]
[100008312,"KIT DE RACCORDEMENT CHEMINEE ø 80 - 110 mm PPS","DY876",204,null,"/","/","/",3661238167995,2.79,600,395,410,"C0"]
[100017529,"KIT DE BASE PPS/ALU Ø 110/150","DY914",277,null,"/","/","/",3661238496347,4.0999999999999996,600,396,412,"C0"]
[84887577,"KIT DE RACCORDEMENT CHEMINEE PPS Ø 110 mm ","DY177",253,null,"/","/","/",3661238013223,2.68,395,300,510,"C0"]
[84887578,"TUYAU PPS Ø 110 mm  LG = 1950 mm  (GRIS)","DY178",71,null,"/","/","/",3661238013216,2.46,1960,150,150,"C0"]
[84887579,"TUYAU PPS Ø 110 mm  LG = 1000 mm  (GRIS)","DY179",40,null,"/","/","/",3661238013209,1.24,1015,130,140,"C0"]
[84887580,"TUYAU PPS Ø 110 mm  LG = 500 mm  (GRIS)","DY180",30,null,"/","/","/",3661238013193,0.62,515,135,140,"C0"]
[84887581,"COUDE PPS 87° Ø 110 mm  (GRIS)","DY181",35,null,"/","/","/",3661238013186,0.33,255,190,150,"C0"]
[84887582,"COUDE PPS 45° Ø 110 mm  (GRIS)","DY182",47,null,"/","/","/",3661238013179,0.52,295,215,165,"C0"]
[84887583,"T DE REVISIONØ 110 mm  (GRIS)","DY183",47,null,"/","/","/",3661238013162,0.46,300,150,150,"C0"]
[84887587,"ETOILE DE CENTRAGE PPS  Ø 110 mm  (2 PIECES)","DY187",14,null,"/","/","/",3661238013124,0.1,300,300,30,"C0"]
[]
["FAMILLE:","CHAUDIERE GAZ A CONDENSATION"]
[]
[]
[100018208,"GSCR 15 HOR  ",null,{"$f":"D2328+D2331","v":3357},null,"A","/","/",3661238513761,null,null,null,null,"C0"]
[100018209,"GSCR 15 VER ",null,{"$f":"D2328+D2333","v":3326},null,"A","/","/",3661238513778,null,null,null,null,"C0"]
[100018210,"GSCR 25 HOR",null,{"$f":"D2329+D2331","v":3518},null,"A","/","/",3661238513785,null,null,null,null,"C0"]
[100018211,"GSCR 25 VER",null,{"$f":"D2329+D2333","v":3487},null,"A","/","/",3661238513792,null,null,null,null,"C0"]
[100018212,"GSCR 35 HOR  ",null,{"$f":"D2330+D2332","v":3849},null,"A","/","/",3661238513808,null,null,null,null,"C0"]
[100018213,"GSCR 35 VER ",null,{"$f":"D2330+D2333","v":3797},null,"A","/","/",3661238513815,null,null,null,null,"C0"]
[]
["COMPOSANTS"]
[100017756,"GSCR 15","JA21",3174,null,"A","/","/",3661238505971,68.5,780,680,1060,"C0"]
[100017757,"GSCR 25","JA22",3335,null,"A","/","/",3661238505988,68.5,780,680,1060,"C0"]
[100017758,"GSCR 35","JA23",3645,null,"A","/","/",3661238505995,62,780,680,1060,"C0"]
[100013756,"TERMINAL HORIZONTAL PPS/GALVA Ø 60/100 mm","HR48",183,null,"/","/","/",3661238370883,3.37,1200,200,200,"C0"]
[100011365,"KIT VENTOUSE HOR PPS/ALU Ø 80/125mm","DY882",204,null,"/","/","/",3661238374768,4.4000000000000004,1210,265,250,"C0"]
[100002732,"TERMINAL VERTICAL PPS Ø 80/125 mm NOIR","DY843",152,null,"/","/","/",3661238006621,4.2,1210,270,240,"C0"]
[]
[]
[100018214,"GVCR 15 HOR/100HL ",null,{"$f":"D2344+D2347+D2348+D2349","v":4465},null,"A","A","XL ",3661238513822,null,null,null,null,"C0"]
[100018215,"GVCR 15 VER/100HL ",null,{"$f":"D2344+D2347+D2348+D2351","v":4434},null,"A","A","XL ",3661238513839,null,null,null,null,"C0"]
[100018216,"GVCR 25 HOR/100HL ",null,{"$f":"D2345+D2347+D2348+D2349","v":4626},null,"A","A","XL ",3661238513846,null,null,null,null,"C0"]
[100018217,"GVCR 25 VER/100HL ",null,{"$f":"D2345+D2347+D2348+D2351","v":4595},null,"A","A","XL ",3661238513853,null,null,null,null,"C0"]
[100018218,"GVCR 35 HOR/100HL ",null,{"$f":"D2346+D2347+D2348+D2350","v":4957},null,"A","A","XL ",3661238513860,null,null,null,null,"C0"]
[100018219,"GVCR 35 VER/100HL ",null,{"$f":"D2346+D2347+D2348+D2351","v":4905},null,"A","A","XL ",3661238513877,null,null,null,null,"C0"]
[]
["COMPOSANTS"]
[100017756,"GSCR 15","JA21",3174,null,"A","A","XL ",3661238505971,68.5,780,680,1060,"C0"]
[100017757,"GSCR 25","JA22",3335,null,"A","A","XL ",3661238505988,68.5,780,680,1060,"C0"]
[100017758,"GSCR 35","JA23",3645,null,"A","A","XL ",3661238505995,62,780,680,1060,"C0"]
[100016430,"BALLON 100HL ","ER225",1040,null,"/","/","/",3661238493469,63,790,675,800,"C0"]
[100017392,"KIT RACC. BALLONS HL-SHL","JA9",68,null,"/","/","/",3661238495241,2,410,290,180,"C0"]
[100013756,"TERMINAL HORIZONTAL PPS/GALVA Ø 60/100 mm","HR48",183,null,"/","/","/",3661238370883,3.37,1200,200,200,"C0"]
[100011365,"KIT VENTOUSE HOR PPS/ALU Ø 80/125mm","DY882",204,null,"/","/","/",3661238374768,4.4000000000000004,1210,265,250,"C0"]
[100002732,"TERMINAL VERTICAL PPS Ø 80/125 mm NOIR","DY843",152,null,"/","/","/",3661238006621,4.2,1210,270,240,"C0"]
[]
[]
[100018220,"GVCR 15 HOR/160SL ",null,{"$f":"D2368+D2371+D2372+D2374","v":4357},null,"A","A","XL ",3661238513914,null,null,null,null,"C0"]
[100018221,"GVCR 15 VER/160SL ",null,{"$f":"D2368+D2371+D2372+D2376","v":4326},null,"A","A","XL ",3661238513921,null,null,null,null,"C0"]
[100018222,"GCCR 15 HOR/160SL ",null,{"$f":"D2368+D2371+D2373+D2374","v":4572},null,"A","A","XL ",3661238513938,null,null,null,null,"C0"]
[100018223,"GCCR 15 VER/160SL ",null,{"$f":"D2368+D2371+D2373+D2376","v":4541},null,"A","A","XL ",3661238513945,null,null,null,null,"C0"]
[100018224,"GVCR 25 HOR/160SL ",null,{"$f":"D2369+D2371+D2372+D2374","v":4518},null,"A","A","XL ",3661238513952,null,null,null,null,"C0"]
[100018225,"GVCR 25 VER/160SL ",null,{"$f":"D2369+D2371+D2372+D2376","v":4487},null,"A","A","XL ",3661238513969,null,null,null,null,"C0"]
[100018226,"GCCR 25 HOR/160SL ",null,{"$f":"D2369+D2371+D2373+D2374","v":4733},null,"A","A","XL ",3661238513976,null,null,null,null,"C0"]
[100018227,"GCCR 25 VER/160SL ",null,{"$f":"D2369+D2371+D2373+D2376","v":4702},null,"A","A","XL ",3661238513983,null,null,null,null,"C0"]
[100018228,"GVCR 35 HOR/160SL ",null,{"$f":"D2370+D2371+D2372+D2375","v":4849},null,"A","A","XL ",3661238513990,null,null,null,null,"C0"]
[100018229,"GVCR 35 VER/160SL ",null,{"$f":"D2370+D2371+D2372+D2376","v":4797},null,"A","A","XL ",3661238514003,null,null,null,null,"C0"]
[100018230,"GCCR 35 HOR /160SL ",null,{"$f":"D2370+D2371+D2373+D2375","v":5064},null,"A","A","XL ",3661238514010,null,null,null,null,"C0"]
[100018231,"GCCR 35 VER/160SL ",null,{"$f":"D2370+D2371+D2373+D2376","v":5012},null,"A","A","XL ",3661238514027,null,null,null,null,"C0"]
[]
["COMPOSANTS"]
[100017756,"GSCR 15","JA21",3174,null,"A","A","XL ",3661238505971,68.5,780,680,1060,"C0"]
[100017757,"GSCR 25","JA22",3335,null,"A","A","XL ",3661238505988,68.5,780,680,1060,"C0"]
[100017758,"GSCR 35","JA23",3645,null,"A","A","XL ",3661238505995,62,780,680,1060,"C0"]
[100016428," BALLON 160SL ","ER223",932,null,"Pas concerné par l'étiquettage",null,null,3661238493445,91,790,675,1070,"C0"]
[100017391,"KIT RACC. BALLONS SL-SSL","JA8",68,null,"/","/","/",3661238495234,1.4,630,210,230,"D3"]
[100016480,"KIT DE LIAISON AGC-EGC /B 160-220","ER228",283,null,"/","/","/",3661238493483,6,875,685,235,"C0"]
[100013756,"TERMINAL HORIZONTAL PPS/GALVA Ø 60/100 mm","HR48",183,null,"/","/","/",3661238370883,3.37,1200,200,200,"C0"]
[100011365,"KIT VENTOUSE HOR PPS/ALU Ø 80/125mm","DY882",204,null,"/","/","/",3661238374768,4.4000000000000004,1210,265,250,"C0"]
[100002732,"TERMINAL VERTICAL PPS Ø 80/125 mm NOIR","DY843",152,null,"/","/","/",3661238006621,4.2,1210,270,240,"C0"]
[]
[]
[7606048,"GVCR 15 HOR/L160SL ",null,{"$f":"D2387+D2390+D2391+D2392","v":4483},null,"A","A","XL ",null,null,null,null,null,"C0"]
[7606049,"GVCR 15 VER/L160SL ",null,{"$f":"D2387+D2390+D2391+D2393","v":4452},null,"A","A","XL ",null,null,null,null,null,"C0"]
[7606050,"GVCR 25 HOR/L160SL ",null,{"$f":"D2388+D2390+D2391+D2392","v":4644},null,"A","A","XL ",null,null,null,null,null,"C0"]
[7606051,"GVCR 25 VER/L160SL ",null,{"$f":"D2388+D2390+D2391+D2393","v":4613},null,"A","A","XL ",null,null,null,null,null,"C0"]
[7606052,"GVCR 35 HOR/L160SL ",null,{"$f":"D2389+D2390+D2391+D2394","v":4975},null,"A","A","XL ",null,null,null,null,null,"C0"]
[7606053,"GVCR 35 VER/L160SL ",null,{"$f":"D2389+D2390+D2391+D2393","v":4923},null,"A","A","XL ",null,null,null,null,null,"C0"]
[]
["COMPOSANTS"]
[100017756,"GSCR 15","JA21",3174,null,"A","/","/",3661238505971,68.5,780,680,1060,"C0"]
[100017757,"GSCR 25","JA22",3335,null,"A","/","/",3661238505988,68.5,780,680,1060,"C0"]
[100017758,"GSCR 35","JA23",3645,null,"A","/","/",3661238505995,62,780,680,1060,"C0"]
[100020079,"BALLON L160SL ","EC600",1058,null,"Pas concerné par l'étiquettage",null,null,3661238584310,97.5,680,380,1111,"C0"]
[100017392,"KIT RACC. BALLONS HL-SHL","JA9",68,null,"/","/","/",3661238495241,2,410,290,180,"C0"]
[100013756,"TERMINAL HORIZONTAL PPS/GALVA Ø 60/100 mm","HR48",183,null,"/","/","/",3661238370883,3.4,1200,200,200,"C0"]
[100002732,"TERMINAL VERTICAL PPS Ø 80/125 MM NOIR","DY843",152,null,"/","/","/",3661238006621,4.2,1210,270,240,"C0"]
[100011365,"KIT VENTOUSE HOR PPS/ALU Ø 80/125mm","DY882",204,null,"/","/","/",3661238374768,4.4000000000000004,1210,265,250,"C0"]
[]
[]
[100018232,"GVCR 15 HOR /220SHL ",null,{"$f":"D2411+D2414+D2415+D2417+D2418","v":5984},null,"A","A","XL ",3661238514034,null,null,null,null,"C0"]
[100018233,"GVCR 15 VER /220SHL ",null,{"$f":"D2411+D2414+D2415+D2417+D2420","v":5953},null,"A","A","XL ",3661238514041,null,null,null,null,"C0"]
[100018234,"GCCR 15 HOR /220SHL ",null,{"$f":"D2411+D2414+D2416+D2417+D2418","v":6254},null,"A","A","XL ",3661238514058,null,null,null,null,"C0"]
[100018235,"GCCR 15 VER /220SHL ",null,{"$f":"D2411+D2414+D2416+D2417+D2420","v":6223},null,"A","A","XL ",3661238514065,null,null,null,null,"C0"]
[100018236,"GVCR 25 HOR /220SHL ",null,{"$f":"D2412+D2414+D2415+D2417+D2418","v":6145},null,"A","A","XL ",3661238514072,null,null,null,null,"C0"]
[100018237,"GVCR 25 VER /220SHL ",null,{"$f":"D2412+D2414+D2415+D2417+D2420","v":6114},null,"A","A","XL ",3661238514089,null,null,null,null,"C0"]
[100018238,"GCCR 25 HOR /220SHL ",null,{"$f":"D2412+D2414+D2416+D2417+D2418","v":6415},null,"A","A","XL ",3661238514096,null,null,null,null,"C0"]
[100018239,"GCCR 25 VER /220SHL ",null,{"$f":"D2412+D2414+D2416+D2417+D2420","v":6384},null,"A","A","XL ",3661238514102,null,null,null,null,"C0"]
[100018240,"GVCR 35 HOR /220SHL ",null,{"$f":"D2413+D2414+D2415+D2417+D2419","v":6476},null,"A","A","XL ",3661238514119,null,null,null,null,"C0"]
[100018241,"GVCR 35 VER /220SHL ",null,{"$f":"D2413+D2414+D2415+D2417+D2420","v":6424},null,"A","A","XL ",3661238514126,null,null,null,null,"C0"]
[100018242,"GCCR 35 HOR /220SHL ",null,{"$f":"D2413+D2414+D2416+D2417+D2419","v":6746},null,"A","A","XL ",3661238514133,null,null,null,null,"C0"]
[100018243,"GCCR 35 VER /220SHL ",null,{"$f":"D2413+D2414+D2416+D2417+D2420","v":6694},null,"A","A","XL ",3661238514140,null,null,null,null,"C0"]
[]
["COMPOSANTS"]
[100017756,"GSCR 15","JA21",3174,null,"A","/","/",3661238505971,68.5,780,680,1060,"C0"]
[100017757,"GSCR 25","JA22",3335,null,"A","/","/",3661238505988,68.5,780,680,1060,"C0"]
[100017758,"GSCR 35","JA23",3645,null,"A","/","/",3661238505995,62,780,680,1060,"C0"]
[100016425,"BALLON 220SHL","ER220",2389,null,"/","/","/",3661238493414,132,790,675,1160,"C0"]
[100017392,"KIT RACC. BALLONS HL-SHL","JA9",68,null,"/","/","/",3661238495241,2,410,290,180,"C0"]
[100017431,"KIT LIAISON BS220SHL/CHAUDIERE GSCR","ER216",338,null,"/","/","/",3661238506619,6,875,685,235,"C0"]
[100016501,"KIT VASE D'EXPANSION 12l/10 bars ","ER229",170,null,"/","/","/",3661238505926,5,325,320,215,"C0"]
[100013756,"TERMINAL HORIZONTAL PPS/GALVA Ø 60/100 mm","HR48",183,null,"/","/","/",3661238370883,3.37,1200,200,200,"C0"]
[100011365,"KIT VENTOUSE HOR PPS/ALU Ø 80/125mm","DY882",204,null,"/","/","/",3661238374768,4.4000000000000004,1210,265,250,"C0"]
[100002732,"TERMINAL VERTICAL PPS Ø 80/125 mm NOIR","DY843",152,null,"/","/","/",3661238006621,4.2,1210,270,240,"C0"]
[]
["OPTIONS CHAUDIERES"]
[100017394,"KIT DE RACCORDEMENT CENTRAL COLONNE ","JA11",283,null,"/","/","/",3661238495265,7,820,430,280,"C0"]
[100017395,"KIT DE RACCORDEMENT GAUCHE ","JA12",283,null,"/","/","/",3661238495272,9.3000000000000007,625,545,295,"C0"]
[100017396,"KIT DE RACCORDEMENT DROITE COLONNE","JA13",271,null,"/","/","/",3661238495289,9,625,545,295,"C0"]
[100017817,"KIT DE RACCORDEMENT CHAUFFAGE SEUL  ","JA34",146,null,"/","/","/",3661238506787,5,625,545,295,"C0"]
[100018164,"KIT DE CONVERSION GPL 15KW ","JA39",11,null,"/","/","/",3661238513624,0.1,220,335,20,"C0"]
[100018165,"KIT DE CONVERSION PROPANE 25kW ","JA40",11,null,"/","/","/",3661238513631,0.1,220,335,20,"C0"]
[100018166,"KIT DE CONVERSION PROPANE 35kW ","JA41",11,null,"/","/","/",3661238513648,0.1,220,335,20,"C0"]
[100017389,"KIT V3V INTERNE","JA6",396,null,"/","/","/",3661238495210,1,410,290,180,"C0"]
[100017827,"KIT DE RACCORDEMENT V3V-PLATINE","JA35",113,null,"/","/","/",3661238506800,9,630,210,230,"C0"]
[100017390,"KIT V3V EXTERNE","JA7",89,null,"/","/","/",3661238495227,1.3,630,210,230,"C0"]
[7613605,"STATION DE NEUTRALISATION DN1","SA1",337,null,"/","/","/",3661238592117,14.5,350,230,350,"C0"]
[7613606,"SUPPORT FIXATION MURAL","SA2",62,null,"/","/","/",3661238592124,2.1,300,240,160,"C0"]
[85317025,"RECHARGE 2 KG POUR NEUTRALISATION","HC35",137,null,"/","/","/",3661238091610,3.65,510,315,190,"C0"]
[83877009,"SYSTEME DE NEUTRALISATION DES CONDENSATS (avec pompe de relevage)","DU13",895,null,"/","/","/",3661238015081,15,350,230,360,"C0"]
[82197762,"SYSTEME DE NEUTRALISATION DES CONDENSATS (JUSQU'À ≈ 19.200 L CONDENSATS)","BP52",559,null,"/","/","/",3661238020696,9.9,760,165,210,"C0"]
[94225601,"RECHARGE DE GRANULATS DE NEUTRALISATION 10 KG**",null,null,null,"/","/","/"]
[100005825,"ADAPTATEUR BI-FLUX   2x80","DY868",63,null,"/","/","/",3661238162204,0.42,310,160,140,"C0"]
["S100465","ADAPTATEUR AIR/FUMEES Ø 80/125","HR38",54,null,"/","/","/",3661238369917,1,190,190,130,"C0"]
[100018253,"COUDE REDUIT  60/100 PPS/ALU ","JA43",78,null,"/","/","/",3661238548411,0.8,290,220,170,"C0"]
["S100310","THERMOSTAT FUMEE","HR43",67,0.01,"/","/","/",3661238369931,0.1,180,130,30,"C0"]
[100018163,"KIT SONDE TEMPERATURE FUMEE","JA38",68,0.01,"/","/","/",3661238513617,1,185,130,105,"C0"]
["S100931","OUTIL DE NETTOYAGE CORPS CHAUDIERE","HR45",85,null,"/","/","/",3661238369948,0.73,310,320,160,"C0"]
[100020164,"COLLECTEUR 2/3 CIRCUITS ","EA140",341,null,"/","/","/",3661238575011,6.6,660,180,200,"C0"]
[100020165,"CONSOLE MUR COLLECTEUR ","EA141",43,null,"/","/","/",3661238575028,1.2,220,125,70,"C0"]
[100020166,"CONSOLE MUR 1 MODULE ","EA142",114,null,"/","/","/",3661238575035,1.6,220,125,70,"C0"]
[100020167,"CIRCUIT DIRECT P.ELEC CLASSE A  ","EA143",631,0.17,"/","/","/",3661238575042,5.0999999999999996,460,270,235,"C0"]
[100020169,"MODULE HYDR COMPACT 2 CIRCUITS HEE","EA145",1122,0.17399999999999999,"/","/","/",3661238575059,9,525,415,210,"C0"]
[89557009,"KIT DE TRANSFORMATION G/R 3/4 '' ET 1 ''","BH84",31,null,"/","/","/",3661238047563,0.32500000000000001,200,140,45,"C0"]
[100018164,"KIT DE CONVERSION GPL 15KW ","JA39",11,null,"/","/","/",3661238513624,0.1,220,335,20,"C0"]
[100018165,"KIT DE CONVERSION PROPANE 25kW ","JA40",11,null,"/","/","/",3661238513631,0.1,220,335,20,"C0"]
[100018166,"KIT DE CONVERSION PROPANE 35kW ","JA41",11,null,"/","/","/",3661238513648,0.1,220,335,20,"C0"]
[]
["OPTIONS REGULATIONS"]
[100013304,"COLIS OPTION V3V OE-TRONIC 4","AD249",155,0.01,"/","/","/",3661238363519,0.42,260,170,130,"C0"]
[100013305,"COLIS SONDE SYSTÈME OE-TRONIC 4","AD250",45,0.01,"/","/","/",3661238363588,0.13400000000000001,150,210,25,"C0"]
[100013306,"SONDE EXTERIEURE RADIO ","AD251",76,0.08,"/","/","/",3661238363595,0.15,150,210,40,"C0"]
[100013307,"MODULE CHAUDIERE RADIO (EMETTEUR)","AD252",121,0.08,"/","/","/",3661238363601,0.32,260,160,130,"C0"]
[100013472,"CDE A DISTANCE RADIO RS 400R     ","AD255",233,0.08,"/","/","/",3661238364233,0.253,175,122,60,"C0"]
[100013477,"CDE A DISTANCE FILAIRE RS 400   ","AD257",174,0.08,"/","/","/",3661238364257,0.253,175,122,60,"C0"]
[88017851,"CABLE DE LIAISON BUS LG 12 M","AD134",108,0.01,"/","/","/",3661238048850,0.37,350,260,30,"C0"]
[88017878,"MODULE DE TELESURVEILLANCE VOCAL TELCOM 2","AD152",690,0.08,"/","/","/",3661238048751,1.05,210,190,105,"C0"]
[88017017,"SONDE DEPART v3v","AD199",79,0.01,"/","/","/",3661238049185,0.21,150,200,40,"C0"]
[100002803,"COMMANDE A DISTANCE SIMPLIFIEE AD208","AD208",102,0.08,"/","/","/",3661238554931,0.2,120,85,40,"C0"]
[]
["OPTIONS ECS ET  PREPARATEURS INDEPENDANTS"]
[100017432,"KIT RECIRCULATION BS100HL","ER218",21,null,"/","/","/",3661238506626,0.5,250,100,100,"C0"]
[100017433,"KIT RECIRCULATION BS160/220","ER219",68,null,"/","/","/",3661238506633,1.5,510,460,175,"C0"]
[100018204,"VASE EXPANSION SANITAIRE 8L","ER233 ",283,null,"/","/","/",3661238514317,5,405,405,175,"C0"]
[100000030,"COLIS OPTION SONDE ECS","AD212",48,0.01,"/","/","/",3661238011168,0.16,200,150,30,"C0"]
[100017393,"KIT RACC. BALLONS AUTRES","JA10",57,null,"/","/","/",3661238495258,1.2,630,210,230,"C0"]
[100000492,"KIT ANODE MAGNESIUM","EA103",65,null,"/","/","/",3661238011069,0.9,560,90,85,"C0"]
[89557009,"KIT DE TRANSFORMATION G/R 3/4 '' ET 1 ''","BH84",31,null,"/","/","/",3661238047563,0.32500000000000001,200,140,45,"C0"]
[]
[]
["CHAUDIERES POUR RACCORDEMENT VENTOUSE"]
[100018244,"GSCX 25 HOR",null,{"$f":"D2482+D2483","v":2737},null,"A","/","/",3661238514157,null,null,null,null,"D3"]
[100018245,"GSCX 25 VER",null,{"$f":"D2482+D2484+D2485","v":2829},null,"A","/","/",3661238514164,null,null,null,null,"D3"]
[]
["COMPOSANTS"]
[100017759,"GSCX 25","JA24",2623,null,"A","/","/",3661238506008,67,780,680,1060,"D3"]
[100008296,"TERMINAL HORIZONTAL PPS Ø 60/100 mm LG=800 mm","DY871",114,null,"/","/","/",3661238168022,2.78,1200,200,200,"C0"]
["S100465","ADAPTATEUR AIR/FUMEES Ø 80/125","HR38",54,null,"/","/","/",3661238369917,1,190,190,130,"C0"]
[100002732,"TERMINAL VERTICAL PPS Ø 80/125 mm NOIR","DY843",152,null,"/","/","/",3661238006621,4.2,1210,270,240,"C0"]
[]
[]
[100018246,"GVCX 25 HOR /100SL ",null,{"$f":"D2492+D2493+D2494+D2495","v":3388},null,"A","A","XL ",3661238514171,null,null,null,null,"D3"]
[100018247,"GVCX 25 VER/100SL ",null,{"$f":"D2492+D2493+D2494+D2496+D2497","v":3480},null,"A","A","XL ",3661238514188,null,null,null,null,"D3"]
[]
["COMPOSANTS"]
[100017759,"GSCX 25","JA24",2623,null,"A","/","/",3661238506008,67,780,680,1060,"D3"]
[100016431,"BALLON 100SL","ER226",583,null,"Pas concerné par l'étiquettage",null,null,3661238493476,72,790,675,800,"D3"]
[100017391,"KIT RACC. BALLONS SL-SSL","JA8",68,null,"/","/","/",3661238495234,1.4,630,210,230,"D3"]
[100008296,"TERMINAL HORIZONTAL PPS Ø 60/100 mm LG=800 mm","DY871",114,null,"/","/","/",3661238168022,2.78,1200,200,200,"C0"]
["S100465","ADAPTATEUR AIR/FUMEES Ø 80/125","HR38",54,null,"/","/","/",3661238369917,1,190,190,130,"C0"]
[100002732,"ADAPTATEUR AIR/FUMEES Ø 80/125","DY843",152,null,"/","/","/",3661238006621,4.2,1210,270,240,"C0"]
[]
[]
[7614662,"GVCX 25 HOR/200SSL ",null,{"$f":"D2506+D2507+D2508+D2510+D2511","v":5142},null,"A","A","XL ",3661238514195,null,null,null,null,"D3"]
[7614663,"GVCX 25 VER/200SSL ",null,{"$f":"D2506+D2507+D2508+D2510+D2512+D2513","v":5234},null,"A","A","XL ",3661238514201,null,null,null,null,"D3"]
[7614664,"GCCX 25 HOR/200SSL ",null,{"$f":"D2506+D2507+D2509+D2510+D2511","v":5357},null,"A","A","XL ",3661238514218,null,null,null,null,"D3"]
[7614665,"GCCX 25 VER/200SSL ",null,{"$f":"D2506+D2507+D2509+D2510+D2512+D2513","v":5449},null,"A","A","XL ",3661238514225,null,null,null,null,"D3"]
[]
["COMPOSANTS"]
[100017759,"GSCX 25","JA24",2623,null,"A","/","/",3661238506008,67,780,680,1060,"D3"]
[100016426,"BALLON 200SSL","ER221",2167,null,"Pas concerné par l'étiquettage",null,null,3661238493421,127,790,675,1350,"D3"]
[100017391,"KIT RACC. BALLONS SL-SSL","JA8",68,null,"/","/","/",3661238495234,1.4,630,210,230,"D3"]
[100016480,"KIT DE LIAISON AGC-EGC /B 160-200","ER228",283,null,"/","/","/",3661238493483,6,875,685,235,"C0"]
[100016501,"KIT VASE D'EXPANSION  12l/10 bars ","ER229",170,null,"/","/","/",3661238505926,5,325,320,215,"C0"]
[100008296,"TERMINAL HORIZONTAL PPS Ø 60/100 mm LG=800 mm","DY871",114,null,"/","/","/",3661238168022,2.78,1200,200,200,"C0"]
["S100465","ADAPTATEUR AIR/FUMEES Ø 80/125","HR38",54,null,"/","/","/",3661238369917,1,190,190,130,"C0"]
[100002732,"TERMINAL VERTICAL PPS Ø 80/125 mm NOIR","DY843",152,null,"/","/","/",3661238006621,4.2,1210,270,240,"C0"]
[]
["OPTIONS CHAUDIERES"]
[100017394,"KIT DE RACCORDEMENT CENTRAL","JA11",283,null,"/","/","/",3661238495265,7,820,430,280,"C0"]
[100017395,"KIT DE RACCORDEMENT GAUCHE","JA12",283,null,"/","/","/",3661238495272,9.3000000000000007,625,545,295,"C0"]
[100017396,"KIT DE RACCORDEMENT DROITE","JA13",271,null,"/","/","/",3661238495289,9,625,545,295,"C0"]
[100017817,"KIT DE RACCORDEMENT CHAUFFAGE SEUL  ","JA34",146,null,"/","/","/",3661238506787,5,625,545,295,"C0"]
[100005825,"ADAPTATEUR BI-FLUX   2x80","DY868",63,null,"/","/","/",3661238162204,0.42,310,160,140,"C0"]
["S100465","ADAPTATEUR AIR/FUMEES Ø 80/125","HR38",54,null,"/","/","/",3661238369917,1,190,190,130,"C0"]
[100018253,"COUDE REDUIT  60/100 PPS/ALU ","JA43",78,null,"/","/","/",3661238548411,0.8,290,220,170,"C0"]
[100018163,"KIT SONDE TEMPERATURE FUMEE","JA38",68,0.01,"/","/","/",3661238513617,1,185,130,105,"C0"]
["S100310","THERMOSTAT FUMEE","HR43",67,0.01,"/","/","/",3661238369931,0.1,180,130,30,"C0"]
[7613605,"STATION DE NEUTRALISATION DN1","SA1",337,null,"/","/","/",3661238592117,14.5,350,230,350,"C0"]
[7613606,"SUPPORT FIXATION MURAL","SA2",62,null,"/","/","/",3661238592124,2.1,300,240,160,"C0"]
[85317025,"RECHARGE 2 KG POUR NEUTRALISATION","HC35",137,null,"/","/","/",3661238091610,3.65,510,315,190,"C0"]
["S100931","OUTIL DE NETTOYAGE CORPS CHAUDIERE","HR45",85,null,"/","/","/",3661238369948,0.73,310,320,160,"C0"]
[100018165,"KIT DE CONVERSION PROPANE 25kW ","JA40",11,null,"/","/","/",3661238513631,0.1,220,335,20,"C0"]
[7607001,"KIT VASE D'EXPANSION","JA74",232,null,"/","/","/",3661238585522,8,565,370,235,"C0"]
[]
["AUTRES OPTIONS"]
[83877009,"SYSTEME DE NEUTRALISATION DES CONDENSATS (avec pompe de relevage)","DU13",895,null,"/","/","/",3661238015081,15,350,230,360,"C0"]
[82197762,"SYSTEME DE NEUTRALISATION DES CONDENSATS (JUSQU'À ≈ 19.200 L CONDENSATS)","BP52",559,null,"/","/","/",3661238020696,9.9,760,165,210,"C0"]
[94225601,"RECHARGE DE GRANULATS DE NEUTRALISATION 10 KG**",null,null,null,"/","/","/"]
[7603547,"KIT DE PREMONTAGE HYDRAULIQUE ","JA68",417,null,"/","/","/",3661238585973,8,815,415,250,"C0"]
[]
["OPTIONS ECS ET  PREPARATEURS INDEPENDANTS"]
[100018204,"VASE EXPANSION SANITAIRE 8L","ER233 ",283,null,"/","/","/",3661238514317,5,405,405,175,"C0"]
[100000030,"COLIS OPTION SONDE ECS","AD212",48,0.01,"/","/","/",3661238011168,0.16,200,150,30,"C0"]
[100017393,"KIT RACC. BALLONS AUTRES","JA10",57,null,"/","/","/",3661238495258,1.2,630,210,230,"C0"]
[100000492,"KIT ANODE MAGNESIUM","EA103",65,null,"/","/","/",3661238011069,0.9,560,90,85,"C0"]
[89557009,"KIT DE TRANSFORMATION G/R 3/4 '' ET 1 ''","BH84",31,null,"/","/","/",3661238047563,0.32500000000000001,200,140,45,"C0"]
[]
["OPTIONS REGULATIONS"]
[88017904,"THERMOSTAT D'AMBIANCE PROGRAMMABLE (FILAIRE)","AD191",158,0.08,"/","/","/",3661238102415,0.25,135,90,55,"C0"]
[88017010,"THERMOSTAT D'AMBIANCE PROGRAMMABLE (SANS FILS)","AD192",280,0.08,"/","/","/",3661238102439,0.42499999999999999,180,150,90,"C0"]
[85757741,"SONDE EXTERIEURE","FM46",40,0.01,"/","/","/",3661238022751,0.12,200,150,40,"C0"]
[7609764,"THERMOSTAT D'AMBIANCE MODULANT RADIO RS200 -3R","AD305",333,0.08,"/","/","/",8713809266455,0.76600000000000001,150,100,110,"C0"]
[7609765,"THERMOSTAT D'AMBIANCE MODULANT FILAIRE RS200 -3","AD306",202,0.08,"/","/","/",8713809266462,0.35099999999999998,150,100,50,"C0"]
[7612346," COMMANDE A DISTANCE SIMPLIFIEE RS20-OT FILAIRE","AD302",104,0.08,"/","/","/",3661238599666,0.151,109,90,48,"C0"]
[]
["OPTIONS GSCX 25"]
[null,"FUMISTERIE"]
[null,"PPS Ø 60 MM"]
[84887585,"TERMINAL AVEC SOLIN DIAMÉTRE 80","DY185",145,null,"/","/","/",3661238013148,1.52,390,380,280,"C0"]
[84887690,"RALLONGE PPS D60 L500 2X ","DY690",39,null,"/","/","/",3661238012196,0.5,505,135,140,"C0"]
[84887691,"RALLONGE PPS D60L1000 2X ","DY691",46,null,"/","/","/",3661238012189,0.96,1025,135,140,"C0"]
[84887692,"RALLONGE PPS D60 L1950 2X","DY692",75,null,"/","/","/",3661238012172,1.9,1960,150,150,"C0"]
[84887693,"COUDE PPS D60 87°  ","DY693",24,null,"/","/","/",3661238012165,0.16,155,160,160,"C0"]
[84887694,"COUDE PPS Ø 60 45° (2X)","DY694",48,null,"/","/","/",3661238012158,0.19,155,155,160,"C0"]
[84887673,"ETOILE DE CENTRAGE PPS Ø 60 ","DY673",13,null,"/","/","/",3661238012363,0.1,400,400,400,"C0"]
[84887698,"PIECE DE VISITE PPS Ø 60 DROITE","DY698",63,null,"/","/","/",3661238012110,0.24,295,145,150,"C0"]
[84887741,"TE DE VISITE PPS Ø 60","DY741",70,null,"/","/","/",3661238011724,0.24,250,145,145,"C0"]
[84887700,"KIT DE RACCORDEMENT CHEMINEE PPS 60 MM","DY700",220,null,"/","/","/",3661238012103,2.71,395,400,385,"C0"]
[84887701,"KIT DE RACCORDEMENT CHEMINÉE PPS 60/80 MM","DY701",264,null,"/","/","/",3661238012097,2.83,395,400,385,"C0"]
[84887702,"KIT DE RACCORDEMENT CHAUDIERE ALU/PPS Ø 60/100 mm","DY702",177,null,"/","/","/",3661238012080,1.94,500,290,260,"C0"]
[null,"ALU Ø 80 MM"]
[84887585,"TERMINAL AVEC SOLIN DIAMÉTRE 80","DY185",145,null,"/","/","/",3661238013148,1.52,390,380,280,"C0"]
[84887600,"TUBE D'INSPECTION Ø 80 mm ","DY600",47,null,"/","/","/",3661238013094,0.49,300,145,150,"C0"]
[84887738,"TE DE VISITE Ø 80 mm ","DY738",70,null,"/","/","/",3661238011755,0.66,285,215,165,"C0"]
[84887604,"RALLONGE Ø 80 mm    L= 250 mm  (2 PIECES)","DY604",36,null,"/","/","/",3661238013056,0.65,255,170,175,"C0"]
[84887605,"RALLONGE Ø 80 mm    L=  500 mm  (2 PIECES)","DY605",44,null,"/","/","/",3661238013049,1.26,520,175,170,"C0"]
[84887606,"RALLONGE 1000 mm (2 PIECES)","DY606",71,null,"/","/","/",3661238013032,2.52,1020,175,175,"C0"]
[84887607,"RALLONGE Ø 80 mm    L=  1950 mm   (2 PIECES)","DY607",118,null,"/","/","/",3661238013025,5,1985,170,175,"C0"]
[84887551,"COLLIER DE CENTRAGE Ø 80mm (2 PIECES)","DY151",13,null,"/","/","/",3661238013452,0.1,300,300,40,"C0"]
[84887608,"COUDE A 90°","DY608",23,null,"/","/","/",3661238013018,0.34,155,160,160,"C0"]
[84887609,"COUDE A 45°  (2 PIECES)","DY609",39,null,"/","/","/",3661238013001,0.48,200,200,150,"C0"]
[84887711,"KIT N°1 RACCORDEMENT CHEMINEE Ø 80 mm","DY711",181,null,"/","/","/",3661238011991,3.66,595,400,410,"C0"]
[100002361,"PIÈCE D'ADAPTATION BIFLUX 2X80","DY819",43,null,"/","/","/",3661238007338,0.1,340,240,30,"C0"]
[84887438,"PRISE D'AIR EXTERIEURE LG=500 mm","DY38",97,null,"/","/","/",3661238013858,1.23,690,245,145,"C0"]
[84887723,"ADAPTATEUR BI-FLUX Ø60/100 SUR 2x80","DY723",81,null,"/","/","/",3661238011892,0.94,285,210,165,"C0"]
[]
["OPTIONS GSCX 25"]
[null,"PPS/ALU 60/100 MM"]
[100013756,"TERMINAL HORIZONTAL PPS/GALVA Ø 60/100 mm","HR48",183,null,"/","/","/",3661238370883,3.37,1200,200,200,"C0"]
[84887681,"PPS-ALU RALLONGE CONCENTRIQUE  ø 60/100 mm L=  500 mm","DY681",40,null,"/","/","/",3661238012288,0.72,510,135,140,"C0"]
[84887682,"PPS-ALU RALLONGE CONCENTRIQUE ø 60/100 mm L=1000 mm","DY682",50,null,"/","/","/",3661238012271,1.38,1010,130,135,"C0"]
[84887683,"PPS-ALU RALLONGE CONCENTRIQUE ø 60/100mm L=1950mm","DY683",102,null,"/","/","/",3661238012264,2.81,1960,150,150,"C0"]
[84887684,"PPS-ALU COUDE CONCENTRIQUE MOULE à 87° ø 60/100 mm","DY684",42,null,"/","/","/",3661238012257,0.53,200,200,150,"C0"]
[84887685,"PPS-ALU COUDE CONCENTRIQUE MOULE à 45° ø 60/100 mm (2 PIECES)","DY685",79,null,"/","/","/",3661238012240,0.65,250,185,150,"C0"]
[84887686,"PPS-ALU COUDE CONCENTRIQUE MOULE à 30° ø 60/100 mm (2 PIECES)","DY686",156,null,"/","/","/",3661238012233,0.63,250,190,155,"C0"]
[84887687,"PPS-ALU COUDE CONCENTRIQUE MOULE à 15° ø 60/100 mm (2 PIECES)","DY687",156,null,"/","/","/",3661238012226,0.64,255,195,150,"C0"]
[84887688,"PPS-ALU MANCHON DE COMPENSATION DE 50 à 250 mm","DY688",70,null,"/","/","/",3661238012219,0.51,515,135,140,"C0"]
[84887689,"PPS-ALU  PIECE DE REVISIONDROITE  Ø 60/100 mm","DY689",129,null,"/","/","/",3661238012202,0.56999999999999995,255,185,150,"C0"]
[84887737,"PPS-ALU  Té DE REVISION  Ø 60/100 mm","DY737",129,null,"/","/","/",3661238011762,0.6,255,185,145,"C0"]
[84887702,"KIT DE RACCORDEMENT CHAUDIERE ALU/PPS Ø 60/100 mm","DY702",177,null,"/","/","/",3661238012080,1.94,500,290,260,"C0"]
[100017526,"TERMINAL REFTROFIT Ø 60/100","DY912",113,null,"/","/","/",3661238496323,0.9,1200,180,110,"C0"]
[null,"FLEXIBLE PPS Ø 80 MM"]
[100015325,"KIT N° 1 RACCORDEMENT CHEMINÉE FLEXIBLE PPS Ø 80 mm","DY895",231,null,"/","/","/",3661238380110,2.87,395,395,380,"C0"]
[100015327,"TUBE FLEXIBLE LG=12,5M","DY897",347,null,"/","/","/",3661238380134,8.6999999999999993,1200,1220,250,"C0"]
[100015326,"TUBE FLEXIBLE LG=50M","DY896",1216,null,"/","/","/",3661238380127,35,1600,1660,410,"C0"]
[84887618,"ETOILE DE CENTRAGE POUR FLEXIBLE Ø 80  mm (2 PIÈCES)","DY618",36,null,"/","/","/",3661238012912,0.2,300,300,70,"C0"]
[100015328,"PIÈCE DE COUPLAGE FLEXIBLE Ø 80 mm","DY898",70,null,"/","/","/",3661238380141,0.25,150,150,150,"C0"]
[100015331,"OUTIL D'AIDE À L'INSERTION Ø 80 mm","DY901",174,null,"/","/","/",3661238380172,1.4,300,210,185,"C0"]
[100015330,"PIÈCE D'INSPECTION POUR TUBE FLEXIBLE","DY900",125,null,"/","/","/",3661238380165,0.5,295,140,140,"C0"]
[100015329,"TERMINAL AVEC SOLIN FLEX. Ø 80 mm","DY899",174,null,"/","/","/",3661238380158,1.74,385,385,250,"C0"]
[100015880,"ADAPTATEUR PPS FLEX Ø 80 mm","DY904",41,null,"/","/","/",3661238417632,0.125,316,236,152,"C0"]
[null,"PPS Ø 80 MM"]
[100015325,"KIT N° 1 RACCORDEMENT CHEMINÉE FLEXIBLE PPS Ø 80 mm","DY895",231,null,"/","/","/",3661238380110,2.87,395,395,380,"C0"]
[100017527,"KIT DE BASE PPS/ALU Ø 80/125 ","DY913",163,null,"/","/","/",3661238496330,3.7,600,400,275,"C0"]
[84887708,"ADAPTATEUR ALU Ø 60/100 MM SUR 80/125 MM","DY708",57,null,"/","/","/",3661238012028,0.33,255,145,150,"C0"]
[84887717,"KIT N° 1 KIT DE RACCORDEMENT CHEMINÉE PPS Ø 80 mm","DY717",154,null,"/","/","/",3661238011946,2.89,395,405,390,"C0"]
[84887546,"PIÈCE DE VISITE Ø 80 mm droite","DY146",57,null,"/","/","/",3661238013506,0.28999999999999998,300,145,150,"C0"]
[84887613,"RALLONGE PPS Ø 80 mm   L= 250 mm (2 PCS)","DY613",39,null,"/","/","/",3661238012967,0.37,250,170,175,"C0"]
[84887614,"RALLONGE PPS  Ø 80 mm   L=  500 mm (2 PCS)","DY614",37,null,"/","/","/",3661238012950,0.68,500,160,150,"C0"]
[84887615,"RALLONGE PPS  Ø 80 mm   L=  1000 mm (2 PCS)","DY615",50,null,"/","/","/",3661238012943,1.25,1000,160,145,"C0"]
[84887550,"RALLONGE PPS Ø 80 mm   L=  2000 mm  (2 PIECES)","DY150",76,null,"/","/","/",3661238013469,2.4900000000000002,1960,150,150,"C0"]
[84887552,"COUDE PPS À 90°","DY152",15,null,"/","/","/",3661238013445,0.2,255,145,150,"C0"]
[84887554,"COUDE PPS a 45°  (2 PCS)","DY154",34,null,"/","/","/",3661238013421,0.32,200,200,150,"C0"]
[84887563,"T PPS  AVEC COUVERCLE  D'INSPECTION","DY163",57,null,"/","/","/",3661238013353,0.39,290,220,170,"C0"]
[84887551,"COLLIER DE CENTRAGE Ø 80mm (2 PIECES)","DY151",13,null,"/","/","/",3661238013452,0.1,300,300,40,"C0"]
[84887585,"TERMINAL AVEC SOLIN DIAMÉTRE 80","DY185",145,null,"/","/","/",3661238013148,1.52,390,380,280,"C0"]
[100008301,"COUDE DE REVISION PPS 87° Ø 80 mm (GRIS)","DY877",40,null,"/","/","/",3661238102026,0.24,190,195,145,"C0"]
[null,"PPS 80/125 MM"]
[100002732,"TERMINAL VERTICAL PPS Ø 80/125 mm NOIR","DY843",152,null,"/","/","/",3661238006621,4.2,1210,270,240,"C0"]
[100002733,"TERMINAL VERTICAL PPS Ø 80/125 mm ROUGE","DY844",151,null,"/","/","/",3661238006614,4.2,1210,265,240,"C0"]
[84887716,"KIT N° 3 RACCORDEMENT CHAUDIÈRE  PPS Ø 80/125 mm","DY716",141,null,"/","/","/",3661238011953,2.36,500,290,260,"C0"]
[84887524,"PIECE D'INSPECTION DROITE ALU/PPS Ø 80/125 mm","DY124",108,null,"/","/","/",3661238013704,0.55000000000000004,300,145,150,"C0"]
[100008311,"COUDE DE REVISION ALU/PPS Ø 80/125 mm","DY875",113,null,"/","/","/",3661238101920,0.68,195,195,145,"C0"]
[100003271,"KIT DE RACCORDEMENT CHAUDIÈRE PERPENDICULAIRE","DY849",220,null,"/","/","/",3661238005600,3.5,595,395,410,"C0"]
[100003272,"KIT DE RACCORDEMENT CHAUDIÈRE SOUS CONDUIT","DY850",165,null,"/","/","/",3661238005594,1.44,500,290,260,"C0"]
[84887525,"T D'INSPECTION ALU/PPS Ø 80/125 mm","DY125",124,null,"/","/","/",3661238013698,0.82,315,235,150,"C0"]
[84887526,"RALLONGE CONCENTRIQUE ALU/PPS 80/125 LG= 250 mm","DY126",40,null,"/","/","/",3661238013681,0.47,255,145,150,"C0"]
[84887527,"RALLONGE CONCENTRIQUE ALU/PPS 80/125 L= 500 mm","DY127",46,null,"/","/","/",3661238013674,0.9,520,140,140,"C0"]
[84887528,"RALLONGE CONCENTRIQUE ALU/PPS 80/125 L=1000 mm","DY128",68,null,"/","/","/",3661238013667,1.7,1010,135,140,"C0"]
[84887529,"RALLONGE CONCENTRIQUE ALU/PPS 80/125 L=1950 mm","DY129",118,null,"/","/","/",3661238013650,3.5,1960,150,150,"C0"]
[84887530,"MANCHON DE COMPENS PPS D80/125 ","DY130",70,null,"/","/","/",3661238013643,0.6,300,140,145,"C0"]
[84887531,"COUDE A 87° ALU/PPS  Ø 80/125 mm","DY131",50,null,"/","/","/",3661238013636,0.66,200,200,150,"C0"]
[84887532,"COUDE CONCENTRIQUE 45° ALU/PPS Ø 80/125 MM (2 PCES)","DY132",76,null,"/","/","/",3661238013629,1,315,235,150,"C0"]
[null,"DIVERS FUMISTERIE"]
[84887411,"SORTIE HORIZONTALE TOIT PENTE DE 30° A 45° ( uniquement pour tuiles mécaniques)","DY11",175,null,"/","/","/",3661238013940,3.57,1020,700,370,"C0"]
[84837729,"SORTIE DE TOIT EN PENTE DE 40° A 60° ( uniquement pour tuiles mécaniques)","CX49",175,null,"/","/","/",3661238014367,3.5,920,700,320,"C0"]
[84837731,"EMBASE D'ETANCHE TOIT PLAT","CX51",42,null,"/","/","/",3661238014343,0.5,400,400,155,"C0"]
[84837121,"TUILE A DOUILLE 5 A 25° NOIRE","CX121",110,null,"/","/","/",3661238014428,2.96,510,250,145,"C0"]
[84837732,"TUILE A DOUILLE 25 A 45° NOIRE","CX52",76,null,"/","/","/",3661238014336,3,520,250,145,"C0"]
[84837734,"TUILE A DOUILLE 35 A 55° NOIRE","CX63",95,null,"/","/","/",3661238014312,3.17,510,265,180,"C0"]
[84837120,"TUILE A DOUILLE 5 A 25° ROUGE","CX120",110,null,"/","/","/",3661238014435,3.02,515,245,145,"C0"]
[84837783,"TUILE A DOUILLE 25 A 45° ROUGE","CX83",76,null,"/","/","/",3661238014213,3,515,250,150,"C0"]
[84837784,"TUILE A DOUILLE 35 A 55° ROUGE","CX84",95,null,"/","/","/",3661238014206,2.95,520,265,180,"C0"]
[84837741,"PLATINE DE FINITION INTER","CX72",16,null,"/","/","/",3661238014251,0.54,245,210,3,"C0"]
[100005002,"PANIER DE PROTECTION INOX  Ø 80/125","DY865",172,null,"/","/","/",3661238001886,2.59,275,270,270,"C0"]
[84887435,"GRILLE D'AERATION EXTERIEURE 250 X 300 mm","DY35",23,null,"/","/","/",3661238013889,0.35,300,250,30,"C0"]
[84887436,"GRILLE D'AERATION  INTERIEUR 250X300 mm","DY36",24,null,"/","/","/",3661238013889,0.35,300,250,30,"C0"]
[84837779,"COLLIER DE FIXATION Ø 125 mm PATTE LONGUE","CX79",14,null,"/","/","/",3661238014237,0.24,230,160,200,"C0"]
[84837118,"COLLIER DE FIXATION Ø 125 MM PATTE COURTE","CX118",11,null,"/","/","/",3661238014459,0.19,225,185,20,"C0"]
[]
[]
[100009941,"GSR 140-45 CONDENS","HF5",6090,null,"A","/","/",3661238169326,110,700,900,1290,"C0"]
[100009942,"GSR 140-65 CONDENS","HF6",7028,null,"A","/","/",3661238169333,118,700,900,1290,"C0"]
[100009943,"GSR 140-90 CONDENS","HF7",9617,null,"pas concerné par l'étiquettage",null,null,3661238169340,137.5,700,900,1500,"C0"]
[100009944,"GSR 140-115 CONDENS","HF8",10818,null,"pas concerné par l'étiquettage",null,null,3661238169357,138,700,900,1500,"C0"]
[]
["ACCESSOIRES CHAUDIERE"]
[100013072,"KIT DE TRANSFORMATION AU PROPANE","HE38",197,null,"/","/","/",3661238361829,1.3,210,200,85,"C0"]
[100004641,"ROBINET GAZ 3/4\" DROIT","HC158",43,null,"/","/","/",3661238002432,0.82,200,150,125,"C0"]
[100002312,"POMPE GMR 5045 3 VITESSES","HC141",216,null,"/","/","/",3661238007581,3.1,310,210,130,"C0"]
[100002313,"POMPE GMR 5045 ELECTRONIQUE","HC142",317,null,"/","/","/",3661238007574,3.1,310,210,130,"C0"]
[100002314,"CIRCULATEUR 3 VITESSES GMR 5065 ","HC143",246,null,"/","/","/",3661238007567,3.2,305,210,130,"C0"]
[100002316,"POMPE GMR 5090 3 VITESSES","HC145",380,null,"/","/","/",3661238007550,4.5,310,210,130,"C0"]
[100002323,"POMPE PRIMAIRE POUR GMR 5045-5065-5090","HC147",347,null,"/","/","/",3661238007499,4.5999999999999996,310,210,130,"C0"]
[82197762,"SYSTEME DE NEUTRALISATION DES CONDENSATS (JUSQU'À ≈ 19.200 L CONDENSATS)","BP52",559,null,"/","/","/",3661238020696,9.9,760,165,210,"C0"]
[83877009,"SYSTEME DE NEUTRALISATION DES CONDENSATS (avec pompe de relevage)","DU13",895,null,"/","/","/",3661238015081,15,350,230,360,"C0"]
[83877010,"STATION NEUTRALISATION","DU14",1246,null,"/","/","/",3661238015074,26,450,330,350,"C0"]
[83877011,"STATION NEUTRALISATION","DU15",1326,null,"/","/","/",3661238015067,20,660,455,270,"C0"]
[100002685,"CLAPET OBTURATEUR FUMEES  Ø 100 mm","HC154",460,null,"/","/","/",3661238006683,1.84,350,235,150,"C0"]
[100003347,"COMMANDE EXTERNE ALARME VANNE","GR12",87,0.01,"/","/","/",3661238005358,0.36,195,150,125,"C0"]
[]
["OPTIONS REGULATION "]
[88017878,"MODULE DE TELESURVEILLANCE VOCAL TELCOM 2","AD152",690,0.08,"/","/","/",3661238048751,1.1000000000000001,210,190,105,"C0"]
[161118,"COMMANDE A DISTANCE INTERACTIVE  AD194","AD194",193,null,"/","/","/",3661238106505,0.15,0,0,0,"C0"]
[88017017,"SONDE DEPART v3v","AD199",79,0.01,"/","/","/",3661238049185,0.21,150,200,40,"C0"]
[88017014," PLATINE + SONDE V3V","AD196",176,0.01,"/","/","/",3661238102422,0.52,260,170,120,"C0"]
[88017851,"CABLE DE LIAISON BUS LG 12 M","AD134",108,0.01,"/","/","/",3661238048850,0.37,350,260,30,"C0"]
[]
["OPTIONS MODULES HYDRAULIQUES GSR 140-35P CONDENS"]
[100009840,"KIT VANNE MELANGEUSE 3 VOIES INT","HE24",409,null,"/","/","/",3661238338487,5.5,410,190,195,"C0"]
[100009842,"KIT VANNE MELANGEUSE 3 VOIES EXT. ","HE 26",124,null,"/","/","/",3661238338494,1.4,260,165,115,"C0"]
[100020164,"COLLECTEUR 2/3 CIRCUITS","EA140",341,null,"/","/","/",3661238575011,6.6,660,180,200,"C0"]
[100020165,"CONSOLE MUR COLLECTEUR ","EA141",43,null,"/","/","/",3661238575028,1.2,220,125,70,"C0"]
[100020166,"CONSOLE MUR 1 MODULE ","EA142",114,null,"/","/","/",3661238575035,1.6,220,125,70,"C0"]
[100020167,"CIRCUIT DIRECT P.ELEC CLASSE A  ","EA143",631,0.17,"/","/","/",3661238575042,5.0999999999999996,460,270,235,"C0"]
[100020168,"CIRCUIT V3V P.ELEC","EA144",897,0.17,"/","/","/",3661238575059,6,460,270,235,"C0"]
[100020169,"MODULE HYDR COMPACT 2 CIRCUITS HEE","EA145",1122,0.17399999999999999,"/","/","/",3661238575059,9,525,415,210,"C0"]
[100019346,"BOUTEILLE DE DECOUPLAGE  60/60-1''  ","GV45",358,null,"/","/","/",3661238555013,3.83,690,375,205,"C0"]
[100019347,"BOUTEILLE DE DECOUPLAGE  80/60-1'' 1/4 ","GV46",429,null,"/","/","/",3661238555020,5.42,690,375,205,"C0"]
[100019348,"BOUTEILLE DE DECOUPLAGE  120/80-2''   ","GV47",577,null,"/","/","/",3661238555037,11.96,970,375,205,"C0"]
[]
[null,"OPTIONS ECS"]
[100009972,"BALLON OBA 150","EA84",1477,null,"/","/","/",3661238375239,106.5,700,900,1290,"C0"]
[100000030,"COLIS OPTION SONDE ECS","AD212",48,0.01,"/","/","/",3661238011168,0.16,200,150,30,"C0"]
[100007827,"KIT LIAISON CHAUDIERE / BALLON","EA121",590,null,"/","/","/",3661238116528,6.5,600,500,135,"C0"]
[100009192,"KIT LIAISON CHAUDIERE / BALLON OBA 150","EA122",441,null,"/","/","/",3661238338463,5.5,575,505,150,"C0"]
[]
[]
["ACCESSOIRES CASCADES "]
[100011703,"COLLECTEUR DN65","HE35",487,null,"/","/","/",3661238366015,30,700,210,480,"C0"]
[100011492,"COLLECTEUR DN100","HE34",532,null,"/","/","/",3661238366008,35,1200,800,700,"C0"]
[100011490,"KIT DE LIAISON HYDRAULIQUE 45 ET 65 KW","HE32",580,null,"/","/","/",3661238365988,5,360,300,170,"C0"]
[100011491,"KIT DE LIAISON HYDRAULIQUE 90 ET 115 KW","HE33",587,null,"/","/","/",3661238365988,5,360,330,170,"C0"]
[114311,"BOUTEILLE DE DÉCOUPLAGE DN65 < 350 kW","HC222",604,null,"/","/","/",3661238362215,26.6,650,310,170,"C0"]
[111712,"BOUTEILLE DE DÉCOUPLAGE DN65 > 350 et < 460 kW","HC200",1003,null,"/","/","/",3661238338920,47,740,1060,370,"C0"]
[111714,"BOUTEILLE DE DÉCOUPLAGE DN100 > 460 kW","HC201",1214,null,"/","/","/",3661238338913,68,940,260,630,"C0"]
[111708,"JEU DE BOUCHONS","HC195",40,null,"/","/","/",3661238338937,0.7,200,130,30,"C0"]
[111701,"BRIDES PLEINES EAU DN65","HC198",145,null,"/","/","/",3661238338951,5.3,370,170,50,"C0"]
[111703,"BRIDES PLEINES EAU DN100","HC199",184,null,"/","/","/",3661238338944,10.3,450,230,70,"C0"]
[100002312,"POMPE CHAUFFAGE 3 VITESSES POUR MCA 45/DTG 45","HC141",216,null,"/","/","/",3661238007581,3.1,310,210,130,"C0"]
[100002314,"POMPE CHAUFFAGE 3 VITESSES POUR MCA 65/DTG 65","HC143",246,null,"/","/","/",3661238007567,3.2,310,210,130,"C0"]
[100002316,"POMPE CHAUFFAGE 3 VITESSES POUR MCA 90-115/DTG 90-115","HC145",380,null,"/","/","/",3661238007550,4.5,310,210,130,"C0"]
[100013027,"SONDE DE DÉPART + DOIGT DE GANT-BOUTEILLE < 350 kW","HC223",129,0.01,"/","/","/",3661238362239,0.2,220,165,25,"C0"]
[100008701,"SONDE DE DÉPART + DOIGT DE GANT-BOUTEILLE > 350 kW","HC206",152,0.01,"/","/","/",3661238338883,0.2,210,160,25,"C0"]
[88017836,"CABLE BUS RX11  LG 1,5 M","AD124",83,0.01,"/","/","/",3661238338876,0.1,210,160,5,"C0"]
[]
["OPTIONS HYDRAULIQUES"]
[111788,"COUDES DN65","HC209",650,null,"/","/","/",3661238338883,13,700,300,170,"C0"]
[111790,"COUDES DN100","HC210",874,null,"/","/","/",3661238338876,21,440,440,420,"C0"]
[111167,"ISOLATION COUDES 90°C","HC216",101,null,"/","/","/",3661238339019,1,610,300,500,"C0"]
[112632,"JEU DE CONTRE-BRIDES À SOUDER DN65","HC217",150,null,"/","/","/",3661238338821,1.9,160,160,120,"C0"]
[112633,"JEU DE CONTRE-BRIDES À SOUDER DN100","HC218",167,null,"/","/","/",3661238338814,10.3,200,200,120,"C0"]
[115269,"ISOLATION BOUTEILLE DE DÉCOUPLAGE < 350 kW","HC224",37,null,"/","/","/",3661238362222,0.6,660,280,220,"C0"]
[111067,"ISOLATION BOUTEILLE DE DÉCOUPLAGE DN65 > 350 et < 460 kW","HC215",237,null,"/","/","/",3661238339033,4,300,620,960,"C0"]
[111807,"PIED RÉGLABLE","HC219",4,null,"/","/","/",3661238338845,0.8,230,115,5,"C0"]
[]
["AUTRES OPTIONS"]
["S101655","FILTRE GAZ DN50","HC255",507,null,"/","/","/",8713809234331,4.9000000000000004,465,280,230,"C0"]
["S101656","FILTRE GAZ DN65","HC256",700,null,"/","/","/",8713809243586,7,310,230,220,"C0"]
["S103345","JEUX DE BRIDES À SOUDER DN50 POUR FILTRE A GAZ","HC261",83,null,"/","/","/",null,6,31,16,15,"C0"]
[84887768,"ADAPTATEUR  80 X 100MM ","DY768",54,null,"/","/","/",3661238011489,0.24,150,145,155,"C0"]
[]
[]
[115768,"GSR 233 CONDENS","GW1",9212,null,"Pas concerné par l'étiquettage",null,null,8713809213671,170,1250,700,1470,"C3"]
[115769,"GSR 234 CONDENS","GW2",10439,null,"Pas concerné par l'étiquettage",null,null,8713809213688,190,1250,700,1470,"C3"]
[115770,"GSR 235 CONDENS","GW3",12048,null,"Pas concerné par l'étiquettage",null,null,8713809213695,210,189.5,700,1470,"C3"]
[115771,"GSR 236 CONDENS","GW4",13402,null,"Pas concerné par l'étiquettage",null,null,8713809213701,230,1250,700,1470,"C3"]
[]
["OPTIONS"]
[100002442,"COLIS 2 ème RETOUR C 210 Eco ","GR5",133,null,"/","/","/",3661238007000,1.55,650,75,75,"C0"]
[100002443,"DOIGT DE GANT POUR SONDE DEPART","GR6",47,null,"/","/","/",3661238006997,0.09,215,140,30,"C0"]
[100002445,"FILTRE A L'ASPIRATION D'AIR","GR8",426,null,"/","/","/",3661238006973,3.7,620,270,370,"C0"]
[100011030,"THERMOSTAT DE FUMEES","GV21",58,0.01,"/","/","/",3661238338678,0.17,190,150,125,"C3"]
[100011031,"PRESSOSTAT MINI GAZ POUR GSR 233 & GSR 234 ","GV22(*)",63,0.01,"/","/","/",3661238338685,0.5,195,140,115,"C3"]
[100011032,"KIT DE CONVERSION AU GPL POUR GSR 233 & GSR 234","GV23",502,null,"/","/","/",3661238338692,0.2,0,0,0,"C3"]
[100011034,"PRESSOSTAT MINI GAZ GSR 235 & GSR 236","GV25(*)",65,0.01,"/","/","/",3661238338715,0.23,340,230,50,"C3"]
[100011033,"CLAPET DE FUMEE","GV24(*)",766,null,"/","/","/",3661238338708,2.5099999999999998,370,265,185,"C3"]
[100011035,"KIT CCE (Uniquement GSR 235 & GSR 236)","GV26(*)",59,0.01,"/","/","/",3661238338722,0.23,340,230,50,"C3"]
[100011036,"KIT DE CONVERSION AU GPL POUR GSR 235 & GSR 236","GV27",39,null,"/","/","/",3661238338739,0.2,220,320,20,"C3"]
[100011037,"PLATINE DE RACCORDEMENT SCU-01","GW5",105,null,"/","/","/",3661238369283,0.2,195,140,115,"C3"]
[100011223,"REGULATEUR PRESSION 300 mbar GDJ25 RACCORDT. Ø 1''","AD245 ",180,null,"/","/","/",3661238338746,1.2,180,150,150,"C3"]
[88027177,"REGULATEUR DE PRESSION 300 Mbar RACORDT. Ø 2'","GDJ50",423,null,"/","/","/",3661238048287,3.1,255,220,205,"B2"]
[83877009,"SYSTEME DE NEUTRALISATION DES CONDENSATS (avec pompe DE relevage)","DU13",895,null,"/","/","/",3661238015081,15,350,230,360,"C0"]
[83877010,"STATION NEUTRALISATION","DU14",1246,null,"/","/","/",3661238015074,26,450,330,350,"C0"]
[83877011,"STATION NEUTRALISATION","DU15",1326,null,"/","/","/",3661238015067,20,660,455,270,"C0"]
[7622188,"STATION DE NEUTRALISATION DN3 ","SA9",693,null,"/","/","/",3661238613454,6.5,660,460,270,"C3"]
[7613613,"RECHARGE GIALIT 25KG","SA7",82,null,"/","/","/",3661238592179,25.2,550,350,120,"C3"]
[7613610,"STATION DE NEUTRALISATION AVEC POMPE","SA4",1197,null,"/","/","/",3661238592148,36.5,640,420,370,"C3"]
[100013072,"KIT DE TRANSFORMATION AU PROPANE","HE38",197,null,"/","/","/",3661238361829,1.3,210,200,85,"C0"]
[100002685,"CLAPET OBTURATEUR FUMEES  Ø 100 mm","HC154",460,null,"/","/","/",3661238006683,1.84,350,235,150,"C0"]
[180566,"RECHARGE DE GRANULATS DE NEUTRALISATION 10 KG",null,null,null,"/","/","/",3661238075597,10,25,22,22]
[100019347,"BOUTEILLE DE DECOUPLAGE  80/60-1'' 1/4 ","GV46",429,null,"/","/","/",3661238555020,5.42,690,375,205,"C0"]
[100019348,"BOUTEILLE DE DECOUPLAGE  120/80-2''   ","GV47",577,null,"/","/","/",3661238555037,11.96,970,375,205,"C0"]
[7628752,"REGULATEUR PRESSION GDJ 15 ","SA11",141,null,"/","/","/",3661238624917,0.59,130,110,110,"C0"]
[7628753,"REGULATEUR PRESSION GDJ 20 ","SA12",173,null,"/","/","/",3661238624924,1.2,160,140,140,"C0"]
[null,"(*) Nécessite une platine SCU-01 (GW5)"]
[]
["OPTIONS POUR OETRONIC  3"]
[100000030,"COLIS OPTION SONDE ECS","AD212",48,0.01,"/","/","/",3661238011168,0.16,200,150,30,"C0"]
[161118,"COMMANDE A DISTANCE INTERACTIVE  AD194","AD194",193,null,"/","/","/",3661238106505,0.15,0,0,0,"C0"]
[88017017,"SONDE DEPART v3v","AD199",79,0.01,"/","/","/",3661238049185,0.21,150,200,40,"C0"]
[88017014," PLATINE + SONDE V3V","AD196",176,0.01,"/","/","/",3661238102422,0.52,260,170,120,"C0"]
[88017851,"CABLE DE LIAISON BUS LG 12 M","AD134",108,0.01,"/","/","/",3661238048850,0.37,350,260,30,"C0"]
[]
["FUMISTERIE"]
[null,"CONFIGURATION VENTOUSE VERTICALE EN ALU Ø 150 mm"]
[100002473,"VENTOUSE VERTICALE ALU / GALVA Ø 150/220 mm","DY835",821,null,"/","/","/",3661238006805,16,1900,340,520,"C3"]
[100002404,"PIECE DE RACCORDEMENT AIR POUR VENTOUSE Ø 150 mm","DY830",103,null,"/","/","/",3661238007154,0.46,250,165,170,"C3"]
[100002470,"TÉ D'INSPECTION Ø 150 mm ALU","DY832",220,null,"/","/","/",3661238006836,1.4,350,285,190,"C3"]
[84887645,"RALLONGE  Ø 150 mm   LG = 500 mm","DY645",44,null,"/","/","/",3661238012646,1.1599999999999999,525,170,175,"C3"]
[84887646,"RALLONGE  Ø 150 mm   LG = 1000 mm ","DY646",77,null,"/","/","/",3661238012639,2.34,1020,170,175,"C3"]
[84887647,"RALLONGE  Ø 150 mm   LG = 1950 mm","DY647",136,null,"/","/","/",3661238012622,4.4800000000000004,1985,175,175,"C3"]
[84887648,"ETOILE DE CENTRAGE Ø 150 mm (2 PIECES)","DY648",50,null,"/","/","/",3661238012615,0.12,300,300,45,"C3"]
[84887649,"COUDE A 87° Ø 150 mm","DY649",84,null,"/","/","/",3661238012608,0.81,345,265,185,"C3"]
[84887650,"COUDE A 45° Ø 150 mm  (2 PIECES)","DY650",156,null,"/","/","/",3661238012592,1.07,340,265,185,"C3"]
[100002402,"SOLIN POUR TOIT PLAT Ø 160/220 mm","DY828",73,null,"/","/","/",3661238007178,0.65,490,490,150,"C3"]
[100002403,"SOLIN POUR TOIT INCLINÉ Ø 160/220 mm","DY829",156,null,"/","/","/",3661238007161,9.4,795,355,360,"C3"]
[100002692,"COLLIER DE FIXATION Ø 150 mm","DY841",11,null,"/","/","/",3661238006669,0.11,150,150,20,"C3"]
[100002700,"PLATINES DE FINITION INTERIEURES Ø 220 mm","DY840",37,null,"/","/","/",3661238006638,0.7,250,320,4,"C3"]
[100004243,"RALLONGE GALVA/ALU VENTOUSE HORIZONTALE F 150/220 LONG. 1M","DY864",292,null,"/","/","/",3661238004498,6,1205,235,235,"C3"]
[84887435,"GRILLE D'AERATION EXTERIEURE 250 X 300 mm","DY35",23,null,"/","/","/",3661238013889,0.35,300,250,30,"C0"]
[84887436,"GRILLE D'AERATION  INTERIEUR 250X300 mm","DY36",24,null,"/","/","/",3661238013889,0.35,300,250,30,"C0"]
[null,"PPS Ø 160 mm"]
[100002400,"VENTOUSE VERTICALE PPS GALVA Ø 160/220 mm","DY826",821,null,"/","/","/",3661238007192,15,1890,345,520,"C3"]
[100002404,"PIECE DE RACCORDEMENT AIR POUR VENTOUSE Ø 150 mm","DY830",103,null,"/","/","/",3661238007154,0.46,250,165,170,"C3"]
[100002399,"ADAPTATEUR PPS  Ø 150-160 mm","DY825",101,null,"/","/","/",3661238007208,0.5,200,210,230,"C3"]
[100002395,"RALLONGE PPS  Ø 160 mm LG = 1000 mm","DY821",118,null,"/","/","/",3661238007246,2.8,1155,230,230,"C3"]
[100002396,"RALLONGE PPS  Ø 160 mm LG =  500 mm","DY822",81,null,"/","/","/",3661238007239,1.5,650,295,190,"C3"]
[100002397,"COUDE PPS  87° Ø 160 mm","DY823",97,null,"/","/","/",3661238007222,0.8,265,270,265,"C3"]
[100002398,"COUDE PPS  45° Ø 160 mm","DY824",177,null,"/","/","/",3661238007215,1.4,390,290,255,"C3"]
[100002471,"TUBE D'INSPECTION Ø 160 mm LG  300 mm","DY833",154,null,"/","/","/",3661238006829,0.97,385,295,255,"C3"]
[100002472,"COUDE  DE REVISION Ø 160 mm","DY834",181,null,"/","/","/",3661238006812,0.9,265,265,260,"C3"]
[100002402,"SOLIN POUR TOIT PLAT Ø 160/220 mm","DY828",73,null,"/","/","/",3661238007178,0.65,490,490,150,"C3"]
[100002403,"SOLIN POUR TOIT INCLINÉ Ø 160/220 mm","DY829",156,null,"/","/","/",3661238007161,9.4,795,355,360,"C3"]
[100002693,"COLLIER DE FIXATION Ø 160 mm","DY842",12,null,"/","/","/",3661238006652,0.22,220,180,30,"C3"]
[100002700,"PLATINE DE FINITION INTERIEURES Ø 220 mm","DY840",37,null,"/","/","/",3661238006638,0.7,250,320,4,"C3"]
[100004040,"RALLONGE VENTOUSE PPS HORIZONTALE Ø160/200 L.1M ","DY857",253,null,"/","/","/",3661238004993,5.58,1205,235,235,"C3"]
[null,"CONFIGURATION VENTOUSE HORIZONTALE EN PPS Ø 160 mm"]
[100002401,"VENTOUSE HORIZONTALE PPS GALVA Ø 160/220 mm","DY827",676,null,"/","/","/",3661238007185,8.1999999999999993,390,290,1005,"C3"]
[100002404,"PIECE DE RACCORDEMENT AIR POUR VENTOUSE Ø 150 mm","DY830",103,null,"/","/","/",3661238007154,0.46,250,165,170,"C3"]
[100002399,"ADAPTATEUR PPS  Ø 150-160 mm","DY825",101,null,"/","/","/",3661238007208,0.5,200,210,230,"C3"]
[100002395,"RALLONGE PPS  Ø 160 mm LG = 1000 mm","DY821",118,null,"/","/","/",3661238007246,2.8,1155,230,230,"C3"]
[100002396,"RALLONGE PPS  Ø 160 mm LG = 500 mm","DY822",81,null,"/","/","/",3661238007239,1.5,650,295,190,"C3"]
[100002397,"COUDE PPS  87° Ø 160 mm","DY823",97,null,"/","/","/",3661238007222,0.8,265,270,265,"C3"]
[100002398,"COUDE PPS  45° Ø 160 mm","DY824",177,null,"/","/","/",3661238007215,1.4,390,290,255,"C3"]
[100002471,"TUBE D'INSPECTION Ø 160 mm LG  300 mm","DY833",154,null,"/","/","/",3661238006829,0.97,385,295,255,"C3"]
[100002472,"COUDE  DE REVISION Ø 160 mm","DY834",181,null,"/","/","/",3661238006812,0.9,265,265,260,"C3"]
[null," ALU Ø 150 mm"]
[100002469,"VENTOUSE HORIZONTALE ALU / GALVA Ø 150/220 mm","DY831",676,null,"/","/","/",3661238006843,8,395,295,1210,"C3"]
[100002404,"PIECE DE RACCORDEMENT AIR POUR VENTOUSE Ø 150 mm","DY830",103,null,"/","/","/",3661238007154,0.46,250,165,170,"C3"]
[100002470,"TÉ D'INSPECTION Ø 150 mm ALU","DY832",220,null,"/","/","/",3661238006836,1.4,350,285,190,"C3"]
[84887645,"RALLONGE  Ø 150 mm   LG = 500 mm ","DY645",44,null,"/","/","/",3661238012646,1.1599999999999999,525,170,175,"C3"]
[84887646,"RALLONGE  Ø 150 mm   LG = 1000 mm","DY646",77,null,"/","/","/",3661238012639,2.34,1020,170,175,"C3"]
[84887647,"RALLONGE  Ø 150 mm   LG = 1950 mm","DY647",136,null,"/","/","/",3661238012622,4.4800000000000004,1985,175,175,"C3"]
[84887649,"COUDE A 87° Ø 150 mm ","DY649",84,null,"/","/","/",3661238012608,0.81,345,265,185,"C3"]
[84887650,"COUDE A 45° Ø 150 mm  (2 PIECES)","DY650",156,null,"/","/","/",3661238012592,1.07,340,265,185,"C3"]
[100003968,"COUDE 87° AVEC SUPPORT Ø 150 mm","DY855",138,null,"/","/","/",3661238005013,1.51,650,295,190,"C3"]
[100003969,"PLAQUE DE FINITION CHEMINEE Ø 150 mm","DY856",40,null,"/","/","/",3661238005006,0.39,310,235,145,"C3"]
[84887780,"TERMINAL Ø 150 mm","DY780",328,null,"/","/","/",3661238011373,3.23,395,400,410,"C3"]
[null,"RACCORDEMENT CHEMINEE  PPS Ø 160 mm"]
[100002399,"ADAPTATEUR PPS  Ø 150-160 mm","DY825",101,null,"/","/","/",3661238007208,0.5,200,210,230,"C3"]
[100002395,"RALLONGE PPS  Ø 160 mm LG =1000 mm","DY821",118,null,"/","/","/",3661238007246,2.8,1155,230,230,"C3"]
[100002396,"RALLONGE PPS  Ø 160 mm LG =  500 mm","DY822",81,null,"/","/","/",3661238007239,1.5,650,295,190,"C3"]
[100002397,"COUDE PPS  87° Ø 160 mm","DY823",97,null,"/","/","/",3661238007222,0.8,265,270,265,"C3"]
[100002398,"COUDE PPS  45° Ø 160 mm","DY824",177,null,"/","/","/",3661238007215,1.4,390,290,255,"C3"]
[100002399,"ADAPTATEUR PPS 150/160 mn","DY825",101,null,"/","/","/",3661238007208,0.5,200,210,230,"C3"]
[100002472,"COUDE  DE REVISION Ø 160 mm","DY834",181,null,"/","/","/",3661238006812,0.9,265,265,260,"C3"]
[100002471,"TUBE D'INSPECTION Ø 160 mm LG  300 mm","DY833",154,null,"/","/","/",3661238006829,0.97,385,295,255,"C3"]
[100002474,"COUDE PPS  87° Ø 160 mm AVEC SUPPORT","DY836",175,null,"/","/","/",3661238006799,1.5,390,295,255,"C3"]
[100002475,"TERMINAL AVEC SOLIN  Ø 160 mm","DY837",172,null,"/","/","/",3661238006782,3.2,400,405,410,"C3"]
[100002476,"PLAQUE DE FINITION CHEMINEE  Ø 160 mm","DY838",39,null,"/","/","/",3661238006775,0.2,300,300,35,"C3"]
[84887773,"FOURREAU Ø165mm L 500mm","DY773",40,null,"/","/","/",3661238011441,1.23,515,165,170,"C3"]
[100002540,"ETOILE DE CENTRAGE Ø 160 mm","DY839",50,null,"/","/","/",3661238006768,0.11,350,300,30,"C3"]
[100002693,"COLLIER DE FIXATION Ø 160 mm","DY842",12,null,"/","/","/",3661238006652,0.22,220,180,30,"C3"]
[100010270,"PLAQUE DE FINITION ","DY879",43,null,"/","/","/",3661238338609,0.44,305,230,145,"C0"]
[100017634,"ADAPTATEUR PPS  Ø 150-110 mm","DY915",104,null,"/","/","/",3661238497092,0.46,260,170,180,"C0"]
[]
[]
[100019730,"GSR 330-5 Condens VG ","JB21",17455,null,"Pas concerné par l'étiquettage",null,null,3661238568617,424,800,1920,2160,"C3"]
[100019731,"GSR 330-5 Condens VD","JB22",17455,null,"Pas concerné par l'étiquettage",null,null,3661238568624,424,800,1920,2160,"C3"]
[100019732,"GSR 330-6 Condens VG","JB23",21609,null,"Pas concerné par l'étiquettage",null,null,3661238568631,458,800,1920,2160,"C3"]
[100019733,"GSR 330-6 Condens VD","JB24",21609,null,"Pas concerné par l'étiquettage",null,null,3661238568648,458,800,1920,2160,"C3"]
[100019735,"GSR 330-7 Condens VG","JB25",25762,null,"Pas concerné par l'étiquettage",null,null,3661238568655,493,800,1920,2160,"C3"]
[100019736,"GSR 330-7 Condens VD","JB26",25762,null,"Pas concerné par l'étiquettage",null,null,3661238568662,493,800,1920,2160,"C3"]
[100019737,"GSR 330-8 Condens VG","JB27",29916,null,"Pas concerné par l'étiquettage",null,null,3661238568679,560,800,2230,2160,"C3"]
[100019738,"GSR 330-8 Condens VD","JB28",29916,null,"Pas concerné par l'étiquettage",null,null,3661238568686,560,800,2230,2160,"C3"]
[100019739,"GSR 330-9 Condens VG","JB29",34069,null,"Pas concerné par l'étiquettage",null,null,3661238568693,596,800,2230,2160,"C3"]
[100019740,"GSR 330-9 Condens VD","JB30",34069,null,"Pas concerné par l'étiquettage",null,null,3661238568709,596,800,2230,2160,"C3"]
[100019741,"GSR 330-10 Condens VG","JB31",38223,null,"Pas concerné par l'étiquettage",null,null,3661238568716,633,800,2230,2160,"C3"]
[100019742,"GSR 330-10 Condens VD","JB32",38223,null,"Pas concerné par l'étiquettage",null,null,3661238568723,633,800,2230,2160,"C3"]
[null,null,null,null,null,null,null,null,null,null,null,null,null,"C3"]
[100019743,"GSR 330-5 DUO Condens","JB33",36449,null,"Pas concerné par l'étiquettage",null,null,3661238568730,827,1600,1920,2160,"C3"]
[100019744,"GSR 330-6 DUO Condens","JB34",44756,null,"Pas concerné par l'étiquettage",null,null,3661238568747,891,1600,1920,2160,"C3"]
[100019745,"GSR 330-7 DUO Condens","JB35",53063,null,"Pas concerné par l'étiquettage",null,null,3661238568754,957,1600,1920,2160,"C3"]
[100019746,"GSR 330-8 DUO Condens","JB36",61371,null,"Pas concerné par l'étiquettage",null,null,3661238568761,1087,1600,2230,2160,"C3"]
[100019747,"GSR 330-9 DUO Condens","JB37",69678,null,"Pas concerné par l'étiquettage",null,null,3661238568778,1200,1600,2230,2160,"C3"]
[100019748,"GSR 330-10 DUO Condens","JB38",77985,null,"Pas concerné par l'étiquettage",null,null,3661238568785,1225,1600,2230,2160,"C3"]
[]
["OPTIONS"]
["S101806","ISOLATION ECHANGEUR GSR 330 - 5 ELEMENTS (prémonté en usine sur demande)",null,434,null,"/","/","/",8713809259532,4.83,1065,810,65,"C3"]
["S101807","ISOLATION ECHANGEUR GSR 330 - 6 ELEMENTS (prémonté en usine sur demande)",null,434,null,"/","/","/",8713809259549,5.17,1065,810,65,"C3"]
["S103307","ISOLATION ECHANGEUR GSR 330 - 7 ELEMENTS (prémonté en usine sur demande)",null,434,null,"/","/","/",8713809259570,5.52,1065,810,65,"C3"]
["S103308","ISOLATION ECHANGEUR GSR 330 - 8 ELEMENTS (prémonté en usine sur demande)",null,434,null,"/","/","/",8713809259587,5.93,1065,810,65,"C3"]
["S103309","ISOLATION ECHANGEUR GSR 330 - 9 ELEMENTS (prémonté en usine sur demande)",null,434,null,"/","/","/",8713809259594,6.29,1065,810,65,"C3"]
["S103310","ISOLATION ECHANGEUR GSR 330 - 10 ELEMENTS (prémonté en usine sur demande)",null,434,null,"/","/","/",8713809259600,6.62,1065,810,65,"C3"]
["S101776","2EME RETOUR POUR GSR 330-5 CONDENS (prémonté en usine sur demande)",null,342,null,"/","/","/",8713809259358,11,1000,310,310,"C3"]
["S101777","2EME RETOUR POUR GSR 330-6 CONDENS (prémonté en usine sur demande)",null,342,null,"/","/","/",8713809259365,11.5,640,260,380,"C3"]
["S101778","2EME RETOUR POUR GSR 330-7 CONDENS (prémonté en usine sur demande)",null,342,null,"/","/","/",8713809259372,12,1000,310,310,"C3"]
["S101779","2EME RETOUR POUR GSR 330-8 CONDENS (prémonté en usine sur demande)",null,342,null,"/","/","/",8713809259389,12,1000,310,310,"C3"]
["S101780","2EME RETOUR POUR GSR 330-9 CONDENS (prémonté sur demande en usine)",null,342,null,"/","/","/",8713809259396,12.5,1000,310,310,"C3"]
["S101781","2EME RETOUR POUR GSR 330-10 CONDENS (prémonté sur demande en usine)",null,342,null,"/","/","/",8713809259402,12.5,1000,310,310,"C3"]
["S101784","PRESSOSTAT MANQUE D'EAU (prémonté sur demande en usine) ",null,217,0.01,"/","/","/",8713809259419,0.188,230,160,80,"C3"]
["S103305","CONTROLE D'ETANCHEITE BLOC GAZ HONEYWELL 5 A 9 ELTS (prémonté sur demande en usine)",null,73,0.01,"/","/","/",8713809259426,0.24,140,110,67,"C3"]
["S101724","CONTROLE D'ETANCHEITE BLOC GAZ DUNGS - 10 ELTS (prémonté sur demande en usine)",null,131,0.01,"/","/","/",8713809259433,"0,,228",140,70,110,"C3"]
["S103306","PRESSOSTAT GAZ MINI POUR BLOC GAZ HONEYWELL 5 A 9 ELTS (prémonté sur demande en usine)  ",null,78,0.01,"/","/","/",8713809259563,0.23599999999999999,140,110,67,"C3"]
["S101805","PRESSOSTAT GAZ MINI POUR BLOC GAZ DUNGS - 10 ELTS (prémonté sur demande en usine)  ",null,126,0.01,"/","/","/",8713809259440,0.23599999999999999,140,75,115,"C3"]
[100002454,"FILTRE A L'ASPIRATION D'AIR","GS20",534,null,"/","/","/",3661238006973,3.7,620,270,370,"C3"]
[100011223,"REGULATEUR PRESSION 300 mbar GDJ25 RACCORDT. Ø 1''","AD245 ",180,null,"/","/","/",3661238338746,1.2,180,150,150,"C3"]
[88027177,"REGULATEUR PRESSION 300 mbar GDJ 50 RACCORDT. Ø 2''","GDJ50",423,null,"/","/","/",3661238048287,3.1,255,220,205,"B2"]
["S103023","SONDE/THERMOSTAT FUMEE ",null,67,0.01,"/","/","/",8713809259464,0.124,220,190,30,"C3"]
["S101775","BRIDE D'ADAPTATION DE 4 A 8 TROUS POUR POMPE",null,242,null,"/","/","/",8713809243807,0.9,320,320,160,"C3"]
[100002455,"COUTEAU DE NETTOYAGE","GS21",21,null,"/","/","/",3661238006874,0.18,725,35,35,"C3"]
[7622256,"STATION DE NEUTRALISATION 0-1300 KW DN3",null,856,null,"/","/","/",3661238613461,null,null,null,null,"C3"]
[7606977,"CONTRE-BRIDE DEPART/RETOUR",null,101,null,"/","/","/",8713809264338,null,null,null,null,"C3"]
[7606978,"CONTRE-BRIDE 2EME RETOUR",null,44,null,"/","/","/",8713809264345,null,null,null,null,"C3"]
[35506,"GRANULATS 6 KG FIN / 1,25 KG MOYEN  (DISPO AU CPR)",null,null,null,"/","/","/",8713809071271,7.8,390,170,180]
[83877010,"STATION NEUTRALISATION (avec pompe)","DU14",1246,null,"/","/","/",3661238015074,26,450,330,350,"C0"]
[83877011,"STATION NEUTRALISATION (avec pompe)","DU15",1326,null,"/","/","/",3661238015067,20,660,455,270,"C0"]
[94225601,"RECHARGE DE GRANULATS DE NEUTRALISATION 10 KG**",null,null,null,"/","/","/",3661238075597,10,25,22,22]
[]
["OPTIONS POUR TABLEAU DE COMMANDE HMI STANDARD"]
[100015062,"BOITIER OETRONIC 4-DIN AVEC FAISCEAU CABLAGE ET SONDES","AD260",801,0.08,"/","/","/",3661238415911,2.0499999999999998,290,220,170,"C0"]
[100018921,"PLATINE INTERFACE MODBUS/OPENTHERM POUR CASCADE","AD287",108,0.01,"/","/","/",3661238544925,0.8,150,210,20,"C3"]
[85757741,"SONDE EXTERIEURE POUR TABLEAU HMI STANDARD","FM46",40,0.01,"/","/","/",3661238022751,0.12,200,150,40,"C0"]
[88017904,"THERMOSTAT D'AMBIANCE PROGRAMMABLE (FILAIRE)","AD191",158,0.08,"/","/","/",3661238102415,0.25,135,90,55,"C0"]
[88017010,"THERMOSTAT D'AMBIANCE PROGRAMMABLE (SANS FILS)","AD192",280,0.08,"/","/","/",3661238102439,0.42499999999999999,180,150,90,"C0"]
[88017836,"CABLE BUS RX11  LG 1,5 M","AD124",83,0.01,"/","/","/",3661238048911,0.06,210,160,5,"C0"]
[]
["OPTIONS POUR BOITIER REGULATION OETRONIC 4-DIN"]
[100013305,"SONDE BALLON TAMPON OU SONDE DEPART CASCADE","AD250",45,0.01,"/","/","/",3661238363588,0.13400000000000001,150,210,25,"C0"]
[100004781,"SONDE PLONGEUR + DOIGT DE GANT","AD218",182,0.01,"/","/","/",3661238002234,0.32,190,145,120,"C0"]
[100013477,"COMMANDE A DISTANCE FILAIRE RS 400","AD257",174,0.08,"/","/","/",3661238364257,0.253,175,122,60,"C0"]
[100013472," CDE A DISTANCE RADIO RS 400R     ","AD255",233,0.08,"/","/","/",3661238364233,0.253,175,122,60,"C0"]
[100013307,"MODULE CHAUDIERE RADIO (EMETTEUR)","AD252",121,0.08,"/","/","/",3661238363601,0.32,260,160,130,"C0"]
[100013306,"SONDE EXTERIEURE RADIO ","AD251",76,0.08,"/","/","/",3661238363595,0.15,150,210,40,"C0"]
[100002803,"COMMANDE A DISTANCE SIMPLIFIEE AD208","AD208",102,0.08,"/","/","/",3661238554931,0.2,120,85,40,"C0"]
[88017878,"MODULE DE TELESURVEILLANCE VOCAL  \"TELCOM 2","AD152",690,0.08,"/","/","/",3661238048751,1.05,210,190,105,"C0"]
[88017836,"CABLE BUS RX11  LG 1,5 M","AD124",83,0.01,"/","/","/",3661238048911,0.06,210,160,5,"C0"]
[88017835,"CABLE BUS LG 10 M AVEC UN EMBOUT DENUDE","AD123",87,0.01,"/","/","/",3661238048928,0.31,350,260,20,"C0"]
[88017851,"CABLE DE LIAISON BUS LG 12 M","AD134",108,0.01,"/","/","/",3661238048850,0.37,350,260,30,"C0"]
[81997720,"CABLE LIAISON BUS LG 40 M ","DB119",146,0.01,"/","/","/",3661238001350,1.34,310,215,130,"C0"]
[]
["REGULATION MURALE OETRONIC 4-MR"]
[100018255,"OE-TRONIC 4 MR","AD282",1031,0.08,"/","/","/",3661238514454,2,360,280,140,"C0"]
[85757741,"SONDE EXTERIEURE","FM46",40,0.01,"/","/","/",3661238022751,0.12,200,150,40,"C0"]
[100000030,"COLIS OPTION SONDE ECS","AD212",48,0.01,"/","/","/",3661238011168,0.16,200,150,30,"C0"]
[88017017,"SONDE DEPART V3V","AD199",79,0.01,"/","/","/",3661238049185,0.21,150,200,40,"C0"]
[100013305,"SONDE POUR BALLON TAMPON","AD250",45,0.01,"/","/","/",3661238363588,0.13400000000000001,150,210,25,"C0"]
[100013477,"COMMANDE A DISTANCE FILAIRE RS 400","AD257",174,0.08,"/","/","/",3661238364257,0.253,175,122,60,"C0"]
[100013472," CDE A DISTANCE RADIO RS 400R     ","AD255",233,0.08,"/","/","/",3661238364233,0.253,175,122,60,"C0"]
[100013307,"MODULE CHAUDIERE RADIO (EMETTEUR)","AD252",121,0.08,"/","/","/",3661238363601,0.32,260,160,130,"C0"]
[100002803,"COMMANDE A DISTANCE SIMPLIFIEE AD208","AD208",102,0.08,"/","/","/",3661238554931,0.2,120,85,40,"C0"]
[100013306,"SONDE EXTERIEURE RADIO ","AD251",76,0.08,"/","/","/",3661238363595,0.15,150,210,40,"C0"]
[88017836,"CABLE BUS RX11  LG 1,5 M","AD124",83,0.01,"/","/","/",3661238048911,0.06,210,160,5,"C0"]
[88017851,"CABLE DE LIAISON BUS LG 12 M","AD134",108,0.01,"/","/","/",3661238048850,0.37,350,260,30,"C0"]
[81997720,"CABLE LIAIS.CDI 40M ","DB119",146,0.01,"/","/","/",3661238001350,1.34,310,215,130,"C0"]
[100004781,"SONDE PLONGEUR + DOIGT DE GANT","AD218",182,0.01,"/","/","/",3661238002234,0.32,190,145,120,"C0"]
[]
["ACCESSOIRES MODULES HYDRAULIQUES "]
[7622302,"MODULE HYDRAULIQUE POUR GSR 330-5 DUO CONDENS ",null,9147,null,"/","/","/",3661238591813,376,1170,950,1600,"C3"]
[7622304,"MODULE HYDRAULIQUE POUR GSR 330-6 DUO CONDENS ",null,9397,null,"/","/","/",3661238591820,378,1170,950,1600,"C3"]
[7622306,"MODULE HYDRAULIQUE POUR GSR 330-7 DUO CONDENS ",null,9865,null,"/","/","/",3661238591837,378,1170,950,1600,"C3"]
[7622307,"MODULE HYDRAULIQUE POUR GSR 330-8 DUO CONDENS ",null,10100,null,"/","/","/",3661238591844,385,1170,950,1600,"C3"]
[7622308,"MODULE HYDRAULIQUE POUR GSR 330-9 ET 10 DUO CONDENS ",null,10603,null,"/","/","/",3661238591851,407,1170,950,1600,"C3"]
[100016229,"GROUPE DE SECURITE",null,2644,null,null,null,null,3661238495661,18,600,400,200,"C3"]
[7613414,"ENSEMBLE COUDES DEPART/RETOUR POUR KIT RACC DROITE OU GAUCHE",null,921,null,"/","/","/",3661238591868,65,500,500,300,"C3"]
[7613415,"KIT DEMAGNETISEUR DES BOUES ",null,152,null,"/","/","/",3661238591875,1.5,250,200,200,"C3"]
[7616233,"MODULE HYDRAULIQUE COMPACT POUR 2 CIRCUITS","MT12",1651,0.17,"/","/","/",3661238600614,12.2,530,415,215,"C3"]
[100020169,"MODULE HYDR COMPACT 2 CIRCUITS CLASSE A ","EA145",1122,0.17399999999999999,"/","/","/",3661238575059,9,525,415,210,"C0"]
[]
["ECHANGEUR DE CHALEUR DE SEPARATION DE CIRCUITS DE 85 à 650 Kw"]
["MODELES NON ISOLES EP NT"]
[7609004,"ECH PLAQUES NT-85","EC735",2603,null,"/","/","/",3661238591936,88,870,270,790,"C3"]
[7609005,"ECH PLAQUES NT-100","EC736",2697,null,"/","/","/",3661238592186,90,870,270,790,"C3"]
[7609007,"ECH PLAQUES NT-130","EC737",2797,null,"/","/","/",3661238592193,94,870,270,790,"C3"]
[7609008,"ECH PLAQUES NT-180","EC738",3083,null,"/","/","/",3661238592209,103,870,270,790,"C3"]
[7609084,"ECH PLAQUES NT-205","EC743",3188,null,"/","/","/",3661238592216,268,1390,400,860,"C3"]
[7609085,"ECH PLAQUES NT-280","EC744",3565,null,"/","/","/",3661238592223,282,1390,400,860,"C3"]
[7609086,"ECH PLAQUES NT-350","EC745",3935,null,"/","/","/",3661238592230,296,1390,400,860,"C3"]
[7609087,"ECH PLAQUES NT-425","EC746",4369,null,"/","/","/",3661238592247,315,1390,400,1060,"C3"]
[7609088,"ECH PLAQUES NT-500","EC747",4830,null,"/","/","/",3661238592254,329,1390,400,1060,"C3"]
[7609089,"ECH PLAQUES NT-575","EC748",5246,null,"/","/","/",366123859226,342,1390,400,1060,"C3"]
[7609090,"ECH PLAQUES NT-650","EC749",5797,null,"/","/","/",3661238592278,359,1390,400,1060,"C3"]
[]
["MODELES ISOLES EP NT A"]
[7609010,"ECH ISOLATION NT-85A",null,{"$f":"+D2986+D2997","v":3338},null,"/","/","/",3661238599031,null,null,null,null,"C3"]
[7609011,"ECH ISOLATION NT-100A",null,{"$f":"D2987+D2997","v":3432},null,"/","/","/",3661238610408,null,null,null,null,"C3"]
[7609012,"ECH ISOLATION NT-130A",null,{"$f":"D2988+D2997","v":3532},null,"/","/","/",3661238610712,null,null,null,null,"C3"]
[7609013,"ECH ISOLATION NT-180A",null,{"$f":"D2989+D2997","v":3818},null,"/","/","/",3661238610729,null,null,null,null,"C3"]
[7609092,"ECH ISOLATION NT-205A",null,{"$f":"D2990+D2997","v":3923},null,"/","/","/",3661238610736,null,null,null,null,"C3"]
[7609093,"ECH ISOLATION NT-280A",null,{"$f":"D2991+D2997","v":4300},null,"/","/","/",3661238610743,null,null,null,null,"C3"]
[7609094,"ECH ISOLATION NT-350A",null,{"$f":"D2992+D2998","v":4700},null,"/","/","/",3661238610750,null,null,null,null,"C3"]
[7609096,"ECH ISOLATION NT-425A",null,{"$f":"D2993+D2998","v":5134},null,"/","/","/",3661238599048,null,null,null,null,"C3"]
[7609098,"ECH ISOLATION NT-500A",null,{"$f":"D2994+D2998","v":5595},null,"/","/","/",3661238599055,null,null,null,null,"C3"]
[7609099,"ECH ISOLATION NT-575A",null,{"$f":"D2995+D2999","v":6038},null,"/","/","/",3661238599062,null,null,null,null,"C3"]
[7609100,"ECH ISOLATION NT-650A",null,{"$f":"D2996+D2999","v":6589},null,"/","/","/",3661238599079,null,null,null,null,"C3"]
[]
["COMPOSANTS"]
[7609004,"ECH PLAQUES NT-85","EC735",2603,null,"/","/","/",3661238591936,88,870,270,790,"C3"]
[7609005,"ECH PLAQUES NT-100","EC736",2697,null,"/","/","/",3661238592186,90,870,270,790,"C3"]
[7609007,"ECH PLAQUES NT-130","EC737",2797,null,"/","/","/",3661238592193,94,870,270,790,"C3"]
[7609008,"ECH PLAQUES NT-180","EC738",3083,null,"/","/","/",3661238592209,103,870,270,790,"C3"]
[7609084,"ECH PLAQUES NT-205","EC743",3188,null,"/","/","/",3661238592216,268,1390,400,860,"C3"]
[7609085,"ECH PLAQUES NT-280","EC744",3565,null,"/","/","/",3661238592223,282,1390,400,860,"C3"]
[7609086,"ECH PLAQUES NT-350","EC745",3935,null,"/","/","/",3661238592230,296,1390,400,860,"C3"]
[7609087,"ECH PLAQUES NT-425","EC746",4369,null,"/","/","/",3661238592247,315,1390,400,1060,"C3"]
[7609088,"ECH PLAQUES NT-500","EC747",4830,null,"/","/","/",3661238592254,329,1390,400,1060,"C3"]
[7609089,"ECH PLAQUES NT-575","EC748",5246,null,"/","/","/",366123859226,342,1390,400,1060,"C3"]
[7609090,"ECH PLAQUES NT-650","EC749",5797,null,"/","/","/",3661238592278,359,1390,400,1060,"C3"]
[7609101,"ISOLATION ECH NT 85-280","EC757",735,null,null,null,null,3661238592285,10,850,280,650,"C3"]
[7609102,"ISOLATION ECH NT 350-500","EC758",765,null,null,null,null,3661238592292,10,850,280,650,"C3"]
[7609103,"ISOLATION ECH NT 575-650","EC759",792,null,null,null,null,3661238592308,10,850,280,650,"C3"]
[]
["FUMISTERIE"]
["S103179","REDUCTION Ø250 A Ø200",null,164,null,"/","/","/",8713809259556,0.94,265,265,160,"C3"]
["S103118","KIT DE CONNEXION FUMEE POUR 2 X GSR 330 Condens",null,2166,null,"/","/","/",8713809258306,39,1200,800,800,"C3"]
["S103128","COLLECTEUR ENTREE D'AIR POUR 2 X GSR 330 Condens",null,1380,null,"/","/","/",8713809258313,7.9,800,400,520,"C3"]
[51202,"VENTOUSE VERTICALE ALU GALVA Ø200/300 MM",null,1771,null,"/","/","/",8713809136246,30,2500,530,530,"C3"]
[51203,"VENTOUSE VERTICALE ALU GALVA Ø250/350 MM",null,2088,null,"/","/","/",8713809136253,30,2500,530,530,"C3"]
[46157,"SOLIN POUR TOIT PLAT Ø 300 MM",null,223,null,"/","/","/",8713809113988,3,640,640,175,"C3"]
[46158,"SOLIN POUR TOIT PLAT Ø 350 MM",null,233,null,"/","/","/",8713809113995,3.25,690,690,175,"C3"]
[54443,"VENTOUSE VERTICALE 2x Ø 350 MM",null,4060,null,"/","/","/",8713809154219,59,1200,800,1200,"C3"]
[]
[]
["FAMILLE:","CHAUDIERE  FIOUL AU SOL MODULANTE CONDENSATION"]
[]
[]
[100017739,"OSCR 18","MV12",6073,null,"A","/","/",3661238505827,122,790,675,1335,"C0"]
[100017740,"OSCR 24","MV13",6244,null,"A","/","/",3661238505834,122,790,675,1335,"C0"]
[100017741,"OSCR 30","MV14",6466,null,"A","/","/",3661238505841,131,790,675,1405,"C0"]
[]
[]
[7635811,"OVCR 18/100HL",null,{"$f":"D3025+D3028+D3029","v":7403},null,"A","B","XL",3661238636149,null,null,null,null,"C0"]
[7635812,"OVCR 24/100HL",null,{"$f":"D3026+D3028+D3029","v":7574},null,"A","B","XL",3661238636156,null,null,null,null,"C0"]
[7635813,"OVCR 30/100HL",null,{"$f":"D3027+D3028+D3029","v":7796},null,"A","B","XL",3661238636163,null,null,null,null,"C0"]
[]
["COMPOSANTS "]
[100017739,"OSCR 18","MV12",6073,null,"A","/","/",3661238505827,122,790,675,1335,"C0"]
[100017740,"OSCR 24","MV13",6244,null,"A","/","/",3661238505834,122,790,675,1335,"C0"]
[100017741,"OSCR 30","MV14",6466,null,"A","/","/",3661238505841,131,790,675,1405,"C0"]
[100016430,"BALLON 100HL ","ER225",1040,null,"/","/","/",3661238493469,66,780,675,780,"C0"]
[7611211,"KIT DE LIAISON BALLON 100L HL HEE","MV34",290,null,"/","/","/",3661238492134,4.2,1185,195,225,"C0"]
[]
[]
[7635814,"OCCR 18/160SL",null,{"$f":"D3037+D3040+D3041","v":7493},null,"A","B","XL",3661238636170,null,null,null,null,"C0"]
[7635815,"OCCR 24/160SL",null,{"$f":"D3038+D3040+D3041","v":7664},null,"A","B","XL",3661238636187,null,null,null,null,"C0"]
[7635816,"OCCR 30/160SL",null,{"$f":"D3039+D3040+D3041","v":7886},null,"A","B","XL",3661238636194,null,null,null,null,"C0"]
[]
["COMPOSANTS "]
[100017739,"OSCR 18","MV12",6073,null,"A","/","/",3661238505827,122,790,675,1335,"C0"]
[100017740,"OSCR 24","MV13",6244,null,"A","/","/",3661238505834,122,790,675,1335,"C0"]
[100017741,"OSCR 30","MV14",6466,null,"A","/","/",3661238505841,131,790,675,1405,"C0"]
[100016428," BALLON 160SL ","ER223",932,null,"/","/","/",3661238493445,91,790,675,1070,"C0"]
[7608113,"KIT LIAISON BALLON 160L SL HEE ","MV32",488,null,"/","/","/",3661238492141,11.1,875,685,235,"C0"]
[]
[]
[7635817,"OVCR 18/L160SL",null,{"$f":"D3049+D3052+D3053","v":7421},null,"A","B","XL",3661238636200,null,null,null,null,"C0"]
[7635818,"OVCR 24/L160SL",null,{"$f":"D3050+D3052+D3053","v":7592},null,"A","B","XL",3661238636217,null,null,null,null,"C0"]
[7635819,"OVCR 30/L160SL",null,{"$f":"D3051+D3052+D3053","v":7814},null,"A","B","XL",3661238636224,null,null,null,null,"C0"]
[]
["COMPOSANTS "]
[100017739,"OSCR 18","MV12",6073,null,"A","/","/",3661238505827,122,790,675,1335,"C0"]
[100017740,"OSCR 24","MV13",6244,null,"A","/","/",3661238505834,122,790,675,1335,"C0"]
[100017741,"OSCR 30","MV14",6466,null,"A","/","/",3661238505841,131,790,675,1405,"C0"]
[100020079,"BALLON L160SL ","EC600",1058,null,"/","/","/",3661238584310,97.5,680,680,1100,"C0"]
[7611211,"KIT DE LIAISON BALLON 100L HL HEE","MV34",290,null,"/","/","/",3661238492134,4.2,1185,195,225,"C0"]
[]
[]
[7635820,"OCCR 18/220SHL",null,{"$f":"+D3061+D3064+D3065+D3066","v":9192},null,"A","B","XL",3661238636637,null,null,null,null,"C0"]
[7635821,"OCCR 24/220SHL",null,{"$f":"+D3062+D3064+D3065+D3066","v":9363},null,"A","B","XL",3661238636644,null,null,null,null,"C0"]
[7635823,"OCCR 30/220SHL",null,{"$f":"D3063+D3064+D3065+D3066","v":9585},null,"A","B","XL",3661238636651,null,null,null,null,"C0"]
[]
["COMPOSANTS "]
[100017739,"OSCR 18","MV12",6073,null,"A","/","/",3661238505827,122,790,675,1335,"C0"]
[100017740,"OSCR 24","MV13",6244,null,"A","/","/",3661238505834,122,790,675,1335,"C0"]
[100017741,"OSCR 30","MV14",6466,null,"A","/","/",3661238505841,131,790,675,1405,"C0"]
[100016425,"220SHL","ER220",2389,null,"/","/","/",3661238493414,123,780,675,1350,"C0"]
[7611256,"KIT DE LIAISON BALLON 220L SHL HEE","MV35",560,null,"/","/","/",3661238505810,11.7,875,675,235,"C0"]
[100016501,"KIT VASE D'EXPANSION  12l/10 bars ","ER229",170,null,"/","/","/",3661238505926,5,325,320,215,"C0"]
[]
[]
[7614432,"OSCR 18  HOR",null,{"$f":"D3077+D3081+D3080","v":6221},null,"A","/","/",3661238562424,null,null,null,null,"C0"]
[7614433,"OSCR 18  VER",null,{"$f":"D3077+D3082","v":6225},null,"A","/","/",3661238562431,null,null,null,null,"C0"]
[7614434,"OSCR 24  HOR",null,{"$f":"D3078+D3080+D3081","v":6392},null,"A","/","/",3661238562448,null,null,null,null,"C0"]
[7614435,"OSCR 24  VER",null,{"$f":"D3078+D3082","v":6396},null,"A","/","/",3661238562455,null,null,null,null,"C0"]
[7614436,"OSCR 30  HOR",null,{"$f":"D3079+D3080+D3081","v":6614},null,"A","/","/",3661238562462,null,null,null,null,"C0"]
[7614437,"OSCR 30  VER",null,{"$f":"D3079+D3082","v":6618},null,"A","/","/",3661238562479,null,null,null,null,"C0"]
[]
["COMPOSANTS "]
[100017739,"OSCR 18","MV12",6073,null,"A","/","/",3661238505827,122,790,675,1335,"C0"]
[100017740,"OSCR 24","MV13",6244,null,"A","/","/",3661238505834,122,790,675,1335,"C0"]
[100017741,"OSCR 30","MV14",6466,null,"A","/","/",3661238505841,131,790,675,1405,"C0"]
[84887531,"COUDE A 87° ALU/PPS  Ø 80/125 MM","DY131",50,null,"/","/","/",3661238013636,0.66,200,200,150,"C0"]
[100007638,"TERMINAL HORIZONTAL  Ø 80/125","FM183",98,null,"/","/","/",3661238157972,2.12,1025,170,170,"C0"]
[100002732,"TERMINAL VERTICAL PPS Ø 80/125 MM NOIR","DY843",152,null,"/","/","/",3661238006621,4.2,1210,270,240,"C0"]
[]
[]
[7635838,"OVCR 18 HOR /100HL",null,{"$f":"D3093+D3096+D3097+D3098+D3099","v":7551},null,"A","B","XL",3661238636668,null,null,null,null,"C0"]
[7635839,"OVCR 18  VER /100HL",null,{"$f":"+D3093+D3096+D3097+D3100","v":7555},null,"A","B","XL",3661238636675,null,null,null,null,"C0"]
[7635840,"OVCR 24  HOR /100HL",null,{"$f":"D3094+D3096+D3097+D3098+D3099","v":7722},null,"A","B","XL",3661238636682,null,null,null,null,"C0"]
[7635841,"OVCR 24  VER /100HL",null,{"$f":"D3094+D3096+D3097+D3100","v":7726},null,"A","B","XL",3661238636699,null,null,null,null,"C0"]
[7635842,"OVCR 30  HOR /100HL",null,{"$f":"D3095+D3096+D3097+D3098+D3099","v":7944},null,"A","B","XL",3661238636705,null,null,null,null,"C0"]
[7635843,"OVCR 30  VER /100HL",null,{"$f":"D3095+D3096+D3097+D3100","v":7948},null,"A","B","XL",3661238636811,null,null,null,null,"C0"]
[]
["COMPOSANTS "]
[100017739,"OSCR 18","MV12",6073,null,"A","/","/",3661238505827,122,790,675,1335,"C0"]
[100017740,"OSCR 24","MV13",6244,null,"A","/","/",3661238505834,122,790,675,1335,"C0"]
[100017741,"OSCR 30","MV14",6466,null,"A","/","/",3661238505841,131,790,675,1405,"C0"]
[100016430,"BALLON 100HL ","ER225",1040,null,"/","/","/",3661238493469,66,780,675,780,"C0"]
[7611211,"KIT DE LIAISON BALLON 100L HL HEE","MV34",290,null,"/","/","/",3661238492134,4.2,1185,195,225,"C0"]
[84887531,"COUDE A 87° ALU/PPS  Ø 80/125 MM","DY131",50,null,"/","/","/",3661238013636,0.66,200,200,150,"C0"]
[100007638,"TERMINAL HORIZONTAL  Ø 80/125","FM183",98,null,"/","/","/",3661238157972,2.12,1025,170,170,"C0"]
[100002732,"TERMINAL VERTICAL PPS Ø 80/125 MM NOIR","DY843",152,null,"/","/","/",3661238006621,4.2,1210,270,240,"C0"]
[]
[]
[7635844,"OCCR 18  HOR /160SL",null,{"$f":"D3111+D3114+D3115+D3117+D3116","v":7641},null,"A","B","XL",3661238636828,null,null,null,null,"C0"]
[7635845,"OCCR 18  VER /160SL",null,{"$f":"D3111+D3114+D3115+D3118","v":7645},null,"A","B","XL",3661238636835,null,null,null,null,"C0"]
[7635846,"OCCR 24  HOR /160SL",null,{"$f":"D3112+D3114+D3115+D3116+D3117","v":7812},null,"A","B","XL",3661238636842,null,null,null,null,"C0"]
[7635847,"OCCR 24  VER /160SL",null,{"$f":"D3112+D3114+D3115+D3118","v":7816},null,"A","B","XL",3661238636859,null,null,null,null,"C0"]
[7635848,"OCCR 30  HOR /160SL",null,{"$f":"D3113+D3114+D3115+D3116+D3117","v":8034},null,"A","B","XL",3661238636866,null,null,null,null,"C0"]
[7635849,"OCCR 30  VER /160SL",null,{"$f":"D3113+D3114+D3115+D3118","v":8038},null,"A","B","XL",3661238637276,null,null,null,null,"C0"]
[]
["COMPOSANTS "]
[100017739,"OSCR 18","MV12",6073,null,"A","/","/",3661238505827,122,790,675,1335,"C0"]
[100017740,"OSCR 24","MV13",6244,null,"A","/","/",3661238505834,122,790,675,1335,"C0"]
[100017741,"OSCR 30","MV14",6466,null,"A","/","/",3661238505841,131,790,675,1405,"C0"]
[100016428," BALLON 160SL ","ER223",932,null,"/","/","/",3661238493445,91,790,675,1070,"C0"]
[7608113,"KIT LIAISON BALLON 160L SL HEE ","MV32",488,null,"/","/","/",3661238492141,11.1,875,685,235,"C0"]
[84887531,"COUDE A 87° ALU/PPS  Ø 80/125 MM","DY131",50,null,"/","/","/",3661238013636,0.66,200,200,150,"C0"]
[100007638,"TERMINAL HORIZONTAL  Ø 80/125","FM183",98,null,"/","/","/",3661238157972,2.12,1025,170,170,"C0"]
[100002732,"TERMINAL VERTICAL PPS Ø 80/125 MM NOIR","DY843",152,null,"/","/","/",3661238006621,4.2,1210,270,240,"C0"]
[]
[]
[7635824,"OVCR 18 HOR /L160SL",null,{"$f":"D3129+D3132+D3133+D3134+D3135","v":7569},null,"A","B","XL",3661238636620,null,null,null,null,"C0"]
[7635825,"OVCR 18  VER /L160SL",null,{"$f":"D3129+D3132+D3133+D3136","v":7573},null,"A","B","XL",3661238636880,null,null,null,null,"C0"]
[7635826,"OVCR 24  HOR /L160SL",null,{"$f":"D3130+D3132+D3133+D3134+D3135","v":7740},null,"A","B","XL",3661238636897,null,null,null,null,"C0"]
[7635827,"OVCR 24  VER /L160SL",null,{"$f":"D3130+D3132+D3133+D3136","v":7744},null,"A","B","XL",3661238636903,null,null,null,null,"C0"]
[7635829,"OVCR 30  HOR /L160SL",null,{"$f":"D3131+D3132+D3133+D3134+D3135","v":7962},null,"A","B","XL",3661238636910,null,null,null,null,"C0"]
[7635830,"OVCR 30  VER /L160SL",null,{"$f":"D3131+D3132+D3133+D3136","v":7966},null,"A","B","XL",3661238636927,null,null,null,null,"C0"]
[]
["COMPOSANTS "]
[100017739,"OSCR 18","MV12",6073,null,"A","/","/",3661238505827,122,790,675,1335,"C0"]
[100017740,"OSCR 24","MV13",6244,null,"A","/","/",3661238505834,122,790,675,1335,"C0"]
[100017741,"OSCR 30","MV14",6466,null,"A","/","/",3661238505841,131,790,675,1405,"C0"]
[100020079,"BALLON L160SL ","EC600",1058,null,"/","/","/",3661238584310,97.5,680,680,1100,"C0"]
[7611211,"KIT DE LIAISON BALLON 100L HL HEE","MV34",290,null,"/","/","/",3661238492134,4.2,1185,195,225,"C0"]
[84887531,"COUDE A 87° ALU/PPS  Ø 80/125 MM","DY131",50,null,"/","/","/",3661238013636,0.7,200,200,150,"C0"]
[100007638,"TERMINAL HORIZONTAL  Ø 80/125","FM183",98,null,"/","/","/",3661238157972,2.1,1025,170,170,"C0"]
[100002732,"TERMINAL VERTICAL PPS Ø 80/125 MM NOIR","DY843",152,null,"/","/","/",3661238006621,4.2,1210,270,240,"C0"]
[]
[]
[7635850,"OCCR 18  HOR /220SHL",null,{"$f":"D3147+D3150+D3151+D3152+D3153+D3154","v":9340},null,"A","B","XL",3661238636934,null,null,null,null,"C0"]
[7635852,"OCCR 18  VER /220SHL",null,{"$f":"D3147+D3150+D3151+D3152+D3155","v":9344},null,"A","B","XL",3661238636941,null,null,null,null,"C0"]
[7635853,"OCCR 24  HOR /220SHL",null,{"$f":"D3148+D3150+D3151+D3152+D3153+D3154","v":9511},null,"A","B","XL",3661238636958,null,null,null,null,"C0"]
[7635855,"OCCR 24  VER /220SHL",null,{"$f":"D3148+D3150+D3151+D3152+D3155","v":9515},null,"A","B","XL",3661238636965,null,null,null,null,"C0"]
[7635856,"OCCR 30  HOR /220SHL",null,{"$f":"D3149+D3150+D3151+D3152+D3153+D3154","v":9733},null,"A","B","XL",3661238636972,null,null,null,null,"C0"]
[7635858,"OCCR 30  VER /220SHL",null,{"$f":"D3149+D3150+D3151+D3152+D3155","v":9737},null,"A","B","XL",3661238636989,null,null,null,null,"C0"]
[]
["COMPOSANTS "]
[100017739,"OSCR 18","MV12",6073,null,"A","/","/",3661238505827,122,790,675,1335,"C0"]
[100017740,"OSCR 24","MV13",6244,null,"A","/","/",3661238505834,122,790,675,1335,"C0"]
[100017741,"OSCR 30","MV14",6466,null,"A","/","/",3661238505841,131,790,675,1405,"C0"]
[100016425,"220SHL","ER220 ",2389,null,"/","/","/",3661238493414,123,780,675,1350,"C0"]
[7611256,"KIT DE LIAISON BALLON 220L SHL HEE","MV35",560,null,"/","/","/",3661238505810,11.7,875,675,235,"C0"]
[100016501,"KIT VASE D'EXPANSION  12l/10 bars ","ER229",170,null,"/","/","/",3661238505926,5,325,320,215,"C0"]
[84887531,"COUDE A 87° ALU/PPS  Ø 80/125 MM","DY131",50,null,"/","/","/",3661238013636,0.66,200,200,150,"C0"]
[100007638,"TERMINAL HORIZONTAL  Ø 80/125","FM183",98,null,"/","/","/",3661238157972,2.12,1025,170,170,"C0"]
[100002732,"TERMINAL VERTICAL PPS Ø 80/125 MM NOIR","DY843",152,null,"/","/","/",3661238157972,2.12,1025,170,170,"C0"]
[]
[]
["OPTIONS CHAUDIERE"]
[100016432,"VASE D'EXPANSION 18 L","MV4",82,null,"/","/","/",3661238491915,3.8,300,300,410,"C0"]
[100016489,"KIT VANNE 3 VOIES  ","MV5",395,null,"/","/","/",3661238492110,6.5,1185,195,225,"C0"]
[100016490,"KIT CIRCUIT EXTERNE ","MV6",82,null,"/","/","/",3661238492127,3.8,615,465,185,"C0"]
[100017720,"KIT SORTIE ARRIERE","MV9 ",109,null,"/","/","/",3661238498013,0.3,325,240,50,"C0"]
[100017736,"KIT LIMITEUR DE TEMPERATURE","MV10",175,null,"/","/","/",3661238505735,3.5,615,465,185,"C0"]
[100019734,"MANCHETTE DE MESURE 80/125 PPs/Alu ","MV25",69,null,"/","/","/",3661238569614,0.45,null,null,null,"C0"]
[7608024,"KIT ADAPTATION CIRCULATEUR EXTERNE","MV30",25,null,"/","/","/",3661238587533,0.35,125,100,90,"C0"]
[7608112,"KIT VANNE 3 VOIES HEE ","MV31",507,null,"/","/","/",3661238586420,6.5,1185,195,225,"C0"]
[7608114,"KIT LIAISON BALLON EXTERNE HEE","MV33",312,null,"/","/","/",3661238586444,4.8600000000000003,615,465,185,"C0"]
[7608113,"KIT LIAISON BALLON 160L SL HEE ","MV32",488,null,"/","/","/",3661238586437,11.1,875,685,235,"C0"]
[7611211,"KIT DE LIAISON BALLON 100L HL HEE","MV34",290,null,"/","/","/",3661238589414,4.2,1185,195,225,"C0"]
[7611256,"KIT DE LIAISON BALLON 220L SHL HEE","MV35",560,null,"/","/","/",3661238589421,11.7,875,685,235,"C0"]
[7602811,"KIT V3V INTERNE - HEE","JA83",612,null,"/","/","/",3661238587762,5.5,620,220,220,"C0"]
[100004290,"STATION DE NEUTRALISATION","FM155",254,null,"/","/","/",3661238004238,7.75,490,320,185,"C0"]
[100004291,"RECHARGE STATION DE NEUTRALISATION","FM156",127,null,"/","/","/",3661238004221,6.14,405,265,165,"C0"]
[100004292,"COLIS SUPPORT STATION DE NEUTRALISATION ","FM157",127,null,"/","/","/",3661238004214,2,395,330,120,"C0"]
[100004293,"POMPE DE RELEVAGE DES CONDENSATS","FM158",336,0.17,"/","/","/",3661238004207,1.91,230,115,110,"C0"]
[]
["OPTIONS REGULATION "]
[100013304,"COLIS OPTION V3V OE-TRONIC 4","AD249",155,0.01,"/","/","/",3661238363519,0.42,260,170,130,"C0"]
[100013305,"COLIS SONDE SYSTÈME OE-TRONIC 4","AD250",45,0.01,"/","/","/",3661238363588,0.13400000000000001,150,210,25,"C0"]
[100013306,"SONDE EXTERIEURE RADIO ","AD251",76,0.08,"/","/","/",3661238363595,0.15,150,210,40,"C0"]
[100013307,"MODULE CHAUDIERE RADIO (EMETTEUR)","AD252",121,0.08,"/","/","/",3661238363601,0.32,260,160,130,"C0"]
[100013472,"CDE A DISTANCE RADIO RS 400R     ","AD255",233,0.08,"/","/","/",3661238364233,0.253,175,122,60,"C0"]
[100013477,"CDE A DISTANCE FILAIRE RS 400   ","AD257",174,0.08,"/","/","/",3661238364257,0.253,175,122,60,"C0"]
[88017851,"CABLE DE LIAISON BUS LG 12 M","AD134",108,0.01,"/","/","/",3661238048850,0.37,350,260,30,"C0"]
[88017878,"MODULE DE TELESURVEILLANCE VOCAL TELCOM 2","AD152",690,0.08,"/","/","/",3661238048751,1.05,210,190,105,"C0"]
[88017017,"SONDE DEPART v3v","AD199",79,0.01,"/","/","/",3661238049185,0.21,150,200,40,"C0"]
[100002803,"COMMANDE A DISTANCE SIMPLIFIEE AD208","AD208",102,0.08,"/","/","/",3661238554931,0.2,120,85,40,"C0"]
[]
["OPTIONS ECS"]
[100000492,"KIT ANODE MAGNESIUM","EA103",65,null,"/","/","/",3661238011069,0.9,560,90,85,"C0"]
[100000030,"COLIS OPTION SONDE ECS","AD212",48,0.01,"/","/","/",3661238011168,0.16,200,150,30,"C0"]
[100017933,"KIT DE LIAISON BALLON AUTRE","MV18",220,0.17,"/","/","/",3661238511118,4.9000000000000004,615,465,185,"C0"]
[null,null,null,null,null,"/","/","/"]
["MODULES HYDRAULIQUES"]
[100020045,"KIT FILTRE FERNOX TF1",null,253,null,"/","/","/"]
[100020164,"COLLECTEUR 2/3 CIRCUITS ","EA140",341,null,"/","/","/",3661238575011,6.6,660,180,200,"C0"]
[100020165,"CONSOLE MUR COLLECTEUR ","EA141",43,null,"/","/","/",3661238575028,1.2,220,125,70,"C0"]
[100020166,"CONSOLE MUR 1 MODULE ","EA142",114,null,"/","/","/",3661238575035,1.6,220,125,70,"C0"]
[100020167,"CIRCUIT DIRECT P.ELEC CLASSE A  ","EA143",631,0.17,"/","/","/",3661238575042,5.0999999999999996,460,270,235,"C0"]
[100020169,"MODULE HYDR COMPACT 2 CIRCUITS HEE","EA145",1122,0.17399999999999999,"/","/","/",3661238575059,9,525,415,210,"C0"]
[]
["OPTIONS DE  MODULES HYDRAULIQUES CIRCUIT V3V"]
[89997044,"KIT DE TRANSFORMATION VANNE MOTORISEE EN VANNE MANUELLE","EA79",43,null,"/","/","/",3661238044500,0.22,155,105,100,"C0"]
[]
["FUMISTERIE"]
[null,"PPS Ø 110 mm"]
[84887577,"KIT DE RACCORDEMENT CHEMINEE PPS Ø 110 mm","DY177",253,null,"/","/","/",3661238013223,2.68,395,300,510,"C0"]
[84887578,"TUYAU PPS Ø 110 mm LG = 1950 mm (GRIS)","DY178",71,null,"/","/","/",3661238013216,2.46,1960,150,150,"C0"]
[84887579,"TUYAU PPS Ø 110 mm LG = 1000 mm (GRIS)","DY179",40,null,"/","/","/",3661238013209,1.24,1015,130,140,"C0"]
[84887580,"TUYAU PPS Ø 110 mm LG = 500 mm (GRIS)","DY180",30,null,"/","/","/",3661238013193,0.62,515,135,140,"C0"]
[84887581,"COUDE PPS 87° Ø 110 mm (GRIS)","DY181",35,null,"/","/","/",3661238013186,0.33,255,190,150,"C0"]
[84887582,"COUDE PPS 45° Ø 110 mm (GRIS)","DY182",47,null,"/","/","/",3661238013179,0.52,295,215,165,"C0"]
[84887583,"T DE REVISION Ø 110 mm (GRIS)","DY183",47,null,"/","/","/",3661238013162,0.46,300,150,150,"C0"]
[84887587,"ETOILE DE CENTRAGE PPS  Ø 110 mm (2 PIECES)","DY187",14,null,"/","/","/",3661238013124,0.1,300,300,30,"C0"]
[84887588,"COUDE DE REVISION PPS 87° Ø 110 mm (GRIS)","DY188",71,null,"/","/","/",3661238013117,0.52,315,235,150,"C0"]
[84887772,"PLAQUE DE FINITION","DY772",57,null,"/","/","/",3661238011458,0.49,310,230,145,"C0"]
[84887773,"FOURREAU Ø165mm L 500mm","DY773",40,null,"/","/","/",3661238011441,1.23,515,165,170,"C3"]
[84887435,"GRILLE D'AERATION EXTERIEURE 250 X 300 mm","DY35",23,null,"/","/","/",3661238013889,0.35,300,250,30,"C0"]
[100015325,"KIT N° 1 RACCORDEMENT CHEMINÉE FLEXIBLE PPS Ø 80 mm","DY895",231,null,"/","/","/",3661238380110,2.87,395,395,380,"C0"]
[100015327,"TUBE FLEXIBLE LG=12,5M","DY897",347,null,"/","/","/",3661238380134,8.6999999999999993,1200,1220,250,"C0"]
[100015326,"TUBE FLEXIBLE LG=50M","DY896",1216,null,"/","/","/",3661238380127,35,1600,1660,410,"C0"]
[84887618,"ETOILE DE CENTRAGE POUR FLEXIBLE Ø 80  mm (2 PIÈCES)","DY618",36,null,"/","/","/",3661238012912,0.2,300,300,70,"C0"]
[100015328,"PIÈCE DE COUPLAGE FLEXIBLE Ø 80 mm","DY898",70,null,"/","/","/",3661238380141,0.25,150,150,150,"C0"]
[100015331,"OUTIL D'AIDE À L'INSERTION Ø 80 mm","DY901",174,null,"/","/","/",3661238380172,1.4,300,210,185,"C0"]
[100015330,"PIÈCE D'INSPECTION POUR TUBE FLEXIBLE","DY900",125,null,"/","/","/",3661238380165,0.5,295,140,140,"C0"]
[100015329,"TERMINAL AVEC SOLIN FLEX. Ø 80 mm","DY899",174,null,"/","/","/",3661238380158,1.74,385,385,250,"C0"]
[null,"PPS Ø 80 mm"]
[84887717,"KIT N° 1 KIT DE RACCORDEMENT CHEMINEE PPS Ø 80 mm","DY717",154,null,"/","/","/",3661238011946,2.89,395,405,390,"C0"]
[84887613,"RALLONGE PPS Ø 80 mm   L= 250 mm (2 PCS)","DY613",39,null,"/","/","/",3661238012967,0.37,250,170,175,"C0"]
[84887614,"RALLONGE PPS  Ø 80 mm   L=  500 mm (2 PCS)","DY614",37,null,"/","/","/",3661238012950,0.68,500,160,150,"C0"]
[84887615,"RALLONGE PPS  Ø 80 mm   L=  1000 mm (2 PCS)","DY615",50,null,"/","/","/",3661238012943,1.25,1000,160,145,"C0"]
[84887550,"RALLONGE PPS Ø 80 mm   L=  2000 mm  (2 PIECES)","DY150",76,null,"/","/","/",3661238013469,2.4900000000000002,1960,150,150,"C0"]
[84887552,"COUDE PPS à 90°","DY152",15,null,"/","/","/",3661238013445,0.2,255,145,150,"C0"]
[84887554,"COUDE PPS a 45°  (2 PCS)","DY154",34,null,"/","/","/",3661238013421,0.32,200,200,150,"C0"]
[100008301,"COUDE DE REVISION PPS 87° Ø 80 mm (GRIS)","DY877",40,null,"/","/","/",3661238102026,0.24,190,195,145,"C0"]
[84887563,"T PPS AVEC COUVERCLE D'INSPECTION","DY163",57,null,"/","/","/",3661238013353,0.39,290,220,170,"C0"]
[84887551,"COLLIER DE CENTRAGE Ø 80mm (2 PIECES)","DY151",13,null,"/","/","/",3661238013452,0.1,300,300,40,"C0"]
[84887546,"PIÈCE DE VISITE Ø 80 mm droite","DY146",57,null,"/","/","/",3661238013506,0.28999999999999998,300,145,150,"C0"]
[84887757,"PLAQUE DE FINITION Ø80mm","DY757",40,null,"/","/","/",3661238011595,0.46,310,230,150,"C0"]
[84887753,"TUYAU DE PROTECTION L500mm Ø124mm","DY753",24,null,"/","/","/",3661238011632,0.8,505,155,150,"C0"]
[null,"PPS Ø 80/125 mm"]
[100002733,"TERMINAL VERTICAL PPS Ø 80/125 mm ROUGE","DY844",151,null,"/","/","/",3661238006614,4.2,1210,265,240,"C0"]
[84887758,"PLAQUE DE FINITION Ø125mm","DY758",63,null,"/","/","/",3661238011588,0.52,310,235,145,"C0"]
[84887763,"TUYAU DE PROTECTION L500mm Ø141mm","DY763",29,null,"/","/","/",3661238011533,0.98,500,155,150,"C0"]
[84887524,"PIECE D'INSPECTION DROITE ALU/PPS Ø 80/125 mm","DY124",108,null,"/","/","/",3661238013704,0.55000000000000004,300,145,150,"C0"]
[84887525,"T D'INSPECTION ALU/PPS Ø 80/125 mm","DY125",124,null,"/","/","/",3661238013698,0.82,315,235,150,"C0"]
[84887526,"RALLONGE CONCENTRIQUE ALU/PPS  80/125 L= 250 mm","DY126",40,null,"/","/","/",3661238013681,0.47,255,145,150,"C0"]
[84887527,"RALLONGE CONCENTRIQUE ALU/PPS 80/125 L= 500mm","DY127",46,null,"/","/","/",3661238013674,0.9,520,140,140,"C0"]
[84887528,"RALLONGECONCENTRIQUE ALU/PPS 80/125 L=1000 mm","DY128",68,null,"/","/","/",3661238013667,1.7,1010,135,140,"C0"]
[84887529,"RALLONGE CONCENTRIQUE ALU/PPS 80/125 L=1950 mm","DY129",118,null,"/","/","/",3661238013650,3.5,1960,150,150,"C0"]
[84887531,"COUDE A 87° ALU/PPS  Ø 80/125 mm","DY131",50,null,"/","/","/",3661238013636,0.66,200,200,150,"C0"]
[84887532,"COUDE CONCENTRIQUE 45° ALU/PPS Ø 80/125 mm (2 PCES)","DY132",76,null,"/","/","/",3661238013629,1,315,235,150,"C0"]
[100008311,"COUDE DE REVISION ALU/PPS Ø 80/125 mm","DY875",113,null,"/","/","/",3661238101920,0.68,195,195,145,"C0"]
[null,"FLEXIBLE PPS Ø 80 mm"]
[100015325,"KIT N° 1 RACCORDEMENT CHEMINÉE FLEXIBLE PPS Ø 80 mm","DY895",231,null,"/","/","/",3661238380110,2.87,395,395,380,"C0"]
[100015327,"TUBE FLEXIBLE LG=12,5M","DY897",347,null,"/","/","/",3661238380134,8.6999999999999993,1200,1220,250,"C0"]
[100015326,"TUBE FLEXIBLE LG=50M","DY896",1216,null,"/","/","/",3661238380127,35,1600,1660,410,"C0"]
[84887618,"ETOILE DE CENTRAGE POUR FLEXIBLE Ø 80  mm (2 PIÈCES)","DY618",36,null,"/","/","/",3661238012912,0.2,300,300,70,"C0"]
[100015328,"PIÈCE DE COUPLAGE FLEXIBLE Ø 80 mm","DY898",70,null,"/","/","/",3661238380141,0.25,150,150,150,"C0"]
[100015331,"OUTIL D'AIDE À L'INSERTION Ø 80 mm","DY901",174,null,"/","/","/",3661238380172,1.4,300,210,185,"C0"]
[100015330,"PIÈCE D'INSPECTION POUR TUBE FLEXIBLE","DY900",125,null,"/","/","/",3661238380165,0.5,295,140,140,"C0"]
[100015329,"TERMINAL AVEC SOLIN FLEX. Ø 80 mm","DY899",174,null,"/","/","/",3661238380158,1.74,385,385,250,"C0"]
[]
[null,"ACCESSOIRES"]
[100005002,"PANIER DE PROTECTION INOX  Ø 80/125","DY865",172,null,"/","/","/",3661238001886,2.59,275,270,270,"C0"]
[84887411,"SORTIE HORIZONTALE TOIT PENTE DE 30° A 45° ( uniquement pour tuiles mécaniques)","DY11",175,null,"/","/","/",3661238013940,3.57,1020,700,370,"C0"]
[84837729,"SORTIE DE TOIT EN PENTE DE 40° A 60° ( uniquement pour tuiles mécaniques)","CX49",175,null,"/","/","/",3661238014367,3.5,920,700,320,"C0"]
[84837731,"EMBASE D'ETANCHE TOIT PLAT","CX51",42,null,"/","/","/",3661238014343,0.5,400,400,155,"C0"]
[84837121,"TUILE A DOUILLE 5 A 25 NOIRE","CX121",110,null,"/","/","/",3661238014428,2.96,510,250,145,"C0"]
[84837732,"TUILE A DOUILLE 25 A 35' NOIRE","CX52",76,null,"/","/","/",3661238014336,3,520,250,145,"C0"]
[84837734,"TUILE A DOUILLE 35 A 55° NOIRE ","CX63",95,null,"/","/","/",3661238014312,3.17,510,265,180,"C0"]
[84837120,"TUILE A DOUILLE 5 A 25° ROUGE","CX120",110,null,"/","/","/",3661238014435,3.02,515,245,145,"C0"]
[84837783,"TUILE A DOUILLE 25 A 35 ROUGE","CX83",76,null,"/","/","/",3661238014213,3,515,250,150,"C0"]
[84837784,"TUILE A DOUILLE 35 A 55 ROUGE","CX84",95,null,"/","/","/",3661238014206,2.95,520,265,180,"C0"]
[84837741,"PLATINE DE FINITION INTER","CX72",16,null,"/","/","/",3661238014251,0.54,245,210,3,"C0"]
[84837779,"COLLIER DE FIXATION D.125 mm PATTE LONGUE","CX79",14,null,"/","/","/",3661238014237,0.24,230,160,200,"C0"]
[84837118,"COLLIER DE FIXATION D.125 mm PATTE COURTE","CX118",11,null,"/","/","/",3661238014459,0.19,225,185,20,"C0"]
[84887551,"COLLIER DE CENTRAGE Ø 80 mm (2 PIECES)","DY151",13,null,"/","/","/",3661238013452,0.1,300,300,40,"C0"]
[84887566,"PANIER DE PROTECTION INOX","DY166",79,null,"/","/","/",3661238013339,1.38,220,210,200,"C0"]
[84837118,"COLLIER DE FIXATION Ø 125 MM PATTE COURTE","CX118",11,null,"/","/","/",3661238014459,0.19,225,185,20,"C0"]
[84887451,"COLLIER D'ETANCHEITE POUR MONTAGE EXTERIEUR","DY51",26,null,"/","/","/",3661238013841,0.15,150,130,60,"C0"]
[]
["FAMILLE:","CHAUDIERE AU  SOL  FIOUL CONDENSATION "]
[]
[]
[7633655,"FSCX 19",null,{"$f":"D3295+D3298","v":3955},null,"A système\n avec sonde extérieure","/","/",3661238637016,209.9,null,null,null,"D6"]
[7633656,"FSCX 24",null,{"$f":"D3296+D3298","v":4153},null,"A système\n avec sonde extérieure","/","/",3661238637023,237.9,null,null,null,"D6"]
[7633657,"FSCX 32",null,{"$f":"D3297+D3298","v":4498},null,"A système\n avec sonde extérieure","/","/",3661238637030,265.89999999999998,null,null,null,"D6"]
[null,null,null,null,null,null,null,null,null,null,null,null,null,"D6"]
[7633660,"FSCR 19",null,{"$f":"D3295+D3299","v":4251},null,"A système\n avec sonde extérieure","/","/",3661238637047,209.9,null,null,null,"D6"]
[7633661,"FSCR 24",null,{"$f":"D3296+D3299","v":4449},null,"A système\n avec sonde extérieure","/","/",3661238637054,237.9,null,null,null,"D6"]
[7633662,"FSCR 32",null,{"$f":"D3297+D3299","v":4794},null,"A système\n avec sonde extérieure","/","/",3661238637061,265.89999999999998,null,null,null,"D6"]
[]
["COMPOSANTS "]
[7624096,"FSC. 19","MY103",3806,null,"/","/","/",3661238617315,209,1220,750,1050,"D6"]
[7624118,"FSC. 24","MY108",4004,null,"/","/","/",3661238617322,237,1220,750,1050,"D6"]
[7624125,"FSC. 32","MY113",4349,null,"/","/","/",3661238617339,265,1220,750,1050,"D6"]
[7605717,"TABLEAU X OETROCOM 1 ","MY409",149,null,"/","/","/",3661238616264,0.9,400,200,100,"D6"]
[7605715,"TABLEAU R OETROCOM 2","MY410",445,null,"/","/","/",3661238616271,0.9,400,200,100,"D6"]
[]
[]
[7633665,"FVCX 19/EL110SL",null,{"$f":"D3308+D3310+D3311+D3312","v":4994},null,"A système\n avec sonde extérieure","B","XL",3661238637078,297.89999999999998,null,null,null,"D6"]
[7633666,"FVCX 24/EL110SL",null,{"$f":"D3309+D3310+D3311+D3312","v":5192},null,"A système\n avec sonde extérieure","B","XL",3661238637085,325.89999999999998,null,null,null,"D6"]
[7633667,"FVCR 19/EL110SL",null,{"$f":"D3308+D3310+D3311+D3313","v":5290},null,"A système\n avec sonde extérieure","B","XL",3661238637092,297.89999999999998,null,null,null,"D6"]
[7633668,"FVCR 24/EL110SL",null,{"$f":"D3309+D3310+D3311+D3313","v":5488},null,"A système\n avec sonde extérieure","B","XL",3661238637108,325.89999999999998,null,null,null,"D6"]
[]
["COMPOSANTS "]
[7624096,"FSC. 19","MY103",3806,null,"/","/","/",3661238617315,209,1220,750,1050,"D6"]
[7624118,"FSC. 24","MY108",4004,null,"/","/","/",3661238617322,237,1220,750,1050,"D6"]
[7609915,"BALLON EL110SL","ER590",742,null,"/","/","/",3661238608726,83,700,680,940,"D6"]
[7613103,"KIT DE LIAISON BALLON EL110SL","ER595",297,null,"/","/","/",3661238608115,5,860,250,135,"D6"]
[7605717,"TABLEAU X OETROCOM 1 ","MY409",149,null,"/","/","/",3661238616264,0.9,400,200,100,"D6"]
[7605715,"TABLEAU R OETROCOM 2","MY410",445,null,"/","/","/",3661238616271,0.9,400,200,100,"D6"]
[null,null,null,null,null,null,null,null,""]
[]
[7633669,"FVCX 19/EL160SL",null,{"$f":"D3324+D3327+D3328+D3329","v":5319},null,"A système\n avec sonde extérieure","B","XL",3661238637115,312.89999999999998,null,null,null,"D6"]
[7633670,"FVCX 24/EL160SL",null,{"$f":"D3325+D3327+D3328+D3329","v":5517},null,"A système\n avec sonde extérieure","B","XL",3661238637122,340.9,null,null,null,"D6"]
[7633671,"FVCX 32/EL160SL",null,{"$f":"D3326+D3327+D3328+D3329","v":5862},null,"A système\n avec sonde extérieure","B","XL",3661238637139,368.9,null,null,null,"D6"]
[7633672,"FVCR 19/EL160SL",null,{"$f":"D3324+D3327+D3328+D3330","v":5615},null,"A système\n avec sonde extérieure","B","XL",3661238637146,312.89999999999998,null,null,null,"D6"]
[7633673,"FVCR 24/EL160SL",null,{"$f":"D3325+D3327+D3328+D3330","v":5813},null,"A système\n avec sonde extérieure","B","XL",3661238637153,340.9,null,null,null,"D6"]
[7633674,"FVCR 32/EL160SL",null,{"$f":"D3326+D3327+D3328+D3330","v":6158},null,"A système\n avec sonde extérieure","B","XL",3661238637160,368.9,null,null,null,"D6"]
[]
["COMPOSANTS "]
[7624096,"FSC. 19","MY103",3806,null,"/","/","/",3661238617315,209,1220,750,1050,"D6"]
[7624118,"FSC. 24","MY108",4004,null,"/","/","/",3661238617322,237,1220,750,1050,"D6"]
[7624125,"FSC. 32","MY113",4349,null,"/","/","/",3661238617339,265,1220,750,1050,"D6"]
[7616405,"BALLON EL160SL","ER592",969,null,"/","/","/",3661238608696,98,700,680,1200,"D6"]
[7613082,"KIT DE LIAISON BALLON EL160SL","ER597",395,null,"/","/","/",3661238608139,5,860,250,135,"D6"]
[7605717,"TABLEAU X OETROCOM 1 ","MY409",149,null,"/","/","/",3661238616264,0.9,400,200,100,"D6"]
[7605715,"TABLEAU R OETROCOM 2","MY410",445,null,"/","/","/",3661238616271,0.9,400,200,100,"D6"]
[]
[]
[7633675,"FSCX 19 P",null,{"$f":"D3341+D3344+D3345","v":4425},null,"A système\n avec sonde extérieure","/","/",3661238637177,224.9,null,null,null,"D6"]
[7633676,"FSCX 24 P",null,{"$f":"D3342+D3344+D3345","v":4623},null,"A système\n avec sonde extérieure","/","/",3661238637177,252.9,null,null,null,"D6"]
[7633677,"FSCX 32 P",null,{"$f":"D3343+D3344+D3345","v":4968},null,"A système\n avec sonde extérieure","/","/",3661238637191,280.89999999999998,null,null,null,"D6"]
[7633678,"FSCR 19 P",null,{"$f":"D3341+D3344+D3346","v":4721},null,"A système\n avec sonde extérieure","/","/",3661238637207,224.9,null,null,null,"D6"]
[7633679,"FSCR 24 P",null,{"$f":"D3342+D3344+D3346","v":4919},null,"A système\n avec sonde extérieure","/","/",3661238637214,252.9,null,null,null,"D6"]
[7633680,"FSCR 32 P",null,{"$f":"D3343+D3344+D3346","v":5264},null,"A système\n avec sonde extérieure","/","/",3661238637221,280.89999999999998,null,null,null,"D6"]
[]
["COMPOSANTS "]
[7624096,"FSC. 19","MY103",3806,null,"/","/","/",3661238617315,209,1220,750,1050,"D6"]
[7624118,"FSC. 24","MY108",4004,null,"/","/","/",3661238617322,237,1220,750,1050,"D6"]
[7624125,"FSC. 32","MY113",4349,null,"/","/","/",3661238617339,265,1220,750,1050,"D6"]
[7616272,"KIT EQUIPEMENT HYDRAULIQUE","MY404",470,null,"/","/","/",3661238603097,15,675,485,180,"D6"]
[7605717,"TABLEAU X OETROCOM 1 ","MY409",149,null,"/","/","/",3661238616264,0.9,400,200,100,"D6"]
[7605715,"TABLEAU R OETROCOM 2","MY410",445,null,"/","/","/",3661238616271,0.9,400,200,100,"D6"]
[]
[]
[7633681,"FVCX 19 P/EL110SL",null,{"$f":"D3355+D3357+D3358+D3359+D3360","v":5385},null,"A système\n avec sonde extérieure","B","XL",3661238637238,312.89999999999998,null,null,null,"D6"]
[7633682,"FVCX 24 P/EL110SL",null,{"$f":"D3356+D3357+D3358+D3359+D3360","v":5583},null,"A système\n avec sonde extérieure","B","XL",3661238637245,340.9,null,null,null,"D6"]
[7633683,"FVCR 19 P/EL110SL",null,{"$f":"D3355+D3357+D3358+D3359+D3361","v":5681},null,"A système\n avec sonde extérieure","B","XL",3661238637252,312.89999999999998,null,null,null,"D6"]
[7633684,"FVCR 24 P/EL110SL",null,{"$f":"D3356+D3357+D3358+D3359+D3361","v":5879},null,"A système\n avec sonde extérieure","B","XL",3661238637269,340.9,null,null,null,"D6"]
[]
["COMPOSANTS "]
[7624096,"FSC. 19","MY103",3806,null,"/","/","/",3661238617315,209,1220,750,1050,"D6"]
[7624118,"FSC. 24","MY108",4004,null,"/","/","/",3661238617322,237,1220,750,1050,"D6"]
[7609915,"BALLON EL110SL","ER590",742,null,"/","/","/",3661238608726,83,700,680,940,"D6"]
[7614745,"KIT DE LIAISON BALLON EL110SL EQUIPEE","ER594",218,null,"/","/","/",3661238608122,5,860,250,135,"D6"]
[7616272,"KIT EQUIPEMENT HYDRAULIQUE","MY404",470,null,"/","/","/",3661238603097,15,675,485,180,"D6"]
[7605717,"TABLEAU X OETROCOM 1 ","MY409",149,null,"/","/","/",3661238616264,0.9,400,200,100,"D6"]
[7605715,"TABLEAU R OETROCOM 2","MY410",445,null,"/","/","/",3661238616271,0.9,400,200,100,"D6"]
[null,null,null,null,null,null,null,null,""]
[null,null,null,null,null,"A","B","XL"]
[7633685,"FVCX 19 P/EL160SL",null,{"$f":"D3372+D3375+D3376+D3377+D3378","v":5652},null,"A","B","XL",3661238637283,327.9,null,null,null,"D6"]
[7633686,"FVCX 24 P/EL160SL",null,{"$f":"D3373+D3375+D3376+D3377+D3378","v":5850},null,"A","B","XL",3661238637290,355.9,null,null,null,"D6"]
[7633687,"FVCX 32 P/EL160SL",null,{"$f":"D3374+D3375+D3376+D3377+D3378","v":6195},null,"A","B","XL",3661238637306,383.9,null,null,null,"D6"]
[7633688,"FVCR 19 P/EL160SL",null,{"$f":"D3372+D3375+D3376+D3377+D3379","v":5948},null,"A","B","XL",3661238637313,327.9,null,null,null,"D6"]
[7633689,"FVCR 24 P/EL160SL",null,{"$f":"D3373+D3375+D3376+D3377+D3379","v":6146},null,"A","B","XL",3661238637320,355.9,null,null,null,"D6"]
[7633690,"FVCR 32 P/EL160SL",null,{"$f":"D3374+D3375+D3376+D3377+D3379","v":6491},null,"A","B","XL",3661238637337,383.9,null,null,null,"D6"]
[]
["COMPOSANTS "]
[7624096,"FSC. 19","MY103",3806,null,"/","/","/",3661238617315,209,1220,750,1050,"D6"]
[7624118,"FSC. 24","MY108",4004,null,"/","/","/",3661238617322,237,1220,750,1050,"D6"]
[7624125,"FSC. 32","MY113",4349,null,"/","/","/",3661238617339,265,1220,750,1050,"D6"]
[7616405,"BALLON EL160SL","ER592",969,null,"/","/","/",3661238608696,98,700,680,1200,"D6"]
[7614827,"KIT DE LIAISON BALLON EL160SL EQUIPEE","ER596",258,null,"/","/","/",3661238608146,5,860,250,135,"D6"]
[7616272,"KIT EQUIPEMENT HYDRAULIQUE","MY404",470,null,"/","/","/",3661238603097,15,675,485,180,"D6"]
[7605717,"TABLEAU X OETROCOM 1 ","MY409",149,null,"/","/","/",3661238616264,0.9,400,200,100,"D6"]
[7605715,"TABLEAU R OETROCOM 2","MY410",445,null,"/","/","/",3661238616271,0.9,400,200,100,"D6"]
[]
[]
[7633691,"FSCX 19 F HOR",null,{"$f":"D3396+D3399+D3401+D3402","v":4152},null,"A système\n avec sonde extérieure","/","/",3661238637344,213.9,null,null,null,"D6"]
[7633692,"FSCX 19 F VER",null,{"$f":"D3396+D3399+D3401+D3403+D3404","v":4256},null,"A système\n avec sonde extérieure","/","/",3661238637351,216.7,null,null,null,"D6"]
[7633693,"FSCX 24 F HOR",null,{"$f":"D3397+D3399+D3401+D3402","v":4350},null,"A système\n avec sonde extérieure","/","/",3661238637368,241.9,null,null,null,"D6"]
[7633694,"FSCX 24 F VER",null,{"$f":"D3397+D3399+D3401+D3403+D3404","v":4454},null,"A système\n avec sonde extérieure","/","/",3661238637375,244.7,null,null,null,"D6"]
[7633695,"FSCX 32 F HOR",null,{"$f":"D3398+D3399+D3401+D3402","v":4695},null,"A système\n avec sonde extérieure","/","/",3661238637382,269.89999999999998,null,null,null,"D6"]
[7633696,"FSCX 32 F VER",null,{"$f":"D3398+D3399+D3401+D3403+D3404","v":4799},null,"A système\n avec sonde extérieure","/","/",3661238637399,272.69999999999993,null,null,null,"D6"]
[7633697,"FSCR 19 F HOR",null,{"$f":"D3396+D3400+D3401+D3402","v":4448},null,"A système\n avec sonde extérieure","/","/",3661238637405,213.9,null,null,null,"D6"]
[7633698,"FSCR 19 F VER",null,{"$f":"D3396+D3400+D3401+D3403+D3404","v":4552},null,"A système\n avec sonde extérieure","/","/",3661238637412,216.7,null,null,null,"D6"]
[7633699,"FSCR 24 F HOR",null,{"$f":"D3397+D3400+D3401+D3402","v":4646},null,"A système\n avec sonde extérieure","/","/",3661238637429,241.9,null,null,null,"D6"]
[7633700,"FSCR 24 F VER",null,{"$f":"D3397+D3400+D3401+D3403+D3404","v":4750},null,"A système\n avec sonde extérieure","/","/",3661238637436,244.7,null,null,null,"D6"]
[7633701,"FSCR 32 F HOR",null,{"$f":"D3398+D3400+D3401+D3402","v":4991},null,"A système\n avec sonde extérieure","/","/",3661238637443,269.89999999999998,null,null,null,"D6"]
[7633702,"FSCR 32 F VER",null,{"$f":"D3398+D3400+D3401+D3403+D3404","v":5095},null,"A système\n avec sonde extérieure","/","/",3661238637450,272.69999999999993,null,null,null,"D6"]
[]
["COMPOSANTS "]
[7624096,"FSC. 19","MY103",3806,null,"/","/","/",3661238617315,209,1220,750,1050,"D6"]
[7624118,"FSC. 24","MY108",4004,null,"/","/","/",3661238617322,237,1220,750,1050,"D6"]
[7624125,"FSC. 32","MY113",4349,null,"/","/","/",3661238617339,265,1220,750,1050,"D6"]
[7605717,"TABLEAU X OETROCOM 1 ","MY409",149,null,"/","/","/",3661238616264,0.9,400,200,100,"D6"]
[7605715,"TABLEAU R OETROCOM 2","MY410",445,null,"/","/","/",3661238616271,0.9,400,200,100,"D6"]
[7605520,"KIT FLUX FORCE FSC.","MY405",99,null,"/","/","/",3661238604179,1.9,510,460,175,"D6"]
[100007638,"TERMINAL HORIZONTAL  Ø 80/125","FM183",98,null,"/","/","/",3661238157972,2.1,1025,170,170,"D6"]
[100002732,"TERMINAL VERTICAL PPS Ø 80/125 MM NOIR","DY843",152,null,"/","/","/",3661238006621,4.2,1210,270,240,"D6"]
[84887531,"COUDE A 87° ALU/PPS  Ø 80/125 MM","DY131",50,null,"/","/","/",3661238013636,0.7,200,200,150,"D6"]
[]
[]
[7633703,"FVCX 19 F HOR/EL110SL",null,{"$f":"D3417+D3419+D3420+D3421+D3423+D3424","v":5191},null,"A système\n avec sonde extérieure","B","XL",3661238637467,301.89999999999998,null,null,null,"D6"]
[7633704,"FVCX 19 F VER/EL110SL",null,{"$f":"D3417+D3419+D3420+D3421+D3423+D3425+D3426","v":5295},null,"A système\n avec sonde extérieure","B","XL",3661238637474,304.69999999999993,null,null,null,"D6"]
[7633705,"FVCX 24 F HOR/EL110SL",null,{"$f":"D3418+D3419+D3420+D3421+D3423+D3424","v":5389},null,"A système\n avec sonde extérieure","B","XL",3661238637481,329.9,null,null,null,"D6"]
[7633706,"FVCX 24 F VER/EL110SL",null,{"$f":"D3418+D3419+D3420+D3421+D3423+D3425+D3426","v":5493},null,"A système\n avec sonde extérieure","B","XL",3661238637498,332.69999999999993,null,null,null,"D6"]
[7633707,"FVCR 19 F HOR/EL110SL",null,{"$f":"D3417+D3419+D3420+D3422+D3423+D3424","v":5487},null,"A système\n avec sonde extérieure","B","XL",3661238637504,301.89999999999998,null,null,null,"D6"]
[7633708,"FVCR 19 F VER/EL110SL",null,{"$f":"D3417+D3419+D3420+D3422+D3423+D3425+D3426","v":5591},null,"A système\n avec sonde extérieure","B","XL",3661238637511,304.69999999999993,null,null,null,"D6"]
[7633709,"FVCR 24 F HOR/EL110SL",null,{"$f":"D3418+D3419+D3420+D3422+D3423+D3424","v":5685},null,"A système\n avec sonde extérieure","B","XL",3661238637528,329.9,null,null,null,"D6"]
[7633710,"FVCR 24 F VER/EL110SL",null,{"$f":"D3418+D3419+D3420+D3422+D3423+D3425+D3426","v":5789},null,"A système\n avec sonde extérieure","B","XL",3661238637535,332.69999999999993,null,null,null,"D6"]
[]
["COMPOSANTS "]
[7624096,"FSC. 19","MY103",3806,null,"/","/","/",3661238617315,209,1220,750,1050,"D6"]
[7624118,"FSC. 24","MY108",4004,null,"/","/","/",3661238617322,237,1220,750,1050,"D6"]
[7609915,"BALLON EL110SL","ER590",742,null,"/","/","/",3661238608726,83,700,680,940,"D6"]
[7613103,"KIT DE LIAISON BALLON EL110SL","ER595",297,null,"/","/","/",3661238608115,5,860,250,135,"D6"]
[7605717,"TABLEAU X OETROCOM 1 ","MY409",149,null,"/","/","/",3661238616264,0.9,400,200,100,"D6"]
[7605715,"TABLEAU R OETROCOM 2","MY410",445,null,"/","/","/",3661238616271,0.9,400,200,100,"D6"]
[7605520,"KIT FLUX FORCE FSC.","MY405",99,null,"/","/","/",3661238604179,1.9,510,460,175,"D6"]
[100007638,"TERMINAL HORIZONTAL  Ø 80/125","FM183",98,null,"/","/","/",3661238157972,2.1,1025,170,170,"D6"]
[100002732,"TERMINAL VERTICAL PPS Ø 80/125 MM NOIR","DY843",152,null,"/","/","/",3661238006621,4.2,1210,270,240,"D6"]
[84887531,"COUDE A 87° ALU/PPS  Ø 80/125 MM","DY131",50,null,"/","/","/",3661238013636,0.7,200,200,150,"D6"]
[null,null,null,null,null,null,null,null,""]
[]
[7633712,"FVCX 19 F HOR/EL160SL",null,{"$f":"D3443+D3446+D3447+D3448+D3450+D3451","v":5516},null,"A système\n avec sonde extérieure","B","XL",3661238637542,316.89999999999998,null,null,null,"D6"]
[7633713,"FVCX 19 F VER/EL160SL",null,{"$f":"D3443+D3446+D3447+D3448+D3450+D3452+D3453","v":5620},null,"A système\n avec sonde extérieure","B","XL",3661238637559,319.69999999999993,null,null,null,"D6"]
[7633714,"FVCX 24 F HOR/EL160SL",null,{"$f":"D3444+D3446+D3447+D3448+D3450+D3451","v":5714},null,"A système\n avec sonde extérieure","B","XL",3661238637566,344.9,null,null,null,"D6"]
[7633715,"FVCX 24 F VER/EL160SL",null,{"$f":"D3444+D3446+D3447+D3448+D3450+D3452+D3453","v":5818},null,"A système\n avec sonde extérieure","B","XL",3661238637573,347.69999999999993,null,null,null,"D6"]
[7633716,"FVCX 32 F HOR/EL160SL",null,{"$f":"D3445+D3446+D3447+D3448+D3450+D3451","v":6059},null,"A système\n avec sonde extérieure","B","XL",3661238637580,372.9,null,null,null,"D6"]
[7633717,"FVCX 32 F VER/EL160SL",null,{"$f":"D3445+D3446+D3447+D3448+D3450+D3452+D3453","v":6163},null,"A système\n avec sonde extérieure","B","XL",3661238637597,375.69999999999993,null,null,null,"D6"]
[7633718,"FVCR 19 F HOR/EL160SL",null,{"$f":"D3443+D3446+D3447+D3449+D3450+D3451","v":5812},null,"A système\n avec sonde extérieure","B","XL",3661238637603,316.89999999999998,null,null,null,"D6"]
[7633719,"FVCR 19 F VER/EL160SL",null,{"$f":"D3443+D3446+D3447+D3449+D3450+D3452+D3453","v":5916},null,"A système\n avec sonde extérieure","B","XL",3661238637610,319.69999999999993,null,null,null,"D6"]
[7633721,"FVCR 24 F HOR/EL160SL",null,{"$f":"D3444+D3446+D3447+D3449+D3450+D3451","v":6010},null,"A système\n avec sonde extérieure","B","XL",3661238637627,344.9,null,null,null,"D6"]
[7633722,"FVCR 24 F VER/EL160SL",null,{"$f":"D3444+D3446+D3447+D3449+D3450+D3452+D3453","v":6114},null,"A système\n avec sonde extérieure","B","XL",3661238637634,347.69999999999993,null,null,null,"D6"]
[7633723,"FVCR 32 F HOR/EL160SL",null,{"$f":"D3445+D3446+D3447+D3449+D3450+D3451","v":6355},null,"A système\n avec sonde extérieure","B","XL",3661238637641,372.9,null,null,null,"D6"]
[7633725,"FVCR 32 F VER/EL160SL",null,{"$f":"D3445+D3446+D3447+D3449+D3450+D3452+D3453","v":6459},null,"A système\n avec sonde extérieure","B","XL",3661238637658,375.69999999999993,null,null,null,"D6"]
[]
["COMPOSANTS "]
[7624096,"FSC. 19","MY103",3806,null,"/","/","/",3661238617315,209,1220,750,1050,"D6"]
[7624118,"FSC. 24","MY108",4004,null,"/","/","/",3661238617322,237,1220,750,1050,"D6"]
[7624125,"FSC. 32","MY113",4349,null,"/","/","/",3661238617339,265,1220,750,1050,"D6"]
[7616405,"BALLON EL160SL","ER592",969,null,"/","/","/",3661238608696,98,700,680,1200,"D6"]
[7613082,"KIT DE LIAISON BALLON EL160SL","ER597",395,null,"/","/","/",3661238608139,5,860,250,135,"D6"]
[7605717,"TABLEAU X OETROCOM 1 ","MY409",149,null,"/","/","/",3661238616264,0.9,400,200,100,"D6"]
[7605715,"TABLEAU R OETROCOM 2","MY410",445,null,"/","/","/",3661238616271,0.9,400,200,100,"D6"]
[7605520,"KIT FLUX FORCE FSC.","MY405",99,null,"/","/","/",3661238604179,1.9,510,460,175,"D6"]
[100007638,"TERMINAL HORIZONTAL  Ø 80/125","FM183",98,null,"/","/","/",3661238157972,2.1,1025,170,170,"C0"]
[100002732,"TERMINAL VERTICAL PPS Ø 80/125 MM NOIR","DY843",152,null,"/","/","/",3661238006621,4.2,1210,270,240,"C0"]
[84887531,"COUDE A 87° ALU/PPS  Ø 80/125 MM","DY131",50,null,"/","/","/",3661238013636,0.7,200,200,150,"C0"]
[]
[]
[7633728,"FSCX 19 PF HOR",null,{"$f":"D3470+D3473+D3474+D3476+D3477","v":4622},null,"A système\n avec sonde extérieure","/","/",3661238637665,228.9,null,null,null,"D6"]
[7633729,"FSCX 19 PF VER",null,{"$f":"D3470+D3473+D3474+D3476+D3478+D3479","v":4726},null,"A système\n avec sonde extérieure","/","/",3661238637672,231.7,null,null,null,"D6"]
[7633730,"FSCX 24 PF HOR",null,{"$f":"D3471+D3473+D3474+D3476+D3477","v":4820},null,"A système\n avec sonde extérieure","/","/",3661238637689,256.90000000000003,null,null,null,"D6"]
[7633731,"FSCX 24 PF VER",null,{"$f":"D3471+D3473+D3474+D3476+D3478+D3479","v":4924},null,"A système\n avec sonde extérieure","/","/",3661238637696,259.7,null,null,null,"D6"]
[7633732,"FSCX 32 PF HOR",null,{"$f":"D3472+D3473+D3474+D3476+D3477","v":5165},null,"A système\n avec sonde extérieure","/","/",3661238637702,284.89999999999998,null,null,null,"D6"]
[7633733,"FSCX 32 PF VER",null,{"$f":"D3472+D3473+D3474+D3476+D3478+D3479","v":5269},null,"A système\n avec sonde extérieure","/","/",3661238637719,287.69999999999993,null,null,null,"D6"]
[7633734,"FSCR 19 PF HOR",null,{"$f":"D3470+D3473+D3475+D3476+D3477","v":4918},null,"A système\n avec sonde extérieure","/","/",3661238637726,228.9,null,null,null,"D6"]
[7633735,"FSCR 19 PF VER",null,{"$f":"D3470+D3473+D3475+D3476+D3478+D3479","v":5022},null,"A système\n avec sonde extérieure","/","/",3661238637733,231.7,null,null,null,"D6"]
[7633736,"FSCR 24 PF HOR",null,{"$f":"D3471+D3473+D3475+D3476+D3477","v":5116},null,"A système\n avec sonde extérieure","/","/",3661238637740,256.90000000000003,null,null,null,"D6"]
[7633737,"FSCR 24 PF VER",null,{"$f":"D3471+D3473+D3475+D3476+D3478+D3479","v":5220},null,"A système\n avec sonde extérieure","/","/",3661238637757,259.7,null,null,null,"D6"]
[7633738,"FSCR 32 PF HOR",null,{"$f":"D3472+D3473+D3475+D3476+D3477","v":5461},null,"A système\n avec sonde extérieure","/","/",3661238637764,284.89999999999998,null,null,null,"D6"]
[7633739,"FSCR 32 PF VER",null,{"$f":"D3472+D3473+D3475+D3476+D3478+D3479","v":5565},null,"A système\n avec sonde extérieure","/","/",3661238637771,287.69999999999993,null,null,null,"D6"]
[]
["COMPOSANTS "]
[7624096,"FSC. 19","MY103",3806,null,"/","/","/",3661238617315,209,1220,750,1050,"D6"]
[7624118,"FSC. 24","MY108",4004,null,"/","/","/",3661238617322,237,1220,750,1050,"D6"]
[7624125,"FSC. 32","MY113",4349,null,"/","/","/",3661238617339,265,1220,750,1050,"D6"]
[7616272,"KIT EQUIPEMENT HYDRAULIQUE","MY404",470,null,"/","/","/",3661238603097,15,675,485,180,"D6"]
[7605717,"TABLEAU X OETROCOM 1 ","MY409",149,null,"/","/","/",3661238616264,0.9,400,200,100,"D6"]
[7605715,"TABLEAU R OETROCOM 2","MY410",445,null,"/","/","/",3661238616271,0.9,400,200,100,"D6"]
[7605520,"KIT FLUX FORCE FSC.","MY405",99,null,"/","/","/",3661238604179,1.9,510,460,175,"D6"]
[100007638,"TERMINAL HORIZONTAL  Ø 80/125","FM183",98,null,"/","/","/",3661238157972,2.1,1025,170,170,"C0"]
[100002732,"TERMINAL VERTICAL PPS Ø 80/125 MM NOIR","DY843",152,null,"/","/","/",3661238006621,4.2,1210,270,240,"C0"]
[84887531,"COUDE A 87° ALU/PPS  Ø 80/125 MM","DY131",50,null,"/","/","/",3661238013636,0.7,200,200,150,"C0"]
[]
[]
[7633740,"FVCX 19 PF HOR/EL110SL",null,{"$f":"D3492+D3494+D3495+D3496+D3497+D3499+D3500","v":5582},null,"A système\n avec sonde extérieure","B","XL",3661238637788,316.89999999999998,null,null,null,"D6"]
[7633741,"FVCX 19 PF VER/EL110SL",null,{"$f":"D3492+D3494+D3495+D3496+D3497+D3499+D3501+D3502","v":5686},null,"A système\n avec sonde extérieure","B","XL",3661238637795,319.69999999999993,null,null,null,"D6"]
[7633742,"FVCX 24 PF HOR/EL110SL",null,{"$f":"D3493+D3494+D3495+D3496+D3497+D3499+D3500","v":5780},null,"A système\n avec sonde extérieure","B","XL",3661238637801,344.9,null,null,null,"D6"]
[7633743,"FVCX 24 PF VER/EL110SL",null,{"$f":"D3493+D3494+D3495+D3496+D3497+D3499+D3501+D3502","v":5884},null,"A système\n avec sonde extérieure","B","XL",3661238637818,347.69999999999993,null,null,null,"D6"]
[7633744,"FVCR 19 PF HOR/EL110SL",null,{"$f":"D3492+D3494+D3495+D3496+D3498+D3499+D3500","v":5878},null,"A système\n avec sonde extérieure","B","XL",3661238637825,316.89999999999998,null,null,null,"D6"]
[7633745,"FVCR 19 PF VER/EL110SL",null,{"$f":"D3492+D3494+D3495+D3496+D3498+D3499+D3501+D3502","v":5982},null,"A système\n avec sonde extérieure","B","XL",3661238637832,319.69999999999993,null,null,null,"D6"]
[7633746,"FVCR 24 PF HOR/EL110SL",null,{"$f":"D3493+D3494+D3495+D3496+D3498+D3499+D3500","v":6076},null,"A système\n avec sonde extérieure","B","XL",3661238637849,344.9,null,null,null,"D6"]
[7633747,"FVCR 24 PF VER/EL110SL",null,{"$f":"D3493+D3494+D3495+D3496+D3498+D3499+D3501+D3502","v":6180},null,"A système\n avec sonde extérieure","B","XL",3661238637856,347.69999999999993,null,null,null,"D6"]
[]
["COMPOSANTS "]
[7624096,"FSC. 19","MY103",3806,null,"/","/","/",3661238617315,209,1220,750,1050,"D6"]
[7624118,"FSC. 24","MY108",4004,null,"/","/","/",3661238617322,237,1220,750,1050,"D6"]
[7609915,"BALLON EL110SL","ER590",742,null,"/","/","/",3661238608726,83,700,680,940,"D6"]
[7614745,"KIT DE LIAISON BALLON EL110SL EQUIPEE","ER594",218,null,"/","/","/",3661238608122,5,860,250,135,"D6"]
[7616272,"KIT EQUIPEMENT HYDRAULIQUE","MY404",470,null,"/","/","/",3661238603097,15,675,485,180,"D6"]
[7605717,"TABLEAU X OETROCOM 1 ","MY409",149,null,"/","/","/",3661238616264,0.9,400,200,100,"D6"]
[7605715,"TABLEAU R OETROCOM 2","MY410",445,null,"/","/","/",3661238616271,0.9,400,200,100,"D6"]
[7605520,"KIT FLUX FORCE FSC.","MY405",99,null,"/","/","/",3661238604179,1.9,510,460,175,"D6"]
[100007638,"TERMINAL HORIZONTAL  Ø 80/125","FM183",98,null,"/","/","/",3661238157972,2.1,1025,170,170,"C0"]
[100002732,"TERMINAL VERTICAL PPS Ø 80/125 MM NOIR","DY843",152,null,"/","/","/",3661238006621,4.2,1210,270,240,"C0"]
[84887531,"COUDE A 87° ALU/PPS  Ø 80/125 MM","DY131",50,null,"/","/","/",3661238013636,0.7,200,200,150,"C0"]
[null,null,null,null,null,null,null,null,"",null,null,null,null,{"$error":"#N/A"}]
[null,null,null,null,null,null,null,null,null,null,null,null,null,{"$error":"#N/A"}]
[7633748,"FVCX 19 PF HOR/EL160SL",null,{"$f":"D3519+D3522+D3523+D3524+D3525+D3527+D3528","v":5849},null,"A système\n avec sonde extérieure","B","XL",3661238637863,331.9,null,null,null,"D6"]
[7633749,"FVCX 19 PF VER/EL160SL",null,{"$f":"D3519+D3522+D3523+D3524+D3525+D3527+D3529+D3530","v":5953},null,"A système\n avec sonde extérieure","B","XL",3661238637870,334.69999999999993,null,null,null,"D6"]
[7633750,"FVCX 24 PF HOR/EL160SL",null,{"$f":"D3520+D3522+D3523+D3524+D3525+D3527+D3528","v":6047},null,"A système\n avec sonde extérieure","B","XL",3661238637887,359.9,null,null,null,"D6"]
[7633751,"FVCX 24 PF VER/EL160SL",null,{"$f":"D3520+D3522+D3523+D3524+D3525+D3527+D3529+D3530","v":6151},null,"A système\n avec sonde extérieure","B","XL",3661238637894,362.69999999999993,null,null,null,"D6"]
[7633752,"FVCX 32 PF HOR/EL160SL",null,{"$f":"D3521+D3522+D3523+D3524+D3525+D3527+D3528","v":6392},null,"A système\n avec sonde extérieure","B","XL",3661238637900,387.9,null,null,null,"D6"]
[7633753,"FVCX 32 PF VER/EL160SL",null,{"$f":"D3521+D3522+D3523+D3524+D3525+D3527+D3529+D3530","v":6496},null,"A système\n avec sonde extérieure","B","XL",3661238637917,390.69999999999993,null,null,null,"D6"]
[7633754,"FVCR 19 PF HOR/EL160SL",null,{"$f":"D3519+D3522+D3523+D3524+D3526+D3527+D3528","v":6145},null,"A système\n avec sonde extérieure","B","XL",3661238637924,331.9,null,null,null,"D6"]
[7633755,"FVCR 19 PF VER/EL160SL",null,{"$f":"D3519+D3522+D3523+D3524+D3526+D3527+D3529+D3530","v":6249},null,"A système\n avec sonde extérieure","B","XL",3661238637924,334.69999999999993,null,null,null,"D6"]
[7633756,"FVCR 24 PF HOR/EL160SL",null,{"$f":"D3520+D3522+D3523+D3524+D3526+D3527+D3528","v":6343},null,"A système\n avec sonde extérieure","B","XL",3661238637948,359.9,null,null,null,"D6"]
[7633757,"FVCR 24 PF VER/EL160SL",null,{"$f":"D3520+D3522+D3523+D3524+D3526+D3527+D3529+D3530","v":6447},null,"A système\n avec sonde extérieure","B","XL",3661238637955,362.69999999999993,null,null,null,"D6"]
[7633758,"FVCR 32 PF HOR/EL160SL",null,{"$f":"D3521+D3522+D3523+D3524+D3526+D3527+D3528","v":6688},null,"A système\n avec sonde extérieure","B","XL",3661238637962,387.9,null,null,null,"D6"]
[7633759,"FVCR 32 PF VER/EL160SL",null,{"$f":"D3521+D3522+D3523+D3524+D3526+D3527+D3529+D3530","v":6792},null,"A système\n avec sonde extérieure","B","XL",3661238637979,390.69999999999993,null,null,null,"D6"]
[]
["COMPOSANTS "]
[7624096,"FSC. 19","MY103",3806,null,"/","/","/",3661238617315,209,1220,750,1050,"D6"]
[7624118,"FSC. 24","MY108",4004,null,"/","/","/",3661238617322,237,1220,750,1050,"D6"]
[7624125,"FSC. 32","MY113",4349,null,"/","/","/",3661238617339,265,1220,750,1050,"D6"]
[7616405,"BALLON EL160SL","ER592",969,null,"/","/","/",3661238608696,98,700,680,1200,"D6"]
[7614827,"KIT DE LIAISON BALLON EL160SL EQUIPEE","ER596",258,null,"/","/","/",3661238608146,5,860,250,135,"D6"]
[7616272,"KIT EQUIPEMENT HYDRAULIQUE","MY404",470,null,"/","/","/",3661238603097,15,675,485,180,"D6"]
[7605717,"TABLEAU X OETROCOM 1 ","MY409",149,null,"/","/","/",3661238616264,0.9,400,200,100,"D6"]
[7605715,"TABLEAU R OETROCOM 2","MY410",445,null,"/","/","/",3661238616271,0.9,400,200,100,"D6"]
[7605520,"KIT FLUX FORCE FSC.","MY405",99,null,"/","/","/",3661238604179,1.9,510,460,175,"D6"]
[100007638,"TERMINAL HORIZONTAL  Ø 80/125","FM183",98,null,"/","/","/",3661238157972,2.1,1025,170,170,"C0"]
[100002732,"TERMINAL VERTICAL PPS Ø 80/125 MM NOIR","DY843",152,null,"/","/","/",3661238006621,4.2,1210,270,240,"C0"]
[84887531,"COUDE A 87° ALU/PPS  Ø 80/125 MM","DY131",50,null,"/","/","/",3661238013636,0.7,200,200,150,"C0"]
[null,null,null,null,null,null,null,null,""]
[]
["OPTIONS CHAUDIERE"]
[100004290,"STATION DE NEUTRALISATION","FM155",254,null,"/","/","/",3661238004238,7.8,490,320,185,"C0"]
[100004291,"RECHARGE STATION DE NEUTRALISATION","FM156",127,null,"/","/","/",3661238004221,6.1,405,265,165,"C0"]
[100004292,"SUPPORT STATION DE NEUTRALISATION","FM157",127,null,"/","/","/",3661238004214,2,395,330,120,"C0"]
[100004293,"POMPE DE RELEVAGE DES CONDENSATS","FM158",336,0.17,"/","/","/",3661238004207,1.9,230,115,110,"C0"]
[100012500,"FILTRE DEGAZEUR TIGERLOOP COMBI",null,133,null,"/","/","/",null,null,null,null,null,"C0"]
[100020045,"KIT FILTRE FERNOX TF1",null,253,null,"/","/","/",null,null,null,null,null,"C0"]
[]
["OPTIONS POUR TABLEAU X OETROCOM 1 "]
[88017904,"THERMOSTAT AMBIANCE PROGRAMMABLE","AD191",158,0.08,"/","/","/",3661238102415,0.2,130,90,55,"C0"]
[88017010,"THERMOSTAT D'AMBIANCE PROGRAMMABLE (SANS FILS)","AD192",280,0.08,"/","/","/",3661238102439,0.4,175,150,90,"C0"]
[7609765,"THERMOSTAT D'AMBIANCE MODULANT FILAIRE RS200 -3","AD306",202,0.08,"/","/","/",8713809266462,0.4,148,100,52,"C0"]
[7609764,"THERMOSTAT D'AMBIANCE MODULANT RADIO RS200 -3R","AD305",333,0.08,"/","/","/",8713809266455,0.8,150,110,110,"C0"]
[]
["OPTIONS POUR TABLEAU R OETROCOM 2"]
[7616602,"PLATINE + SONDE POUR 1 CIRCUIT AVEC VANNE MELANGEUSE","MY420",255,0.01,"/","/","/",3661238625747,0.5,305,215,100,"D6"]
[88017904,"THERMOSTAT AMBIANCE PROGRAMMABLE","AD191",158,0.08,"/","/","/",3661238102415,0.2,130,90,55,"C0"]
[88017010,"THERMOSTAT D'AMBIANCE PROGRAMMABLE (SANS FILS)","AD192",280,0.08,"/","/","/",3661238102439,0.4,175,150,90,"C0"]
[7609765,"THERMOSTAT D'AMBIANCE MODULANT FILAIRE RS200 -3","AD306",202,0.08,"/","/","/",8713809266462,0.4,148,100,52,"C0"]
[7609764,"THERMOSTAT D'AMBIANCE MODULANT RADIO RS200 -3R","AD305",333,0.08,"/","/","/",8713809266455,0.8,150,110,110,"C0"]
[]
["OPTIONS ECS"]
[100000030,"COLIS OPTION SONDE ECS","AD212",50,0.01,"/","/","/",3661238011168,0.2,200,150,30,"C0"]
[7622082,"KIT ACI","MY417",122,null,"/","/","/",3661238614031,0.5,250,150,100,"C6"]
[7619012,"TESTEUR D'ANODE MAGNESIUM","MY408",61,null,"/","/","/",3661238608818,0.5,185,130,105,"D6"]
[null,null,null,null,null,null,null,null,""]
["MODULES HYDRAULIQUES",null,null,null,null,null,null,null,""]
[7627199,"OPTION 2 FLEXIBLES MONTAGE MURAL ","MY425",163,null,"/","/","/",3661238625723,6,860,250,135,"D6"]
[7627079,"KIT DE SECURITE POUR  FS./FSB./FSC.","MY427",127,null,"/","/","/",3661238627079,1.6,400,200,100,"D6"]
[89997001,"COL CROIX RAC 1''1/4 ","EA46",55,null,null,null,null,3661238044746,1.3,175,140,90,"C0"]
[100020164,"COLLECTEUR 2/3 CIRCUITS","EA140",341,null,"/","/","/",3661238575011,6.6,660,180,200,"C0"]
[100020167,"CIRCUIT DIRECT P.ELEC HEE","EA143",631,0.17,"/","/","/",3661238575042,5.0999999999999996,460,270,235,"C0"]
[100020168,"CIRCUIT V3V P.ELEC HEE","EA144",897,0.17,"/","/","/",3661238575059,6,460,270,235,"C0"]
[100020165,"CONSOLE MUR COLLECTEUR","EA141",43,null,"/","/","/",3661238575028,1.2,220,125,70,"C0"]
[100020166,"CONSOLE MUR 1 MODULE","EA142",114,null,"/","/","/",3661238575035,1.6,220,125,70,"C0"]
[]
[null,"PPS Ø 80 MM"]
[100015325,"KIT N° 1 RACCORDEMENT CHEMINÉE FLEXIBLE PPS Ø 80 MM","DY895",231,null,"/","/","/",3661238380110,3.4,395,400,390,"C0"]
[100017527,"KIT DE BASE PPS/ALU D80/125","DY913",163,null,"/","/","/",3661238496330,3.7,600,400,275,"C0"]
[84887708,"ADAPTATEUR PPS Ø 60/100 SUR 80/125 MM","DY708",57,null,"/","/","/",3661238012028,0.3,255,145,150,"C0"]
[84887701,"KIT DE RACCORDEMENT CHEMINÉE PPS 60/80 MM","DY701",264,null,"/","/","/",3661238012097,2.8,395,400,385,"C0"]
[84887717,"KIT N° 1 KIT DE RACCORDEMENT CHEMINÉE PPS Ø 80 MM","DY717",154,null,"/","/","/",3661238011946,2.9,395,405,390,"C0"]
[84887546,"PIÈCE DE VISITE Ø 80 MM DROITE","DY146",57,null,"/","/","/",3661238013506,0.3,300,145,150,"C0"]
[84887757,"PLAQUE DE FINITION Ø80MM","DY757",40,null,"/","/","/",3661238011595,0.3,310,230,140,"C0"]
[84887613,"RALLONGE PPS Ø 80 MM   LG= 250 MM (2 PIÈCES)","DY613",39,null,"/","/","/",3661238012967,0.4,250,170,175,"C0"]
[84887614,"RALLONGE PPS Ø 80 MM   LG= 500 MM (2 PIÈCES)","DY614",37,null,"/","/","/",3661238012950,0.7,500,160,150,"C0"]
[84887615,"RALLONGE PPS Ø 80 MM   LG= 1000 MM (2 PIÈCES)","DY615",50,null,"/","/","/",3661238012943,1.3,1000,160,145,"C0"]
[84887550,"RALLONGE PPS Ø 80 MM   LG= 2000 MM  (2 PIÈCES)","DY150",76,null,"/","/","/",3661238013469,2.5,1960,150,150,"C0"]
[84887552,"COUDE PPS À 90°","DY152",15,null,"/","/","/",3661238013445,0.2,255,145,150,"C0"]
[84887554,"COUDE PPS À 45° (2 PIECES)","DY154",34,null,"/","/","/",3661238013421,0.3,200,200,150,"C0"]
[84887563,"TÉ PPS  AVEC COUVERCLE D'INSPECTION","DY163",57,null,"/","/","/",3661238013353,0.4,290,220,170,"C0"]
[84887551,"ETOILE DE CENTRAGE Ø 80 MM (2 PIECES)","DY151",13,null,"/","/","/",3661238013452,0.1,300,300,40,"C0"]
[84887585,"TERMINAL AVEC SOLIN DIAMÉTRE 80","DY185",145,null,"/","/","/",3661238013148,1.5,390,380,280,"C0"]
[100008301,"COUDE DE REVISION PPS 87° Ø 80 MM (GRIS)","DY877",40,null,"/","/","/",3661238102026,0.2,190,195,145,"C0"]
[84887753,"TUYAU DE PROTECTION L500MM Ø 124MM","DY753",24,null,"/","/","/",3661238011632,0.4,500,155,140,"C0"]
[100015318,"ADAPTATEUR PPS Ø 80M-110F","DY902",51,null,"/","/","/",3661238379909,0.3,195,195,145,"C0"]
[100015319,"MANCHON PPS 80M-80F AVEC PRISE DE MESURE","DY903",46,null,"/","/","/",3661238380219,0.2,195,195,145,"C0"]
[null,"PPS 80/125 MM"]
[100002732,"TERMINAL VERTICAL PPS Ø 80/125 MM NOIR","DY843",152,null,"/","/","/",3661238006621,4.2,1210,270,240,"C0"]
[100002733,"TERMINAL VERTICAL PPS Ø 80/125 MM ROUGE","DY844",151,null,"/","/","/",3661238006614,4.2,1210,265,240,"C0"]
[84887716,"KIT N° 3 RACCORDEMENT CHAUDIÈRE  PPS Ø 80/125 MM","DY716",141,null,"/","/","/",3661238011953,2.4,500,290,260,"C0"]
[84887524,"PIÈCE D'INSPECTION DROITE ALU/PPS Ø 80/125 MM","DY124",108,null,"/","/","/",3661238013704,0.6,300,145,150,"C0"]
[100008311,"COUDE DE REVISION ALU/PPS Ø 80/125 MM","DY875",113,null,"/","/","/",3661238101920,0.7,195,195,145,"C0"]
[100003271,"KIT DE RACCORDEMENT CHAUDIÈRE PERPENDICULAIRE","DY849",220,null,"/","/","/",3661238005600,3.5,595,395,410,"C0"]
[100003272,"KIT DE RACCORDEMENT CHAUDIÈRE SOUS CONDUIT","DY850",165,null,"/","/","/",3661238005594,1.4,500,290,260,"C0"]
[84887525,"TÉ D'INSPECTION ALU/PPS Ø 80/125 MM","DY125",124,null,"/","/","/",3661238013698,0.8,315,235,150,"C0"]
[84887526,"RALLONGE CONCENTRIQUE ALU/PPS 80/125 LG= 250 MM","DY126",40,null,"/","/","/",3661238013681,0.5,255,145,150,"C0"]
[84887527,"RALLONGE CONCENTRIQUE ALU/PPS 80/125 LG= 500 MM","DY127",46,null,"/","/","/",3661238013674,0.9,520,140,140,"C0"]
[84887528,"RALLONGE CONCENTRIQUE ALU/PPS 80/125 LG=1000 MM","DY128",68,null,"/","/","/",3661238013667,1.7,1010,135,140,"C0"]
[84887529,"RALLONGE CONCENTRIQUE ALU/PPS 80/125 LG=1950 MM","DY129",118,null,"/","/","/",3661238013650,3.5,1960,150,150,"C0"]
[84887758,"PLAQUE DE FINITION Ø125MM","DY758",63,null,"/","/","/",3661238011588,0.5,310,235,145,"C0"]
[84887763,"TUYAU DE PROTECTION L500MM Ø141MM","DY763",29,null,"/","/","/",3661238011533,1.1000000000000001,500,160,150,"C0"]
[84887530,"MANC. COMP. D80/125","DY130",70,null,"/","/","/",3661238013643,0.6,300,140,145,"C0"]
[84887531,"COUDE A 87° ALU/PPS  Ø 80/125 MM","DY131",50,null,"/","/","/",3661238013636,0.7,200,200,150,"C0"]
[84887532,"COUDE CONCENTRIQUE 45° ALU/PPS Ø 80/125 MM (2 PIÈCES)","DY132",76,null,"/","/","/",3661238013629,1,315,235,150,"C0"]
[null,"FLEXIBLE PPS Ø 80 MM"]
[100015325,"KIT N° 1 RACCORDEMENT CHEMINÉE FLEXIBLE PPS Ø 80 MM","DY895",231,null,"/","/","/",3661238380110,3.4,395,400,390,"C0"]
[100015327,"TUBE FLEXIBLE LG=12,5M","DY897",347,null,"/","/","/",3661238380134,8,1200,780,370,"C0"]
[100015326,"TUBE FLEXIBLE LG=50M","DY896",1216,null,"/","/","/",3661238380127,26,1200,800,1170,"C0"]
[84887618,"ETOILE DE CENTRAGE POUR FLEXIBLE Ø 80 MM (2 PIÈCES)","DY618",36,null,"/","/","/",3661238012912,0.2,300,300,70,"C0"]
[100015328,"PIÈCE DE COUPLAGE FLEXIBLE Ø 80 MM","DY898",70,null,"/","/","/",3661238380141,0.3,155,155,160,"C0"]
[100015331,"OUTIL D'AIDE À L'INSERTION Ø 80 MM","DY901",174,null,"/","/","/",3661238380172,1.4,300,210,185,"C0"]
[100015330,"PIÈCE D'INSPECTION POUR TUBE FLEXIBLE","DY900",125,null,"/","/","/",3661238380165,0.5,295,145,150,"C0"]
[100015329,"TERMINAL AVEC SOLIN FLEX. Ø 80 MM","DY899",174,null,"/","/","/",3661238380158,1.7,395,400,265,"C0"]
[100015880,"ADAPTATEUR PPS FLEX Ø 80 MM","DY904",41,null,"/","/","/",3661238417632,0.1,195,195,145,"C0"]
[null,"DIVERS FUMISTERIE"]
[84887411,"SORTIE HORIZONTALE TOIT PENTE DE 30° A 45° ( uniquement pour tuiles mécaniques)","DY11",175,null,"/","/","/",3661238013940,3.6,1020,700,370,"C0"]
[84837729,"SORTIE DE TOIT EN PENTE DE 40° A 60° ( uniquement pour tuiles mécaniques)","CX49",175,null,"/","/","/",3661238014367,3.5,920,700,320,"C0"]
[84837731,"EMBASE D'ETANCHEITE POUR TOIT PLAT","CX51",42,null,"/","/","/",3661238014343,0.6,400,400,155,"C0"]
[84837121,"TUILE A DOUILLE 5 A 25° NOIRE","CX121",110,null,"/","/","/",3661238014428,3,510,250,145,"C0"]
[84837732,"TUILE A DOUILLE 25 A 45° NOIRE","CX52",76,null,"/","/","/",3661238014336,3,520,250,145,"C0"]
[84837734,"TUILE A DOUILLE 35 A 55° NOIRE","CX63",95,null,"/","/","/",3661238014312,3.2,510,265,180,"C0"]
[84837120,"TUILE A DOUILLE 5 A 25° ROUGE","CX120",110,null,"/","/","/",3661238014435,3,515,245,145,"C0"]
[84837783,"TUILE A DOUILLE 25 A 45° ROUGE","CX83",76,null,"/","/","/",3661238014213,3,515,250,150,"C0"]
[84837784,"TUILE A DOUILLE 35 A 55° ROUGE","CX84",95,null,"/","/","/",3661238014206,3,520,265,180,"C0"]
[84837741,"PLATINE DE FINITION INTERIEURE","CX72",16,null,"/","/","/",3661238014251,0.7,245,210,3,"C0"]
[100005002,"GRILLE DE PROTECTION INOX Ø 80/125 MM","DY865",172,null,"/","/","/",3661238001886,2.6,275,270,270,"C0"]
[84887435,"GRILLE D'AERATION EXTERIEURE 175 CM²","DY35",23,null,"/","/","/",3661238013889,0.3,300,250,30,"C0"]
[84887436,"GRILLE D'AERATION INTERIEURE 175 CM²","DY36",24,null,"/","/","/",3661238013872,0.3,250,295,2,"C0"]
[84837779,"COLLIER DE FIXATION Ø 125 MM PATTE LONGUE","CX79",14,null,"/","/","/",3661238014237,0.4,230,160,200,"C0"]
[84837118,"COLLIER DE FIXATION Ø 125 MM PATTE COURTE","CX118",11,null,"/","/","/",3661238014459,0.2,225,185,20,"C0"]
[84887451,"COLLIER D'ETANCHEITE POUR MONTAGE EXTERIEUR","DY51",26,null,"/","/","/",3661238013841,0.2,150,130,60,"C0"]
[]
[]
[7633658,"FSCX 40",null,{"$f":"D3643+D3646","v":5487},null,"A système\n avec sonde extérieure","/","/",null,{"$f":"J3643+J3646","v":293.89999999999998},null,null,null,"D6"]
[7633659,"FSCX 50",null,{"$f":"D3644+D3646","v":6080},null,"A système\n avec sonde extérieure","/","/",null,{"$f":"J3644+J3646","v":331.9},null,null,null,"D6"]
[7633663,"FSCR 40",null,{"$f":"D3643+D3647","v":5783},null,"A système\n avec sonde extérieure","/","/",null,{"$f":"J3643+J3647","v":293.89999999999998},null,null,null,"D6"]
[7633664,"FSCR 50",null,{"$f":"D3644+D3647","v":6376},null,"A système\n avec sonde extérieure","/","/",null,{"$f":"J3644+J3647","v":331.9},null,null,null,"D6"]
[null,null,null,null,null,null,null,null,null,null,null,null,null,"D6"]
["COMPOSANTS"]
[7624133,"FSC. 40","MY117",5338,null,"/","/","/",3661238617346,293,1425,750,1060,"D6"]
[7624884,"FSC. 50*","MY121",5931,null,"/","/","/",3661238643314,331,1200,1200,1315,"D6"]
[null,"* JAQUETTE, CONDENSEUR ET BRULEUR A MONTER",null,null,null,"/","/","/",null,null,null,null,null,"D6"]
[7605717,"TABLEAU X OETROCOM 1 ","MY409",149,null,"/","/","/",3661238616264,0.9,400,200,100,"D6"]
[7605715,"TABLEAU R OETROCOM 2","MY410",445,null,"/","/","/",3661238616271,0.9,400,200,100,"D6"]
[]
["OPTIONS ECS"]
[7639559,"KIT DE LIAISON FS/FSB/FSC - BALLON INDEPENDANT OBLC/OBPB ","ER598",479,null,"/","/","/",3661238641679,7,600,500,135,"D6"]
[]
["FUMISTERIE"]
[null,"PPS Ø 110 mm"]
[84887577,"KIT DE RACCORDEMENT CHEMINEE PPS Ø 110 mm","DY177",253,null,"/","/","/",3661238013223,2.68,395,300,510,"C0"]
[84887578,"TUYAU PPS Ø 110 mm LG = 1950 mm (GRIS)","DY178",71,null,"/","/","/",3661238013216,2.46,1960,150,150,"C0"]
[84887579,"TUYAU PPS Ø 110 mm LG = 1000 mm (GRIS)","DY179",40,null,"/","/","/",3661238013209,1.24,1015,130,140,"C0"]
[84887580,"TUYAU PPS Ø 110 mm LG = 500 mm (GRIS)","DY180",30,null,"/","/","/",3661238013193,0.62,515,135,140,"C0"]
[84887581,"COUDE PPS 87° Ø 110 mm (GRIS)","DY181",35,null,"/","/","/",3661238013186,0.33,255,190,150,"C0"]
[84887582,"COUDE PPS 45° Ø 110 mm (GRIS)","DY182",47,null,"/","/","/",3661238013179,0.52,295,215,165,"C0"]
[84887583,"T DE REVISION Ø 110 mm (GRIS)","DY183",47,null,"/","/","/",3661238013162,0.46,300,150,150,"C0"]
[84887587,"ETOILE DE CENTRAGE PPS  Ø 110 mm (2 PIECES)","DY187",14,null,"/","/","/",3661238013124,0.1,300,300,30,"C0"]
[84887588,"COUDE DE REVISION PPS 87° Ø 110 mm (GRIS)","DY188",71,null,"/","/","/",3661238013117,0.52,315,235,150,"C0"]
[84887772,"PLAQUE DE FINITION","DY772",57,null,"/","/","/",3661238011458,0.49,310,230,145,"C0"]
[84887773,"FOURREAU Ø165mm L 500mm","DY773",40,null,"/","/","/",3661238011441,1.23,515,165,170,"C3"]
[84887435,"GRILLE D'AERATION EXTERIEURE 250 X 300 mm","DY35",23,null,"/","/","/",3661238013889,0.35,300,250,30,"C0"]
[100015325,"KIT N° 1 RACCORDEMENT CHEMINÉE FLEXIBLE PPS Ø 80 mm","DY895",231,null,"/","/","/",3661238380110,2.87,395,395,380,"C0"]
[100015327,"TUBE FLEXIBLE LG=12,5M","DY897",347,null,"/","/","/",3661238380134,8.6999999999999993,1200,1220,250,"C0"]
[100015326,"TUBE FLEXIBLE LG=50M","DY896",1216,null,"/","/","/",3661238380127,35,1600,1660,410,"C0"]
[84887618,"ETOILE DE CENTRAGE POUR FLEXIBLE Ø 80  mm (2 PIÈCES)","DY618",36,null,"/","/","/",3661238012912,0.2,300,300,70,"C0"]
[100015328,"PIÈCE DE COUPLAGE FLEXIBLE Ø 80 mm","DY898",70,null,"/","/","/",3661238380141,0.25,150,150,150,"C0"]
[100015331,"OUTIL D'AIDE À L'INSERTION Ø 80 mm","DY901",174,null,"/","/","/",3661238380172,1.4,300,210,185,"C0"]
[100015330,"PIÈCE D'INSPECTION POUR TUBE FLEXIBLE","DY900",125,null,"/","/","/",3661238380165,0.5,295,140,140,"C0"]
[100015329,"TERMINAL AVEC SOLIN FLEX. Ø 80 mm","DY899",174,null,"/","/","/",3661238380158,1.74,385,385,250,"C0"]
[]
[]
[100019185,"PUX2 265 CONDENS CORPS MONTE",null,8949,null,"A","/","/",3661238549869,null,null,null,null,"C0"]
[100019186,"PUX2 266 CONDENS CORPS MONTE",null,10159,null,"A","/","/",3661238549876,null,null,null,null,"C0"]
[100019187,"PUX2 267 CONDENS CORPS MONTE",null,10792,null,"A","/","/",3661238549883,null,null,null,null,"C0"]
[100019188,"PUR 265 CONDENS + AD217  CORPS MONTE",null,9793,null,"A","/","/",3661238549890,null,null,null,null,"C0"]
[100019189,"PUR 266 CONDENS + AD217  CORPS MONTE",null,11003,null,"A","/","/",3661238549906,null,null,null,null,"C0"]
[100019190,"PUR 267 CONDENS + AD217  CORPS MONTE",null,11636,null,"A","/","/",3661238549913,null,null,null,null,"C0"]
[100019358,"PUX2 265 CONDENS CORPS NON MONTE",null,8951,null,"A","/","/",3661238562219,null,null,null,null,"C0"]
[100019359,"PUX2 266 CONDENS CORPS NON MONTE",null,10162,null,"A","/","/",3661238562226,null,null,null,null,"C0"]
[100019360,"PUX2 267 CONDENS CORPS NON MONTE",null,10795,null,"A","/","/",3661238562233,null,null,null,null,"C0"]
[100019361,"PUR 265 CONDENS + AD217  CORPS NON MONTE",null,9795,null,"A","/","/",3661238562240,null,null,null,null,"C0"]
[100019362,"PUR 266 CONDENS + AD217  CORPS NON MONTE",null,11006,null,"A","/","/",3661238562257,null,null,null,null,"C0"]
[100019363,"PUR 267 CONDENS + AD217  CORPS NON MONTE",null,11639,null,"A","/","/",3661238562264,null,null,null,null,"C0"]
[]
["COMPOSANTS"]
[200004483,"ELEMENT INTERMEDIAIRE PK 260",null,262,null,"/","/","/",3661238001787,35.83,650,410,125,"C0"]
[82270002,"ELEMENT AVANT PKR-250",null,267,null,"/","/","/",3661238020580,35.25,660,480,130,"C0"]
[82270003,"ELEMENT ARRIERE PKR-250",null,352,null,"/","/","/",3661238020573,42.5,690,410,130,"C0"]
[100004367,"CAISSE ACCESSOIRES 5 ELEMENTS","ME7",990,null,"/","/","/",3661238003613,45.5,645,610,390,"C0"]
[100004368,"CAISSE ACCESSOIRES 6 ELEMENTS","ME8",1054,null,"/","/","/",3661238003606,49,645,610,390,"C0"]
[100004369,"CAISSE ACCESSOIRES 7 ELEMENTS","ME9",1083,null,"/","/","/",3661238003590,49.5,645,610,390,"C0"]
[100019219,"COLIS JAQUETTE PK265/PU265  ","MF6",1114,null,"/","/","/",3661238549449,37,1090,750,425,"C0"]
[100019220,"COLIS JAQUETTE PK266/PU266","MF7",1128,null,"/","/","/",3661238549456,34.5,1100,870,440,"C0"]
[100019221,"COLIS JAQUETTE PK267/PU267","MF8",1134,null,"/","/","/",3661238549470,44,1095,1045,440,"C0"]
[100004362,"CORPS ASSEMBLE 5 ELEMENTS","ME2",2393,null,"/","/","/",3661238003668,248,975,815,630,"C0"]
[100004363,"CORPS ASSEMBLE 6 ELEMENTS   ","ME3",2727,null,"/","/","/",3661238003651,294,1105,815,630,"C0"]
[100004364,"CORPS ASSEMBLE 7 ELEMENTS","ME4",3018,null,"/","/","/",3661238003644,332,1230,815,630,"C0"]
[82277010,"LIASSE TIGE ASSEMB. 6 EL ",null,9,null,"/","/","/",3661238020511,0.43,700,15,10,"C0"]
[82277011,"LIASSE TIGE ASSEMB. 7 EL  ",null,9,null,"/","/","/",3661238020504,0.51,825,15,7,"C0"]
[100018925,"COLIS CONDENSEUR + SIPHON  AWR430","ME74",2591,null,"/","/","/",3661238548312,35,570,742,731,"C0"]
[100018926,"COLIS CONDENSEUR + SIPHON  AWR440","ME75",3185,null,"/","/","/",3661238548329,44,570,742,891,"C0"]
[100018995,"COLIS ACCES GTUC225/PU265COND","ME71",230,null,"/","/","/",3661238548282,6,480,305,280,"C0"]
[100018997,"COLIS ACCES GTUC226-227/PU266-267","ME72",258,null,"/","/","/",3661238548299,11,480,305,280,"C0"]
[100018994,"HABILLAGE GTUC 220/PU260COND","ME70",237,null,"/","/","/",3661238548275,16,1150,550,135,"C0"]
[100019091,"BRULEUR  OEN 265 LZV-P ","ME85",1627,null,"/","/","/",3661238550018,17,800,300,400,"C0"]
[100019092,"BRULEUR  OEN 266 LZV-P","ME86",1867,null,"/","/","/",3661238550025,18,800,300,400,"C0"]
[100019093,"BRULEUR  OEN 267 LZV-P","ME87",2203,null,"/","/","/",3661238550032,23,780,370,420,"C0"]
[100019081,"COLIS DOC PU265 CONDENS","ME79",26,null,"/","/","/",3661238548756,1,325,240,50,"C0"]
[100019082,"COLIS DOC PU266 CONDENS","ME80",26,null,"/","/","/",3661238548763,1,325,240,50,"C0"]
[100019083,"COLIS DOC PU267 CONDENS","ME81",26,null,"/","/","/",3661238548770,1,325,240,50,"C0"]
[100004587,"TABLEAU  R/TA","FT63",1287,null,"/","/","/",3661238110427,5.2,415,425,195,"C0"]
[100004588,"TABLEAU CDE X2 / TA","FT64",731,null,"/","/","/",3661238110410,5.2,415,425,195,"C0"]
[100004294,"PLATINE 2 all./Mod./V3V","AD217",288,0.01,"/","/","/",3661238004191,0.75,200,145,130,"C0"]
[]
["OPTIONS TABLEAUX"]
[88017017,"SONDE DEPART","AD199",79,0.01,"/","/","/",3661238049185,0.21,150,200,40,"C0"]
[88017014,"COLIS OPTION V3V     ","AD196",176,0.01,"/","/","/",3661238102422,0.52,260,170,120,"C0"]
[85757742,"SONDE FUMEES","FM47",71,0.01,"/","/","/",3661238022744,0.17,210,160,40,"C0"]
[161118,"COMMANDE A DISTANCE INTERACTIVE AD194","AD194",193,null,"/","/","/",3661238106505,0.15,null,null,null,"C0"]
[100002803,"COMMANDE A DISTANCE SIMPLIFIEE AD208","AD208",102,0.08,"/","/","/",3661238554931,0.2,120,85,40,"C0"]
[88017887,"SONDES POUR BALLON TAMPON","AD160",95,0.01,"/","/","/",3661238048720,0.21,210,170,40,"C7"]
[88017851,"CABLE DE LIAISON BUS LG 12 M","AD134",108,0.01,"/","/","/",3661238048850,0.37,350,260,30,"C0"]
[88017904,"THERMOSTAT AMBIANCE PROGRAMMABLE","AD191",158,0.08,"/","/","/",3661238102415,0.24,135,90,55,"C0"]
[88017010,"THERMOSTAT D'AMBIANCE PROGRAMMABLE (SANS FILS)","AD192",280,0.08,"/","/","/",3661238102439,0.42499999999999999,180,150,90,"C0"]
[]
["OPTIONS ECS"]
[89557009,"KIT DE TRANSFORMATION G/R 3/4 '' ET 1 ''","BH84",31,null,"/","/","/",3661238047563,0.32500000000000001,200,140,45,"C0"]
[100000030,"COLIS OPTION SONDE ECS","AD212",48,0.01,"/","/","/",3661238011168,0.16,200,150,30,"C0"]
[100007835,"KIT LIAISON PK264-6","EA117",514,null,"/","/","/",3661238113312,6.5,600,500,135,"C0"]
[]
["TOUTES OPTIONS "]
[100019830,"KIT 2EME RETOUR ","ME117",713,null,"/","/","/",3661238570214,6.6,510,330,150,"C0"]
[100019474,"STATION DE NEUTRALISATION ","ME115",358,null,"/","/","/",3661238563520,12,null,null,null,"C0"]
[100019475,"GRANULAT DE NEUTRALISATION","ME116",217,null,"/","/","/",3661238563513,11,null,null,null,"C0"]
[]
[]
[100013095,"PUR 354 CONDENS CORPS VRAC",null,14520,null,"Pas concerné par l'étiquettage",null,null,3661238551756,null,null,null,null,"C3"]
[100012740,"PUR 355 CONDENS CORPS VRAC",null,14974,null,"Pas concerné par l'étiquettage",null,null,3661238551763,null,null,null,null,"C3"]
[100012741,"PUR 356 CONDENS CORPS VRAC",null,15527,null,"Pas concerné par l'étiquettage",null,null,3661238551770,null,null,null,null,"C3"]
[100012742,"PUR 357 CONDENS CORPS VRAC",null,21548,null,"Pas concerné par l'étiquettage",null,null,3661238551787,null,null,null,null,"C3"]
[100012743,"PUR 358 CONDENS CORPS VRAC",null,22502,null,"Pas concerné par l'étiquettage",null,null,3661238551794,null,null,null,null,"C3"]
[100012744,"PUR 359 CONDENS CORPS VRAC",null,23734,null,"Pas concerné par l'étiquettage",null,null,3661238551800,null,null,null,null,"C3"]
[100013096,"PUX 354 CONDENS CORPS VRAC",null,14347,null,"Pas concerné par l'étiquettage",null,null,3661238551817,null,null,null,null,"C3"]
[100012745,"PUX 355 CONDENS CORPS VRAC",null,14801,null,"Pas concerné par l'étiquettage",null,null,3661238551824,null,null,null,null,"C3"]
[100012746,"PUX 356 CONDENS CORPS VRAC",null,15354,null,"Pas concerné par l'étiquettage",null,null,3661238551831,null,null,null,null,"C3"]
[100012747,"PUX 357 CONDENS CORPS VRAC",null,21375,null,"Pas concerné par l'étiquettage",null,null,3661238551848,null,null,null,null,"C3"]
[100012748,"PUX 358 CONDENS CORPS VRAC",null,22329,null,"Pas concerné par l'étiquettage",null,null,3661238551855,null,null,null,null,"C3"]
[100012749,"PUX 359 CONDENS CORPS VRAC",null,23561,null,"Pas concerné par l'étiquettage",null,null,3661238551862,null,null,null,null,"C3"]
[100013097,"PUR 354 CONDENS CORPS ASSEMBLE",null,14839,null,"Pas concerné par l'étiquettage",null,null,3661238551879,null,null,null,null,"C3"]
[100012750,"PUR 355 CONDENS CORPS ASSEMBLE",null,15412,null,"Pas concerné par l'étiquettage",null,null,3661238551886,null,null,null,null,"C3"]
[100012751,"PUR 356 CONDENS CORPS ASSEMBLE",null,16083,null,"Pas concerné par l'étiquettage",null,null,3661238551893,null,null,null,null,"C3"]
[100012752,"PUR 357 CONDENS CORPS ASSEMBLE",null,22100,null,"Pas concerné par l'étiquettage",null,null,3661238551909,null,null,null,null,"C3"]
[100012753,"PUR 358 CONDENS CORPS ASSEMBLE",null,23058,null,"Pas concerné par l'étiquettage",null,null,3661238551916,null,null,null,null,"C3"]
[100012754,"PUR 359 CONDENS CORPS ASSEMBLE",null,24324,null,"Pas concerné par l'étiquettage",null,null,3661238551923,null,null,null,null,"C3"]
[100013098,"PUX 354 CONDENS CORPS ASSEMBLE",null,14666,null,"Pas concerné par l'étiquettage",null,null,3661238551930,null,null,null,null,"C3"]
[100012755,"PUX 355 CONDENS CORPS ASSEMBLE",null,15239,null,"Pas concerné par l'étiquettage",null,null,3661238551947,null,null,null,null,"C3"]
[100012756,"PUX 356 CONDENS CORPS ASSEMBLE",null,15910,null,"Pas concerné par l'étiquettage",null,null,3661238551954,null,null,null,null,"C3"]
[100012757,"PUX 357 CONDENS CORPS ASSEMBLE",null,21927,null,"Pas concerné par l'étiquettage",null,null,3661238551961,null,null,null,null,"C3"]
[100012758,"PUX 358 CONDENS CORPS ASSEMBLE",null,22885,null,"Pas concerné par l'étiquettage",null,null,3661238551978,null,null,null,null,"C3"]
[100012759,"PUX 359 CONDENS CORPS ASSEMBLE",null,24151,null,"Pas concerné par l'étiquettage",null,null,3661238551985,null,null,null,null,"C3"]
[]
["COMPOSANTS"]
[85537066,"CORPS GT 304 / II ASSEMBLE",null,2332,null,"/","/","/",3661238026186,488,1100,920,680,"C3"]
[85537067,"CORPS GT 305 / II ASSEMBLE",null,2809,null,"/","/","/",3661238026179,600,1085,1085,670,"C3"]
[85537068,"CORPS GT 306 / II ASSEMBLE",null,3215,null,"/","/","/",3661238026162,712.5,1250,1080,680,"C3"]
[85537069,"CORPS GT 307 / II ASSEMBLE",null,3634,null,"/","/","/",3661238026155,824,1410,1080,680,"C3"]
[85537070,"CORPS GT 308 / II ASSEMBLE",null,4048,null,"/","/","/",3661238026148,936,1550,1080,680,"C3"]
[85537071,"CORPS GT 309 / II ASSEMBLE",null,4503,null,"/","/","/",3661238026131,1048,1730,1080,680,"C3"]
[85537072,"EL. ARRIERE GT300/II CPL.",null,538,null,"/","/","/",3661238026124,130,1070,600,190,"C3"]
[82190001,"ELT GT  300 INTER",null,329,null,"/","/","/",3661238020832,111,990,600,165,"C3"]
[82190002,"ELT GT  300 AVANT",null,489,null,"/","/","/",3661238020825,104,1070,620,170,"C3"]
[82198944,"LIASSE TIGES ASS. GT304",null,7,null,"/","/","/",3661238020658,1.29,575,50,50,"C3"]
[82198945,"LIASSE TIGES ASS. GT305",null,8,null,"/","/","/",3661238020641,1.56,700,50,50,"C3"]
[82198946,"LIASSE TIGES ASS. GT306",null,9,null,"/","/","/",3661238020634,1.9,865,50,50,"C3"]
[82198947,"LIASSE TIGES ASS. GT307",null,11,null,"/","/","/",3661238020627,2.25,1025,50,50,"C3"]
[82198948,"LIASSE TIGES ASS. GT308",null,14,null,"/","/","/",3661238020610,2.61,1185,50,50,"C3"]
[82198949,"LIASSE TIGES ASS. GT309",null,21,null,"/","/","/",3661238020603,2.92,1330,50,50,"C3"]
[85537009,"ACC CORPS EN VRAC 4 EL","FD9",491,null,"/","/","/",3661238026537,47,660,615,370,"C3"]
[85537010,"ACC CORPS EN VRAC 5 EL","FD10",503,null,"/","/","/",3661238026520,48,660,615,370,"C3"]
[85537011,"ACC CORPS EN VRAC 6 EL","FD11",523,null,"/","/","/",3661238026513,49.5,660,615,370,"C3"]
[85537012,"ACC CORPS EN VRAC 7 EL","FD12",597,null,"/","/","/",3661238026506,49.5,660,615,370,"C3"]
[85537013,"ACC CORPS EN VRAC 8 EL","FD13",664,null,"/","/","/",3661238026490,50,660,615,370,"C3"]
[85537014,"ACC CORPS EN VRAC 9 EL","FD14",704,null,"/","/","/",3661238026483,51.5,660,615,370,"C3"]
[82197712,"COLIS TURBUL. GT304","BP16",190,null,"/","/","/",3661238020818,29,635,510,220,"C3"]
[82197713,"COLIS TURBUL. GT305/306","BP17",203,null,"/","/","/",3661238020801,36,635,510,220,"C3"]
[82197715,"COLIS TURBUL. GT307","BP19",209,null,"/","/","/",3661238020795,39,500,630,240,"C3"]
[82197716,"COLIS TURBUL. GT308","BP20",429,null,"/","/","/",3661238020788,55,635,510,380,"C3"]
[82197717,"COLIS TURBUL. GT309","BP21",482,null,"/","/","/",3661238020771,60,500,630,400,"C3"]
[82197718,"PORTE FOYERE D.135","BP13",277,null,"/","/","/",3661238020764,21.6,680,180,520,"C3"]
[85537015,"ACC COR.ASS.4-5 ELTS","FD15",284,null,"/","/","/",3661238026476,26,680,525,190,"C3"]
[85537019,"ACC COR.ASS.6-7-8 ELTS","FD19",357,null,"/","/","/",3661238026469,26.5,680,525,190,"C3"]
[85537020,"ACC COR.ASS.9 ELTS","FD20",368,null,"/","/","/",3661238026452,27,680,525,190,"C3"]
[100004865,"COLIS JAQUETTE LATERALE GT 334","MD7",509,null,"/","/","/",3661238002098,40.5,1180,980,330,"C3"]
[100004866,"COLIS JAQUETTE LATERALE GT 335","MD8",555,null,"/","/","/",3661238002081,44,1180,980,330,"C3"]
[100004867,"COLIS JAQUETTE LATERALE GT 336","MD9",613,null,"/","/","/",3661238002074,80.5,1230,1350,390,"C3"]
[100004868,"COLIS JAQUETTE LATERALE GT 337","MD10",670,null,"/","/","/",3661238002067,95.25,1230,1350,390,"C3"]
[100004869,"COLIS JAQUETTE LATERALE GT 338","MD11",919,null,"/","/","/",3661238002050,91.25,1230,1650,390,"C3"]
[100004880,"COLIS JAQUETTE LATERALE GT 339","MD12",1571,null,"/","/","/",3661238002043,112.25,1230,1650,390,"C3"]
[100004927,"HABILLAGE AVANT  PK 350","MG3",114,null,"/","/","/",3661238109919,9.5,1010,820,120,"C3"]
[85537060,"COLIS CHASSIS 4ELTS","FD30",114,null,"/","/","/",3661238026247,13.5,760,180,100,"C3"]
[85537061,"COLIS CHASSIS 5ELTS","FD31",130,null,"/","/","/",3661238026230,16,750,190,100,"C3"]
[85537062,"COLIS CHASSIS 6ELTS","FD32",141,null,"/","/","/",3661238026223,18.5,760,190,110,"C3"]
[85537063,"COLIS CHASSIS 7ELTS","FD33",159,null,"/","/","/",3661238026216,20.5,900,210,120,"C3"]
[85537064,"COLIS CHASSIS 8ELTS","FD34",170,null,"/","/","/",3661238026209,23,1060,210,130,"C3"]
[85537065,"COLIS CHASSIS 9ELTS","FD35",226,null,"/","/","/",3661238026193,25,1220,210,140,"C3"]
[100013110,"COLIS DOCUMENT TECHNIQUE FR PU 354 CONDENS","MG30",43,null,"/","/","/",3661238362130,0.5,410,210,125,"C3"]
[100012638,"COLIS DOCUMENT TECHNIQUE FR PU 355 CONDENS","MG20",43,null,"/","/","/",3661238358997,0.5,410,210,125,"C3"]
[100012639,"COLIS DOCUMENT TECHNIQUE FR PU 356 CONDENS","MG21",43,null,"/","/","/",3661238359024,0.5,410,210,125,"C3"]
[100012650,"COLIS DOCUMENT TECHNIQUE FR PU 357 CONDENS","MG22",43,null,"/","/","/",3661238359031,0.5,410,210,125,"C3"]
[100012651,"COLIS DOCUMENT TECHNIQUE FR PU 358 CONDENS","MG23",43,null,"/","/","/",3661238359055,0.5,410,210,125,"C3"]
[100012652,"COLIS DOCUMENT TECHNIQUE FR PU 359 CONDENS","MG24",43,null,"/","/","/",3661238359062,0.5,410,210,125,"C3"]
[100004380,"TABLEAU STANDARD OERTLI","MG1",318,null,"/","/","/",3661238111332,5.0599999999999996,800,200,200,"C3"]
[100004381,"TABLEAU R OERTLI","MG2",491,null,"/","/","/",3661238111325,10.39,830,430,270,"C3"]
[100011882,"CONDENSEUR RCF 301","MD169",7468,null,"/","/","/",3661238350915,92.55,1360,720,1250,"C3"]
[100011883,"CONDENSEUR RCF 302","MD170",12563,null,"/","/","/",3661238350922,166.55,1360,720,1250,"C3"]
[100011802,"COLIS HYDRAULIQUE RCF301","MD171",500,null,"/","/","/",3661238351462,14.3,610,460,190,"C3"]
[100011803,"COLIS HYDRAULIQUE RCF302","MD172",521,null,"/","/","/",3661238351479,16.899999999999999,610,460,190,"C3"]
[100011804,"COLIS FUMEES RCF301","MD173",827,null,"/","/","/",3661238351486,4.05,410,410,430,"C3"]
[100011805,"COLIS FUMEES RCF302","MD174",1246,null,"/","/","/",3661238351493,10.5,860,520,520,"C3"]
[100012940,"BRULEUR OES 255 LZ-P",null,1804,null,"/","/","/",3661238551992,20,800,300,400,"C3"]
[100012942,"BRULEUR OES 351 LZ-P",null,1841,null,"/","/","/",3661238552005,25,780,370,420,"C3"]
[100012943,"BRULEUR OES 352 LZ-P",null,1914,null,"/","/","/",3661238552012,25,780,370,420,"C3"]
[100012944,"BRULEUR OES 353 LZ-P",null,1975,null,"/","/","/",3661238552029,25,780,370,420,"C3"]
[100012945,"BRULEUR OES 354 LZ-P",null,2050,null,"/","/","/",3661238552036,25,780,370,420,"C3"]
[100012946,"BRULEUR OES 355 LZ-P",null,2145,null,"/","/","/",3661238552043,33,780,370,420,"C3"]
[]
["OPTIONS "]
[100004295,"COLIS TABLEAU DIEMATIC M3 ","MD1",1935,null,"/","/","/",3661238004184,12,830,430,270,"C3"]
[100004296,"COLIS TABLEAU K3    ","MD2",1162,null,"/","/","/",3661238004177,12,830,430,270,"C3"]
[100012250,"SIPHON GTU C 330","MD217",414,null,"/","/","/",3661238357914,4,500,500,500,"C3"]
[100012251,"KIT RECIRCULATION GTU C 330","MD218",412,null,"/","/","/",3661238357921,17,660,490,300,"C3"]
[85537074,"KIT VANNE DE CHASSE","FD37",274,null,"/","/","/",3661238026100,6.5,410,290,170,"C0"]
[85537075,"JEU DE 2 CONTRE-BRIDE A EPAULEMENT, Ø 2\"","FD38",72,null,"/","/","/",3661238026094,2.79,195,150,125,"C0"]
[85537076,"KIT DE SECURITE 115kW","FD39",172,null,"/","/","/",3661238026087,2.41,425,255,120,"C0"]
[85537079,"KIT DE SECURITE 115 à 330 kW","FD42",238,null,"/","/","/",3661238026056,3.14,470,255,115,"C0"]
[88017858,"PROLONGATEUR BUS","AD139",23,0.01,"/","/","/",3661238048812,0.05,210,150,20,"C0"]
[100004970,"COLIS CARTE RELAIS+SONDES POUR K3 ","AD220",316,null,null,null,null,3661238001893,0.7,310,210,130,"C0"]
[100012385,"STATION DE NEUTRALISATION (Jusqu'à 350 kW)","MD225",513,null,"/","/","/",3661238357938,32.9,550,370,440,"C3"]
[100012685,"COLIS RECHARGE STATION DE NEUTRALISATION","MD226",191,null,"/","/","/",3661238359703,24.5,510,360,240,"C3"]
[]
[null,"FAMILLE : CHAUDIERE FIOUL AU  SOL  BASSE TEMPERATURE"]
[]
[]
[7633545,"FSBX 22",null,{"$f":"D3854+D3856","v":3312},null,"B","/","/",3661238637986,{"$f":"J3854+J3856","v":204.9},null,null,null,"D6"]
[7633548,"FSBX 29",null,{"$f":"D3855+D3856","v":3461},null,"B","/","/",3661238637993,{"$f":"J3855+J3856","v":232.9},null,null,null,"D6"]
[7633551,"FSBR 22",null,{"$f":"D3854+D3857","v":3608},null,"B","/","/",3661238638020,{"$f":"J3854+J3857","v":204.9},null,null,null,"D6"]
[7633552,"FSBR 29",null,{"$f":"D3855+D3857","v":3757},null,"B","/","/",3661238638037,{"$f":"J3855+J3857","v":232.9},null,null,null,"D6"]
[]
["COMPOSANTS"]
[7624149,"FSB. 22  ","MY125",3163,null,"/","/","/",3661238617353,204,1220,750,1050,"D6"]
[7624151,"FSB. 29  ","MY135",3312,null,"/","/","/",3661238617377,232,1220,750,1050,"D6"]
[7605717,"TABLEAU X OETROCOM 1 ","MY409",149,null,"/","/","/",3661238616264,0.9,400,200,100,"D6"]
[7605715,"TABLEAU R OETROCOM 2","MY410",445,null,"/","/","/",3661238616271,0.9,400,200,100,"D6"]
[]
[]
[7633555,"FVBX 22/EL110SL",null,{"$f":"D3864+D3865+D3866+D3867","v":4351},null,"B","B","XL",3661238638068,{"$f":"J3864+J3865+J3866+J3867","v":292.89999999999998},null,null,null,"D6"]
[7633556,"FVBR 22/EL110SL",null,{"$f":"D3864+D3865+D3866+D3868","v":4647},null,"B","B","XL",3661238638075,{"$f":"J3864+J3865+J3866+J3868","v":292.89999999999998},null,null,null,"D6"]
[]
["COMPOSANTS"]
[7624149,"FSB. 22  ","MY125",3163,null,"/","/","/",3661238617353,{"$f":"J3854","v":204},1220,750,1050,"D6"]
[7609915,"BALLON EL110SL","ER590",742,null,"/","/","/",3661238608726,83,700,680,940,"D6"]
[7613103,"KIT DE LIAISON BALLON EL110SL","ER595",297,null,"/","/","/",3661238608115,5,860,250,135,"D6"]
[7605717,"TABLEAU X OETROCOM 1 ","MY409",149,null,"/","/","/",3661238616264,0.9,400,200,100,"D6"]
[7605715,"TABLEAU R OETROCOM 2","MY410",445,null,"/","/","/",3661238616271,0.9,400,200,100,"D6"]
[null,null,null,null,null,null,null,null,""]
[]
[7633557,"FVBX 22/EL160SL",null,{"$f":"D3877+D3879+D3880+D3881","v":4676},null,"B","B","XL",3661238638082,{"$f":"J3877+J3879+J3880+J3881","v":307.89999999999998},null,null,null,"D6"]
[7633561,"FVBX 29/EL160SL",null,{"$f":"D3878+D3879+D3880+D3881","v":4825},null,"B","B","XL",3661238638099,{"$f":"J3878+J3879+J3880+J3881","v":335.9},null,null,null,"D6"]
[7633562,"FVBR 22/EL160SL",null,{"$f":"D3877+D3879+D3880+D3882","v":4972},null,"B","B","XL",3661238638105,{"$f":"J3877+J3879+J3880+J3882","v":307.89999999999998},null,null,null,"D6"]
[7633563,"FVBR 29/EL160SL",null,{"$f":"D3878+D3879+D3880+D3882","v":5121},null,"B","B","XL",3661238638112,{"$f":"J3878+J3879+J3880+J3882","v":335.9},null,null,null,"D6"]
[]
["COMPOSANTS"]
[7624149,"FSB. 22  ","MY125",3163,null,"/","/","/",3661238617353,{"$f":"J3864","v":204},1220,750,1050,"D6"]
[7624151,"FSB. 29  ","MY135",3312,null,"/","/","/",3661238617377,{"$f":"J3855","v":232},1220,750,1050,"D6"]
[7616405,"BALLON EL160SL","ER592",969,null,"/","/","/",3661238608696,98,700,680,1200,"D6"]
[7613082,"KIT DE LIAISON BALLON EL160SL","ER597",395,null,"/","/","/",3661238608139,5,860,250,135,"D6"]
[7605717,"TABLEAU X OETROCOM 1 ","MY409",149,null,"/","/","/",3661238616264,0.9,400,200,100,"D6"]
[7605715,"TABLEAU R OETROCOM 2","MY410",445,null,"/","/","/",3661238616271,0.9,400,200,100,"D6"]
[]
[]
[7633564,"FSBX 22 P",null,{"$f":"D3891+D3893+D3894","v":3782},null,"B","/","/",3661238638129,{"$f":"J3891+J3893+J3894","v":219.9},null,null,null,"D6"]
[7633565,"FSBX 29 P",null,{"$f":"D3892+D3893+D3894","v":3931},null,"B","/","/",3661238638136,{"$f":"J3892+J3893+J3894","v":247.9},null,null,null,"D6"]
[7633566,"FSBR 22 P",null,{"$f":"D3891+D3893+D3895","v":4078},null,"B","/","/",3661238638143,{"$f":"J3891+J3893+J3895","v":219.9},null,null,null,"D6"]
[7633567,"FSBR 29 P",null,{"$f":"D3892+D3893+D3895","v":4227},null,"B","/","/",3661238638150,{"$f":"J3892+J3893+J3895","v":247.9},null,null,null,"D6"]
[]
["COMPOSANTS"]
[7624149,"FSB. 22  ","MY125",3163,null,"/","/","/",3661238617353,{"$f":"J3877","v":204},1220,750,1050,"D6"]
[7624151,"FSB. 29  ","MY135",3312,null,"/","/","/",3661238617377,{"$f":"J3878","v":232},1220,750,1050,"D6"]
[7616272,"KIT EQUIPEMENT HYDRAULIQUE","MY404",470,null,"/","/","/",3661238603097,15,675,485,180,"D6"]
[7605717,"TABLEAU X OETROCOM 1 ","MY409",149,null,"/","/","/",3661238616264,0.9,400,200,100,"D6"]
[7605715,"TABLEAU R OETROCOM 2","MY410",445,null,"/","/","/",3661238616271,0.9,400,200,100,"D6"]
[]
[]
[7633568,"FVBX 22 P/EL110SL",null,{"$f":"D3902+D3903+D3904+D3905+D3906","v":4742},null,"B","B","XL",3661238638174,{"$f":"J3902+J3903+J3904+J3905+J3906","v":307.89999999999998},null,null,null,"D6"]
[7633569,"FVBR 22 P/EL110SL",null,{"$f":"D3902+D3903+D3904+D3905+D3907","v":5038},null,"B","B","XL",3661238638167,{"$f":"J3902+J3903+J3904+J3905+J3907","v":307.89999999999998},null,null,null,"D6"]
[]
["COMPOSANTS"]
[7624149,"FSB. 22  ","MY125",3163,null,"/","/","/",3661238617353,{"$f":"J3891","v":204},1220,750,1050,"D6"]
[7609915,"BALLON EL110SL","ER590",742,null,"/","/","/",3661238608726,83,700,680,940,"D6"]
[7614745,"KIT DE LIAISON BALLON EL110SL EQUIPEE","ER594",218,null,"/","/","/",3661238608122,5,860,250,135,"D6"]
[7616272,"KIT EQUIPEMENT HYDRAULIQUE","MY404",470,null,"/","/","/",3661238603097,{"$f":"J3893","v":15},675,485,180,"D6"]
[7605717,"TABLEAU X OETROCOM 1 ","MY409",149,null,"/","/","/",3661238616264,0.9,400,200,100,"D6"]
[7605715,"TABLEAU R OETROCOM 2","MY410",445,null,"/","/","/",3661238616271,0.9,400,200,100,"D6"]
[null,null,null,null,null,null,null,null,""]
[]
[7633570,"FVBX 22 P/EL160SL",null,{"$f":"D3916+D3918+D3919+D3920+D3921","v":5009},null,"B","B","XL",3661238638181,{"$f":"J3916+J3918+J3919+J3920+J3921","v":322.89999999999998},null,null,null,"D6"]
[7633571,"FVBX 29 P/EL160SL",null,{"$f":"D3917+D3918+D3919+D3920+D3921","v":5158},null,"B","B","XL",3661238638198,{"$f":"J3917+J3918+J3919+J3920+J3921","v":350.9},null,null,null,"D6"]
[7633572,"FVBR 22 P/EL160SL",null,{"$f":"D3916+D3918+D3919+D3920+D3922","v":5305},null,"B","B","XL",3661238638204,{"$f":"J3916+J3918+J3919+J3920+J3922","v":322.89999999999998},null,null,null,"D6"]
[7633573,"FVBR 29 P/EL160SL",null,{"$f":"D3917+D3918+D3919+D3920+D3922","v":5454},null,"B","B","XL",3661238638211,{"$f":"J3917+J3918+J3919+J3920+J3922","v":350.9},null,null,null,"D6"]
[]
["COMPOSANTS"]
[7624149,"FSB. 22  ","MY125",3163,null,"/","/","/",3661238617353,{"$f":"J3902","v":204},1220,750,1050,"D6"]
[7624151,"FSB. 29  ","MY135",3312,null,"/","/","/",3661238617377,{"$f":"J3892","v":232},1220,750,1050,"D6"]
[7616405,"BALLON EL160SL","ER592",969,null,"/","/","/",3661238608696,98,700,680,1200,"D6"]
[7614827,"KIT DE LIAISON BALLON EL160SL EQUIPEE","ER596",258,null,"/","/","/",3661238608146,5,860,250,135,"D6"]
[7616272,"KIT EQUIPEMENT HYDRAULIQUE","MY404",470,null,"/","/","/",3661238603097,{"$f":"J3905","v":15},675,485,180,"D6"]
[7605717,"TABLEAU X OETROCOM 1 ","MY409",149,null,"/","/","/",3661238616264,0.9,400,200,100,"D6"]
[7605715,"TABLEAU R OETROCOM 2","MY410",445,null,"/","/","/",3661238616271,0.9,400,200,100,"D6"]
[null,null,null,null,null,null,null,null,""]
[]
[7633574,"FSBX 22 F HOR",null,{"$f":"D3935+D3937+D3939","v":3721},null,"B","/","/",3661238638228,{"$f":"J3935+J3937+J3939","v":217.8},null,null,null,"D6"]
[7633575,"FSBX 22 F VER",null,{"$f":"D3935+D3937+D3940+D3941","v":3808},null,"B","/","/",3661238638235,{"$f":"J3935+J3937+J3940+J3941","v":220.70000000000002},null,null,null,"D6"]
[7633576,"FSBX 29 F HOR",null,{"$f":"D3936+D3937+D3939","v":3869},null,"B","/","/",3661238638242,{"$f":"J3936+J3937+J3939","v":245.8},null,null,null,"D6"]
[7633577,"FSBX 29 F VER",null,{"$f":"D3936+D3937+D3940+D3941","v":3956},null,"B","/","/",3661238638259,{"$f":"J3936+J3937+J3940+J3941","v":248.70000000000002},null,null,null,"D6"]
[7633578,"FSBR 22 F HOR",null,{"$f":"D3935+D3938+D3939","v":4017},null,"B","/","/",3661238638266,{"$f":"J3935+J3938+J3939","v":217.8},null,null,null,"D6"]
[7633579,"FSBR 22 F VER",null,{"$f":"D3935+D3938+D3940+D3941","v":4104},null,"B","/","/",3661238638273,{"$f":"J3935+J3938+J3940+J3941","v":220.70000000000002},null,null,null,"D6"]
[7633580,"FSBR 29 F HOR",null,{"$f":"D3936+D3938+D3939","v":4165},null,"B","/","/",3661238638280,{"$f":"J3936+J3938+J3939","v":245.8},null,null,null,"D6"]
[7633581,"FSBR 29 F VER",null,{"$f":"D3936+D3938+D3940+D3941","v":4252},null,"B","/","/",3661238638297,{"$f":"J3936+J3938+J3940+J3941","v":248.70000000000002},null,null,null,"D6"]
[]
["COMPOSANTS"]
[7627332,"FSB. 22 FF","MY122",3345,null,"/","/","/",3661238630222,214,1220,750,1050,"D6"]
[7627333,"FSB. 29 FF","MY132",3493,null,"/","/","/",3661238630239,242,1220,750,1050,"D6"]
[7605717,"TABLEAU X OETROCOM 1 ","MY409",149,null,"/","/","/",3661238616264,0.9,400,200,100,"D6"]
[7605715,"TABLEAU R OETROCOM 2","MY410",445,null,"/","/","/",3661238616271,0.9,400,200,100,"D6"]
[81998533,"TERMINAL HORIZONTAL STANDARD","DB90",227,null,"/","/","/",3661238001329,2.9,1015,150,145,"C0"]
[81998534,"TERMINAL VERTICAL NOIR","DB91",202,null,"/","/","/",3661238001312,4.9000000000000004,1150,260,270,"C0"]
[81998539,"COUDE A 90 °","DB96",112,null,"/","/","/",3661238001268,0.9,325,240,150,"C0"]
[]
[]
[7633583,"FVBX 22 F HOR/EL110SL",null,{"$f":"D3950+D3951+D3952+D3953+D3955","v":4760},null,"B","B","XL",3661238638303,{"$f":"J3950+J3951+J3952+J3953+J3955","v":305.79999999999995},null,null,null,"D6"]
[7633584,"FVBX 22 F VER/EL110SL",null,{"$f":"D3950+D3951+D3952+D3953+D3956+D3957","v":4847},null,"B","B","XL",3661238638310,{"$f":"J3950+J3951+J3952+J3953+J3956+J3957","v":308.69999999999993},null,null,null,"D6"]
[7633585,"FVBR 22 F HOR/EL110SL",null,{"$f":"D3950+D3951+D3952+D3954+D3955","v":5056},null,"B","B","XL",3661238638327,{"$f":"J3950+J3951+J3952+J3954+J3955","v":305.79999999999995},null,null,null,"D6"]
[7633586,"FVBR 22 F VER/EL110SL",null,{"$f":"D3950+D3951+D3952+D3954+D3956+D3957","v":5143},null,"B","B","XL",3661238638334,{"$f":"J3950+J3951+J3952+J3954+J3956+J3957","v":308.69999999999993},null,null,null,"D6"]
[]
["COMPOSANTS"]
[7627332,"FSB. 22 FF","MY122",3345,null,"/","/","/",3661238630222,{"$f":"J3935","v":214},1220,750,1050,"D6"]
[7609915,"BALLON EL110SL","ER590",742,null,"/","/","/",3661238608726,{"$f":"J3903","v":83},700,680,940,"D6"]
[7613103,"KIT DE LIAISON BALLON EL110SL","ER595",297,null,"/","/","/",3661238608115,{"$f":"J3866","v":5},860,250,135,"D6"]
[7605717,"TABLEAU X OETROCOM 1 ","MY409",149,null,"/","/","/",3661238616264,0.9,400,200,100,"D6"]
[7605715,"TABLEAU R OETROCOM 2","MY410",445,null,"/","/","/",3661238616271,0.9,400,200,100,"D6"]
[81998533,"TERMINAL HORIZONTAL STANDARD","DB90",227,null,"/","/","/",3661238001329,2.9,1015,150,145,"C0"]
[81998534,"TERMINAL VERTICAL NOIR","DB91",202,null,"/","/","/",3661238001312,4.9000000000000004,1150,260,270,"C0"]
[81998539,"COUDE A 90 °","DB96",112,null,"/","/","/",3661238001268,0.9,325,240,150,"C0"]
[null,null,null,null,null,null,null,null,""]
[]
[7633587,"FVBX 22 F HOR/EL160SL",null,{"$f":"D3970+D3972+D3973+D3974+D3976","v":5085},null,"B","B","XL",3661238638341,{"$f":"J3970+J3972+J3973+J3974+J3976","v":320.79999999999995},null,null,null,"D6"]
[7633588,"FVBX 22 F VER/EL160SL",null,{"$f":"D3970+D3972+D3973+D3974+D3977+D3978","v":5172},null,"B","B","XL",3661238638358,{"$f":"J3970+J3972+J3973+J3974+J3977+J3978","v":323.69999999999993},null,null,null,"D6"]
[7633589,"FVBX 29 F HOR/EL160SL",null,{"$f":"D3971+D3972+D3973+D3974+D3976","v":5233},null,"B","B","XL",3661238638365,{"$f":"J3971+J3972+J3973+J3974+J3976","v":348.79999999999995},null,null,null,"D6"]
[7633590,"FVBX 29 F VER/EL160SL",null,{"$f":"D3971+D3972+D3973+D3974+D3977+D3978","v":5320},null,"B","B","XL",3661238638372,{"$f":"J3971+J3972+J3973+J3974+J3977+J3978","v":351.69999999999993},null,null,null,"D6"]
[7633591,"FVBR 22 F HOR/EL160SL",null,{"$f":"D3970+D3972+D3973+D3975+D3976","v":5381},null,"B","B","XL",3661238638389,{"$f":"J3970+J3972+J3973+J3975+J3976","v":320.79999999999995},null,null,null,"D6"]
[7633592,"FVBR 22 F VER/EL160SL",null,{"$f":"D3970+D3972+D3973+D3975+D3977+D3978","v":5468},null,"B","B","XL",3661238638396,{"$f":"J3970+J3972+J3973+J3975+J3977+J3978","v":323.69999999999993},null,null,null,"D6"]
[7633593,"FVBR 29 F HOR/EL160SL",null,{"$f":"D3971+D3972+D3973+D3975+D3976","v":5529},null,"B","B","XL",3661238638402,{"$f":"J3971+J3972+J3973+J3975+J3976","v":348.79999999999995},null,null,null,"D6"]
[7633594,"FVBR 29 F VER/EL160SL",null,{"$f":"D3971+D3972+D3973+D3975+D3977+D3978","v":5616},null,"B","B","XL",3661238638419,{"$f":"J3971+J3972+J3973+J3975+J3977+J3978","v":351.69999999999993},null,null,null,"D6"]
[]
["COMPOSANTS"]
[7627332,"FSB. 22 FF","MY122",3345,null,"/","/","/",3661238630222,{"$f":"J3950","v":214},1220,750,1050,"D6"]
[7627333,"FSB. 29 FF","MY132",3493,null,"/","/","/",3661238630239,{"$f":"J3936","v":242},1220,750,1050,"D6"]
[7616405,"BALLON EL160SL","ER592",969,null,"/","/","/",3661238608696,{"$f":"J3918","v":98},700,680,1200,"D6"]
[7613082,"KIT DE LIAISON BALLON EL160SL","ER597",395,null,"/","/","/",3661238608139,{"$f":"J3880","v":5},860,250,135,"D6"]
[7605717,"TABLEAU X OETROCOM 1 ","MY409",149,null,"/","/","/",3661238616264,0.9,400,200,100,"D6"]
[7605715,"TABLEAU R OETROCOM 2","MY410",445,null,"/","/","/",3661238616271,0.9,400,200,100,"D6"]
[81998533,"TERMINAL HORIZONTAL STANDARD","DB90",227,null,"/","/","/",3661238001329,2.9,1015,150,145,"C0"]
[81998534,"TERMINAL VERTICAL NOIR","DB91",202,null,"/","/","/",3661238001312,4.9000000000000004,1150,260,270,"C0"]
[81998539,"COUDE A 90 °","DB96",112,null,"/","/","/",3661238001268,0.9,325,240,150,"C0"]
[]
[]
[7633600,"FSBX 22 PF HOR",null,{"$f":"D3991+D3993+D3994+D3996","v":4191},null,"B","/","/",3661238638914,{"$f":"J3991+J3993+J3994+J3996","v":232.8},null,null,null,"D6"]
[7633602,"FSBX 22 PF VER",null,{"$f":"D3991+D3993+D3994+D3997+D3998","v":4278},null,"B","/","/",3661238638921,{"$f":"J3991+J3993+J3994+J3997+J3998","v":235.70000000000002},null,null,null,"D6"]
[7633604,"FSBX 29 PF HOR",null,{"$f":"D3992+D3993+D3994+D3996","v":4339},null,"B","/","/",3661238638938,{"$f":"J3992+J3993+J3994+J3996","v":260.79999999999995},null,null,null,"D6"]
[7633605,"FSBX 29 PF VER",null,{"$f":"D3992+D3993+D3994+D3997+D3998","v":4426},null,"B","/","/",3661238638945,{"$f":"J3992+J3993+J3994+J3997+J3998","v":263.69999999999993},null,null,null,"D6"]
[7633606,"FSBR 22 PF HOR",null,{"$f":"D3991+D3993+D3995+D3996","v":4487},null,"B","/","/",3661238638952,{"$f":"J3991+J3993+J3995+J3996","v":232.8},null,null,null,"D6"]
[7633607,"FSBR 22 PF VER",null,{"$f":"D3991+D3993+D3995+D3997+D3998","v":4574},null,"B","/","/",3661238638969,{"$f":"J3991+J3993+J3995+J3997+J3998","v":235.70000000000002},null,null,null,"D6"]
[7633608,"FSBR 29 PF HOR",null,{"$f":"D3992+D3993+D3995+D3996","v":4635},null,"B","/","/",3661238638976,{"$f":"J3992+J3993+J3995+J3996","v":260.79999999999995},null,null,null,"D6"]
[7633609,"FSBR 29 PF VER",null,{"$f":"D3992+D3993+D3995+D3997+D3998","v":4722},null,"B","/","/",3661238638983,{"$f":"J3992+J3993+J3995+J3997+J3998","v":263.69999999999993},null,null,null,"D6"]
[]
["COMPOSANTS"]
[7627332,"FSB. 22 FF","MY122",3345,null,"/","/","/",3661238630222,{"$f":"J3970","v":214},1220,750,1050,"D6"]
[7627333,"FSB. 29 FF","MY132",3493,null,"/","/","/",3661238630239,{"$f":"J3971","v":242},1220,750,1050,"D6"]
[7616272,"KIT EQUIPEMENT HYDRAULIQUE","MY404",470,null,"/","/","/",3661238603097,{"$f":"J3920","v":15},675,485,180,"D6"]
[7605717,"TABLEAU X OETROCOM 1 ","MY409",149,null,"/","/","/",3661238616264,0.9,400,200,100,"D6"]
[7605715,"TABLEAU R OETROCOM 2","MY410",445,null,"/","/","/",3661238616271,0.9,400,200,100,"D6"]
[81998533,"TERMINAL HORIZONTAL STANDARD","DB90",227,null,"/","/","/",3661238001329,2.9,1015,150,145,"C0"]
[81998534,"TERMINAL VERTICAL NOIR","DB91",202,null,"/","/","/",3661238001312,4.9000000000000004,1150,260,270,"C0"]
[81998539,"COUDE A 90 °","DB96",112,null,"/","/","/",3661238001268,0.9,325,240,150,"C0"]
[]
[]
[7633610,"FVBX 22 PF HOR/EL110SL",null,{"$f":"D4007+D4008+D4009+D4010+D4011+D4013","v":5151},null,"B","B","XL",3661238638990,{"$f":"J4007+J4008+J4009+J4010+J4011+J4013","v":320.79999999999995},null,null,null,"D6"]
[7633611,"FVBX 22 PF VER/EL110SL",null,{"$f":"D4007+D4008+D4009+D4010+D4011+D4014+D4015","v":5238},null,"B","B","XL",3661238639003,{"$f":"J4007+J4008+J4009+J4010+J4011+J4014+J4015","v":323.69999999999993},null,null,null,"D6"]
[7633612,"FVBR 22 PF HOR/EL110SL",null,{"$f":"D4007+D4008+D4009+D4010+D4012+D4013","v":5447},null,"B","B","XL",3661238639010,{"$f":"J4007+J4008+J4009+J4010+J4012+J4013","v":320.79999999999995},null,null,null,"D6"]
[7633613,"FVBR 22 PF VER/EL110SL",null,{"$f":"D4007+D4008+D4009+D4010+D4012+D4014+D4015","v":5534},null,"B","B","XL",3661238639027,{"$f":"J4007+J4008+J4009+J4010+J4012+J4014+J4015","v":323.69999999999993},null,null,null,"D6"]
[]
["COMPOSANTS"]
[7627332,"FSB. 22 FF","MY122",3345,null,"/","/","/",3661238630222,{"$f":"J3991","v":214},1220,750,1050,"D6"]
[7609915,"BALLON EL110SL","ER590",742,null,"/","/","/",3661238608726,{"$f":"J3951","v":83},700,680,940,"D6"]
[7614745,"KIT DE LIAISON BALLON EL110SL EQUIPEE","ER594",218,null,"/","/","/",3661238608122,{"$f":"J3904","v":5},860,250,135,"D6"]
[7616272,"KIT EQUIPEMENT HYDRAULIQUE","MY404",470,null,"/","/","/",3661238603097,{"$f":"J3993","v":15},675,485,180,"D6"]
[7605717,"TABLEAU X OETROCOM 1 ","MY409",149,null,"/","/","/",3661238616264,0.9,400,200,100,"D6"]
[7605715,"TABLEAU R OETROCOM 2","MY410",445,null,"/","/","/",3661238616271,0.9,400,200,100,"D6"]
[81998533,"TERMINAL HORIZONTAL STANDARD","DB90",227,null,"/","/","/",3661238001329,2.9,1015,150,145,"C0"]
[81998534,"TERMINAL VERTICAL NOIR","DB91",202,null,"/","/","/",3661238001312,4.9000000000000004,1150,260,270,"C0"]
[81998539,"COUDE A 90 °","DB96",112,null,"/","/","/",3661238001268,0.9,325,240,150,"C0"]
[null,null,null,null,null,null,null,null,""]
[]
[7633614,"FVBX 22 PF HOR/EL160SL",null,{"$f":"D4028+D4030+D4031+D4032+D4033+D4035","v":5418},null,"B","B","XL",3661238639034,{"$f":"J4028+J4030+J4031+J4032+J4033+J4035","v":335.79999999999995},null,null,null,"D6"]
[7633615,"FVBX 22 PF VER/EL160SL",null,{"$f":"D4028+D4030+D4031+D4032+D4033+D4036+D4037","v":5505},null,"B","B","XL",3661238639041,{"$f":"J4028+J4030+J4031+J4032+J4033+J4036+J4037","v":338.69999999999993},null,null,null,"D6"]
[7633616,"FVBX 29 PF HOR/EL160SL",null,{"$f":"D4029+D4030+D4031+D4032+D4033+D4035","v":5566},null,"B","B","XL",3661238639058,{"$f":"J4029+J4030+J4031+J4032+J4033+J4035","v":363.79999999999995},null,null,null,"D6"]
[7633617,"FVBX 29 PF VER/EL160SL",null,{"$f":"D4029+D4030+D4031+D4032+D4033+D4036+D4037","v":5653},null,"B","B","XL",3661238639072,{"$f":"J4029+J4030+J4031+J4032+J4033+J4036+J4037","v":366.69999999999993},null,null,null,"D6"]
[7633618,"FVBR 22 PF HOR/EL160SL",null,{"$f":"D4028+D4030+D4031+D4032+D4034+D4035","v":5714},null,"B","B","XL",3661238639089,{"$f":"J4028+J4030+J4031+J4032+J4034+J4035","v":335.79999999999995},null,null,null,"D6"]
[7633619,"FVBR 22 PF VER/EL160SL",null,{"$f":"D4028+D4030+D4031+D4032+D4034+D4036+D4037","v":5801},null,"B","B","XL",3661238639096,{"$f":"J4028+J4030+J4031+J4032+J4034+J4036+J4037","v":338.69999999999993},null,null,null,"D6"]
[7633620,"FVBR 29 PF HOR/EL160SL",null,{"$f":"D4029+D4030+D4031+D4032+D4034+D4035","v":5862},null,"B","B","XL",3661238639102,{"$f":"J4029+J4030+J4031+J4032+J4034+J4035","v":363.79999999999995},null,null,null,"D6"]
[7633621,"FVBR 29 PF VER/EL160SL",null,{"$f":"D4029+D4030+D4031+D4032+D4034+D4036+D4037","v":5949},null,"B","B","XL",3661238639119,{"$f":"J4029+J4030+J4031+J4032+J4034+J4036+J4037","v":366.69999999999993},null,null,null,"D6"]
[]
["COMPOSANTS"]
[7627332,"FSB. 22 FF","MY122",3345,null,"/","/","/",3661238630222,{"$f":"J4007","v":214},1220,750,1050,"D6"]
[7627333,"FSB. 29 FF","MY132",3493,null,"/","/","/",3661238630239,{"$f":"J3992","v":242},1220,750,1050,"D6"]
[7616405,"BALLON EL160SL","ER592",969,null,"/","/","/",3661238608696,{"$f":"J3972","v":98},700,680,1200,"D6"]
[7614827,"KIT DE LIAISON BALLON EL160SL EQUIPEE","ER596",258,null,"/","/","/",3661238608146,{"$f":"J3919","v":5},860,250,135,"D6"]
[7616272,"KIT EQUIPEMENT HYDRAULIQUE","MY404",470,null,"/","/","/",3661238603097,{"$f":"J4010","v":15},675,485,180,"D6"]
[7605717,"TABLEAU X OETROCOM 1 ","MY409",149,null,"/","/","/",3661238616264,0.9,400,200,100,"D6"]
[7605715,"TABLEAU R OETROCOM 2","MY410",445,null,"/","/","/",3661238616271,0.9,400,200,100,"D6"]
[81998533,"TERMINAL HORIZONTAL STANDARD","DB90",227,null,"/","/","/",3661238001329,2.9,1015,150,145,"C0"]
[81998534,"TERMINAL VERTICAL NOIR","DB91",202,null,"/","/","/",3661238001312,4.9000000000000004,1150,260,270,"C0"]
[81998539,"COUDE A 90 °","DB96",112,null,"/","/","/",3661238001268,0.9,325,240,150,"C0"]
[null,null,null,null,null,null,null,null,""]
[]
[7633623,"FSX 22",null,{"$f":"D4046+D4048","v":2225},null,"Pas concerné par l'étiquettage",null,null,3661238639126,{"$f":"J4046+J4048","v":194.9},null,null,null,"D6"]
[7633624,"FSX 29",null,{"$f":"D4047+D4048","v":2384},null,"Pas concerné par l'étiquettage",null,null,3661238639133,{"$f":"J4047+J4048","v":222.9},null,null,null,"D6"]
[7633627,"FSR 22",null,{"$f":"D4046+D4049","v":2521},null,"Pas concerné par l'étiquettage",null,null,3661238639232,{"$f":"J4046+J4049","v":194.9},null,null,null,"D6"]
[7633628,"FSR 29",null,{"$f":"D4047+D4049","v":2680},null,"Pas concerné par l'étiquettage",null,null,3661238639249,{"$f":"J4047+J4049","v":222.9},null,null,null,"D6"]
[]
["COMPOSANTS"]
[7624147,"FS. 22","MY130",2076,null,"/","/","/",3661238617360,194,1220,750,1050,"D6"]
[7624152,"FS. 29","MY140",2235,null,"/","/","/",3661238617384,222,1220,750,1050,"D6"]
[7605717,"TABLEAU X OETROCOM 1 ","MY409",149,null,"/","/","/",3661238616264,0.9,400,200,100,"D6"]
[7605715,"TABLEAU R OETROCOM 2","MY410",445,null,"/","/","/",3661238616271,0.9,400,200,100,"D6"]
[]
[]
[7633631,"FVX 22/EL110SL",null,{"$f":"D4056+D4057+D4058+D4059","v":3264},null,"Pas concerné par l'étiquettage",null,null,3661238639270,{"$f":"J4056+J4057+J4058+J4059","v":282.89999999999998},null,null,null,"D6"]
[7633632,"FVR 22/EL110SL",null,{"$f":"D4056+D4057+D4058+D4060","v":3560},null,"Pas concerné par l'étiquettage",null,null,3661238639287,{"$f":"J4056+J4057+J4058+J4060","v":282.89999999999998},null,null,null,"D6"]
[]
["COMPOSANTS"]
[7624147,"FS. 22","MY130",2076,null,"/","/","/",3661238617360,{"$f":"J4046","v":194},1220,750,1050,"D6"]
[7609915,"BALLON EL110SL","ER590",742,null,"/","/","/",3661238608726,{"$f":"J3865","v":83},700,680,940,"D6"]
[7613103,"KIT DE LIAISON BALLON EL110SL","ER595",297,null,"/","/","/",3661238608115,{"$f":"J3866","v":5},860,250,135,"D6"]
[7605717,"TABLEAU X OETROCOM 1 ","MY409",149,null,"/","/","/",3661238616264,0.9,400,200,100,"D6"]
[7605715,"TABLEAU R OETROCOM 2","MY410",445,null,"/","/","/",3661238616271,0.9,400,200,100,"D6"]
[null,null,null,null,null,null,null,null,""]
[]
[7633633,"FVX 22/EL160SL",null,{"$f":"D4069+D4071+D4072+D4073","v":3589},null,"Pas concerné par l'étiquettage",null,null,3661238639294,{"$f":"J4069+J4071+J4072+J4073","v":297.89999999999998},null,null,null,"D6"]
[7633634,"FVX 29/EL160SL",null,{"$f":"D4070+D4071+D4072+D4073","v":3748},null,"Pas concerné par l'étiquettage",null,null,3661238639300,{"$f":"J4070+J4071+J4072+J4073","v":325.89999999999998},null,null,null,"D6"]
[7633635,"FVR 22/EL160SL",null,{"$f":"D4069+D4071+D4072+D4074","v":3885},null,"Pas concerné par l'étiquettage",null,null,3661238639317,{"$f":"J4069+J4071+J4072+J4074","v":297.89999999999998},null,null,null,"D6"]
[7633636,"FVR 29/EL160SL",null,{"$f":"D4070+D4071+D4072+D4074","v":4044},null,"Pas concerné par l'étiquettage",null,null,3661238639324,{"$f":"J4070+J4071+J4072+J4074","v":325.89999999999998},null,null,null,"D6"]
[]
["COMPOSANTS"]
[7624147,"FS. 22","MY130",2076,null,"/","/","/",3661238617360,{"$f":"J4056","v":194},1220,750,1050,"D6"]
[7624152,"FS. 29","MY140",2235,null,"/","/","/",3661238617384,{"$f":"J4047","v":222},1220,750,1050,"D6"]
[7616405,"BALLON EL160SL","ER592",969,null,"/","/","/",3661238608696,{"$f":"J3879","v":98},700,680,1200,"D6"]
[7613082,"KIT DE LIAISON BALLON EL160SL","ER597",395,null,"/","/","/",3661238608139,{"$f":"J3880","v":5},860,250,135,"D6"]
[7605717,"TABLEAU X OETROCOM 1 ","MY409",149,null,"/","/","/",3661238616264,0.9,400,200,100,"D6"]
[7605715,"TABLEAU R OETROCOM 2","MY410",445,null,"/","/","/",3661238616271,0.9,400,200,100,"D6"]
[]
[]
[7633637,"FSX 22 P",null,{"$f":"D4083+D4085+D4086","v":2695},null,"Pas concerné par l'étiquettage",null,null,3661238639331,{"$f":"J4083+J4085+J4086","v":209.9},null,null,null,"D6"]
[7633638,"FSX 29 P",null,{"$f":"D4084+D4085+D4086","v":2854},null,"Pas concerné par l'étiquettage",null,null,3661238639348,{"$f":"J4084+J4085+J4086","v":237.9},null,null,null,"D6"]
[7633639,"FSR 22 P",null,{"$f":"D4083+D4085+D4087","v":2991},null,"Pas concerné par l'étiquettage",null,null,3661238639355,{"$f":"J4083+J4085+J4087","v":209.9},null,null,null,"D6"]
[7633640,"FSR 29 P",null,{"$f":"D4084+D4085+D4087","v":3150},null,"Pas concerné par l'étiquettage",null,null,3661238639362,{"$f":"J4084+J4085+J4087","v":237.9},null,null,null,"D6"]
[]
["COMPOSANTS"]
[7624147,"FS. 22","MY130",2076,null,"/","/","/",3661238617360,{"$f":"J4069","v":194},1220,750,1050,"D6"]
[7624152,"FS. 29","MY140",2235,null,"/","/","/",3661238617384,{"$f":"J4070","v":222},1220,750,1050,"D6"]
[7616272,"KIT EQUIPEMENT HYDRAULIQUE","MY404",470,null,"/","/","/",3661238603097,{"$f":"J4032","v":15},675,485,180,"D6"]
[7605717,"TABLEAU X OETROCOM 1 ","MY409",149,null,"/","/","/",3661238616264,0.9,400,200,100,"D6"]
[7605715,"TABLEAU R OETROCOM 2","MY410",445,null,"/","/","/",3661238616271,0.9,400,200,100,"D6"]
[]
[]
[7633641,"FVX 22 P/EL110SL",null,{"$f":"D4094+D4095+D4096+D4097+D4098","v":3655},null,"Pas concerné par l'étiquettage",null,null,3661238639379,{"$f":"J4094+J4095+J4096+J4097+J4098","v":297.89999999999998},null,null,null,"D6"]
[7633642,"FVR 22 P/EL110SL",null,{"$f":"D4094+D4095+D4096+D4097+D4099","v":3951},null,"Pas concerné par l'étiquettage",null,null,3661238639393,{"$f":"J4094+J4095+J4096+J4097+J4099","v":297.89999999999998},null,null,null,"D6"]
[]
["COMPOSANTS"]
[7624147,"FS. 22","MY130",2076,null,"/","/","/",3661238617360,{"$f":"J4083","v":194},1220,750,1050,"D6"]
[7609915,"BALLON EL110SL","ER590",742,null,"/","/","/",3661238608726,{"$f":"J3903","v":83},700,680,940,"D6"]
[7614745,"KIT DE LIAISON BALLON EL110SL EQUIPEE","ER594",218,null,"/","/","/",3661238608122,{"$f":"J3904","v":5},860,250,135,"D6"]
[7616272,"KIT EQUIPEMENT HYDRAULIQUE","MY404",470,null,"/","/","/",3661238603097,{"$f":"J4085","v":15},675,485,180,"D6"]
[7605717,"TABLEAU X OETROCOM 1 ","MY409",149,null,"/","/","/",3661238616264,0.9,400,200,100,"D6"]
[7605715,"TABLEAU R OETROCOM 2","MY410",445,null,"/","/","/",3661238616271,0.9,400,200,100,"D6"]
[null,null,null,null,""]
[]
[7633643,"FVX 22 P/EL160SL",null,{"$f":"D4108+D4110+D4111+D4112+D4113","v":3922},null,"Pas concerné par l'étiquettage",null,null,3661238639409,{"$f":"J4108+J4110+J4111+J4112+J4113","v":312.89999999999998},null,null,null,"D6"]
[7633644,"FVX 29 P/EL160SL",null,{"$f":"D4109+D4110+D4111+D4112+D4113","v":4081},null,"Pas concerné par l'étiquettage",null,null,3661238639416,{"$f":"J4109+J4110+J4111+J4112+J4113","v":340.9},null,null,null,"D6"]
[7633645,"FVR 22 P/EL160SL",null,{"$f":"D4108+D4110+D4111+D4112+D4114","v":4218},null,"Pas concerné par l'étiquettage",null,null,3661238639423,{"$f":"J4108+J4110+J4111+J4112+J4114","v":312.89999999999998},null,null,null,"D6"]
[7633646,"FVR 29 P/EL160SL",null,{"$f":"D4109+D4110+D4111+D4112+D4114","v":4377},null,"Pas concerné par l'étiquettage",null,null,3661238639430,{"$f":"J4109+J4110+J4111+J4112+J4114","v":340.9},null,null,null,"D6"]
[]
["COMPOSANTS"]
[7624147,"FS. 22","MY130",2076,null,"/","/","/",3661238617360,{"$f":"J4094","v":194},1220,750,1050,"D6"]
[7624152,"FS. 29","MY140",2235,null,"/","/","/",3661238617384,{"$f":"J4084","v":222},1220,750,1050,"D6"]
[7616405,"BALLON EL160SL","ER592",969,null,"/","/","/",3661238608696,{"$f":"J4030","v":98},700,680,1200,"D6"]
[7614827,"KIT DE LIAISON BALLON EL160SL EQUIPEE","ER596",258,null,"/","/","/",3661238608146,{"$f":"J4031","v":5},860,250,135,"D6"]
[7616272,"KIT EQUIPEMENT HYDRAULIQUE","MY404",470,null,"/","/","/",3661238603097,{"$f":"J4097","v":15},675,485,180,"D6"]
[7605717,"TABLEAU X OETROCOM 1 ","MY409",149,null,"/","/","/",3661238616264,0.9,400,200,100,"D6"]
[7605715,"TABLEAU R OETROCOM 2","MY410",445,null,"/","/","/",3661238616271,0.9,400,200,100,"D6"]
[null,null,null,null,null,null,null,null,""]
["OPTIONS FS./FSB."]
["OPTIONS POUR TABLEAU X OETROCOM 1 "]
[85757741,"SONDE EXTERIEURE","FM46",40,0.01,"/","/","/",3661238022751,0.1,200,150,40,"C0"]
[88017904,"THERMOSTAT AMBIANCE PROGRAMMABLE","AD191",158,0.08,"/","/","/",3661238102415,0.2,130,90,55,"C0"]
[88017010,"THERMOSTAT D'AMBIANCE PROGRAMMABLE (SANS FILS)","AD192",280,0.08,"/","/","/",3661238102439,0.4,175,150,90,"C0"]
[7609765,"THERMOSTAT D'AMBIANCE MODULANT FILAIRE RS200 -3","AD306",202,0.08,"/","/","/",8713809266462,0.4,148,100,52,"C0"]
[7609764,"THERMOSTAT D'AMBIANCE MODULANT RADIO RS200 -3R","AD305",333,0.08,"/","/","/",8713809266455,0.8,150,110,110,"C0"]
[]
["OPTIONS POUR TABLEAU R OETROCOM 2"]
[85757741,"SONDE EXTERIEURE","FM46",40,0.01,"/","/","/",3661238022751,0.1,200,150,40,"C0"]
[7616602,"PLATINE + SONDE POUR 1 CIRCUIT AVEC VANNE MELANGEUSE","MY420",255,0.01,"/","/","/",3661238625747,0.5,305,215,100,"D6"]
[88017904,"THERMOSTAT AMBIANCE PROGRAMMABLE","AD191",158,0.08,"/","/","/",3661238102415,0.2,130,90,55,"C0"]
[88017010,"THERMOSTAT D'AMBIANCE PROGRAMMABLE (SANS FILS)","AD192",280,0.08,"/","/","/",3661238102439,0.4,175,150,90]
[7609765,"THERMOSTAT D'AMBIANCE MODULANT FILAIRE RS200 -3","AD306",202,0.08,"/","/","/",8713809266462,0.4,148,100,52,"C0"]
[7609764,"THERMOSTAT D'AMBIANCE MODULANT RADIO RS200 -3R","AD305",333,0.08,"/","/","/",8713809266455,0.8,150,110,110,"C0"]
[]
["OPTIONS ECS"]
[100000030,"COLIS OPTION SONDE ECS","AD212",48,0.01,"/","/","/",3661238011168,0.2,200,150,30,"C0"]
[7622082,"KIT ACI","MY417",122,null,"/","/","/",3661238614031,0.5,250,150,100,"C6"]
[7619012,"TESTEUR D'ANODE MAGNESIUM","MY408",61,null,"/","/","/",3661238608818,0.5,185,130,105,"D6"]
[]
["OPTIONS CHAUDIERE",null,null,null,null,null,null,null,""]
[100012500,"FILTRE DEGAZEUR TIGERLOOP COMBI",null,133,null,"/","/","/",null,null,null,null,null,"C0"]
[100020045,"KIT FILTRE FERNOX TF1",null,253,null,"/","/","/",null,null,null,null,null,"C0"]
[]
["MODULES HYDRAULIQUES",null,null,null,null,null,null,null,""]
[7627062,"TUBULURES DE LIAISON CHAUDIERE / MODULES DROITE FS./FSB.","MY423",168,null,"/","/","/",3661238625730,5.5,615,205,205,"D6"]
[7627192,"TUBULURES DE LIAISON CHAUDIERE / MODULES GAUCHE  FS./FSB.","MY424",168,null,"/","/","/",3661238625716,5.5,615,205,205,"D6"]
[7627199,"OPTION 2 FLEXIBLES MONTAGE MURAL ","MY425",163,null,"/","/","/",3661238625723,6,860,250,135,"D6"]
[7627079,"KIT DE SECURITE POUR  FS./FSB./FSC.","MY427",127,null,"/","/","/",3661238627079,1.6,400,200,100,"D6"]
[100020164,"COLLECTEUR 2/3 CIRCUITS","EA140",341,null,"/","/","/",3661238575011,6.6,660,180,200,"C0"]
[100020167,"CIRCUIT DIRECT P.ELEC HEE","EA143",631,0.17,"/","/","/",3661238575042,5.0999999999999996,460,270,235,"C0"]
[100020168,"CIRCUIT V3V P.ELEC HEE","EA144",897,0.17,"/","/","/",3661238575059,6,460,270,235,"C0"]
[100020165,"CONSOLE MUR COLLECTEUR","EA141",43,null,"/","/","/",3661238575028,1.2,220,125,70,"C0"]
[100020166,"CONSOLE MUR 1 MODULE","EA142",114,null,"/","/","/",3661238575035,1.6,220,125,70,"C0"]
[7629813,"TUB CHAUDIERE/MODULE DROITE EF/EFU ","MY460",168,null,"/","/","/",3661238627734,3.5,615,205,205,"D6"]
[7629826,"KIT DE SECURITE  EF/EFU/EFU C  ","MY480",127,null,"/","/","/",3661238627086,1,400,200,100,"D6"]
[]
["OPTIONS FSB. F"]
[81998533,"TERMINAL HORIZONTAL STANDARD","DB90",227,null,"/","/","/",3661238001329,2.9,1015,150,145,"C0"]
[81998544,"TERMINAL HORIZONTAL LONG","DB87",204,null,"/","/","/",3661238001220,3.5,1200,150,150,"C0"]
[81998545,"CARTOUCHE SILENCIEUX POUR TERMINAL HORIZONTAL","DB88",102,null,"/","/","/",3661238001213,0.7,325,145,145,"C0"]
[81998548,"MANCHON DE VISITE LG= 0.25 M","DB85",154,null,"/","/","/",3661238001206,1,320,150,145,"C0"]
[81998549,"COUDE DE VISITE 90°","DB86",223,null,"/","/","/",3661238001190,1,320,240,150,"C0"]
[81998534,"TERMINAL VERTICAL NOIR","DB91",202,null,"/","/","/",3661238001312,4.9000000000000004,1150,260,270,"C0"]
[81998543,"TERMINAL VERTICAL ROUGE","DB89",196,null,"/","/","/",3661238001237,4.8,1145,265,270,"C0"]
[81998535,"RALLONGE LG 1 M","DB92",112,null,"/","/","/",3661238001305,2.5,1025,145,145,"C0"]
[81998536,"RALLONGE LG 0.5 M","DB93",79,null,"/","/","/",3661238001299,1.3,525,150,150,"C0"]
[81998537,"RALLONGE LG 0.25 M","DB94",71,null,"/","/","/",3661238001282,0.8,325,150,150,"C0"]
[81998538,"MANCHON DE COMPENSATION DE 0.39 A 0.64 M","DB95",175,null,"/","/","/",3661238001275,1.8,520,145,150,"C0"]
[81998539,"COUDE A 90 °","DB96",112,null,"/","/","/",3661238001268,0.9,325,240,150,"C0"]
[81998540,"JEU DE 2 COUDES A 45 °","DB97",168,null,"/","/","/",3661238001251,1.1000000000000001,325,240,150,"C0"]
[81998542,"PANIER DE PROTECTION EN INOX","DB99",132,null,"/","/","/",3661238001244,1.6,335,330,390,"C0"]
[]
[84837731,"EMBASE D'ETANCHEITE POUR TOIT PLAT","CX51",42,null,"/","/","/",3661238014343,0.6,400,400,155,"C0"]
[84837121,"TUILE A DOUILLE 5 A 25° NOIRE","CX121",110,null,"/","/","/",3661238014428,3,510,250,145,"C0"]
[84837732,"TUILE A DOUILLE 25 A 45° NOIRE","CX52",76,null,"/","/","/",3661238014336,3,520,250,145,"C0"]
[84837734,"TUILE A DOUILLE 35 A 55° NOIRE","CX63",95,null,"/","/","/",3661238014312,3.2,510,265,180,"C0"]
[84837120,"TUILE A DOUILLE 5 A 25° ROUGE","CX120",110,null,"/","/","/",3661238014435,3,515,245,145,"C0"]
[84837783,"TUILE A DOUILLE 25 A 45° ROUGE","CX83",76,null,"/","/","/",3661238014213,3,515,250,150,"C0"]
[84837784,"TUILE A DOUILLE 35 A 55° ROUGE","CX84",95,null,"/","/","/",3661238014206,3,520,265,180,"C0"]
[84837729,"SORTIE DE TOIT EN PENTE DE 40° A 60° ( uniquement pour tuiles mécaniques)","CX49",175,null,"/","/","/",3661238014367,3.5,920,700,320,"C0"]
[84837779,"COLLIER DE FIXATION Ø 125 MM PATTE LONGUE","CX79",14,null,"/","/","/",3661238014237,0.4,230,160,200,"C0"]
[]
[]
[null,null,null,null,null,null,null,null,null,null,null,null,null,"D6"]
[7633549,"FSBX 36",null,{"$f":"D4188+D4191","v":3806},null,"B","/","/",3661238638006,241.9,null,null,null,"D6"]
[7633550,"FSBX 46",null,{"$f":"D4189+D4191","v":4300},null,"B","/","/",3661238638013,269.89999999999998,null,null,null,"D6"]
[7633553,"FSBR 36",null,{"$f":"D4188+D4192","v":4102},null,"B","/","/",3661238638044,241.9,null,null,null,"D6"]
[7633554,"FSBR 46",null,{"$f":"D4189+D4192","v":4596},null,"B","/","/",3661238638051,269.89999999999998,null,null,null,"D6"]
[]
["COMPOSANTS"]
[7624155,"FSB. 36   ","MY145",3657,null,"/","/","/",3661238617391,241,1425,750,1060,"D6"]
[7624866,"FSB. 46 *","MY154",4151,null,"/","/","/",3661238643321,269,1200,1200,1315,"D6"]
[null,"* JAQUETTE ET BRULEUR A MONTER"]
[7605717,"TABLEAU X OETROCOM 1 ","MY409",149,null,"/","/","/",3661238616264,0.9,400,200,100,"D6"]
[7605715,"TABLEAU R OETROCOM 2","MY410",445,null,"/","/","/",3661238616271,0.9,400,200,100,"D6"]
[]
[]
[7633625,"FSX 36",null,{"$f":"D4201+D4204","v":2629},null,"/","/","/",3661238639218,null,null,null,null,"D6"]
[7633626,"FSX 46",null,{"$f":"D4202+D4204","v":2985},null,"/","/","/",3661238639225,null,null,null,null,"D6"]
[7633629,"FSR 36",null,{"$f":"D4201+D4205","v":2925},null,"/","/","/",3661238639256,null,null,null,null,"D6"]
[7633630,"FSR 46",null,{"$f":"D4202+D4205","v":3281},null,"/","/","/",3661238639263,null,null,null,null,"D6"]
[]
["COMPOSANTS"]
[7624159,"FS. 36","MY150",2480,null,"/","/","/",3661238617407,null,1425,750,1060,"D6"]
[7624876,"FS. 46 *","MY158",2836,null,"/","/","/",null,null,1200,1200,null,"D6"]
[null,"* JAQUETTE A MONTER",null,null,null,"/","/","/"]
[7605717,"TABLEAU X OETROCOM 1 ","MY409",149,null,"/","/","/",3661238616264,0.9,400,200,100,"D6"]
[7605715,"TABLEAU R OETROCOM 2","MY410",445,null,"/","/","/",3661238616271,0.9,400,200,100,"D6"]
[]
["OPTIONS ECS"]
[7639559,"KIT DE LIAISON FS/FSB/FSC - BALLON INDEPENDANT OBLC/OBPB","ER598",479,null,"/","/","/",3661238641679,7,600,500,135,"D6"]
[]
["FUMISTERIE"]
[null,"PPS Ø 110 mm"]
[84887577,"KIT DE RACCORDEMENT CHEMINEE PPS Ø 110 mm","DY177",253,null,"/","/","/",3661238013223,2.68,395,300,510,"C0"]
[84887578,"TUYAU PPS Ø 110 mm LG = 1950 mm (GRIS)","DY178",71,null,"/","/","/",3661238013216,2.46,1960,150,150,"C0"]
[84887579,"TUYAU PPS Ø 110 mm LG = 1000 mm (GRIS)","DY179",40,null,"/","/","/",3661238013209,1.24,1015,130,140,"C0"]
[84887580,"TUYAU PPS Ø 110 mm LG = 500 mm (GRIS)","DY180",30,null,"/","/","/",3661238013193,0.62,515,135,140,"C0"]
[84887581,"COUDE PPS 87° Ø 110 mm (GRIS)","DY181",35,null,"/","/","/",3661238013186,0.33,255,190,150,"C0"]
[84887582,"COUDE PPS 45° Ø 110 mm (GRIS)","DY182",47,null,"/","/","/",3661238013179,0.52,295,215,165,"C0"]
[84887583,"T DE REVISION Ø 110 mm (GRIS)","DY183",47,null,"/","/","/",3661238013162,0.46,300,150,150,"C0"]
[84887587,"ETOILE DE CENTRAGE PPS  Ø 110 mm (2 PIECES)","DY187",14,null,"/","/","/",3661238013124,0.1,300,300,30,"C0"]
[84887588,"COUDE DE REVISION PPS 87° Ø 110 mm (GRIS)","DY188",71,null,"/","/","/",3661238013117,0.52,315,235,150,"C0"]
[84887772,"PLAQUE DE FINITION","DY772",57,null,"/","/","/",3661238011458,0.49,310,230,145,"C0"]
[84887773,"FOURREAU Ø165mm L 500mm","DY773",40,null,"/","/","/",3661238011441,1.23,515,165,170,"C3"]
[84887435,"GRILLE D'AERATION EXTERIEURE 250 X 300 mm","DY35",23,null,"/","/","/",3661238013889,0.35,300,250,30,"C0"]
[100015325,"KIT N° 1 RACCORDEMENT CHEMINÉE FLEXIBLE PPS Ø 80 mm","DY895",231,null,"/","/","/",3661238380110,2.87,395,395,380,"C0"]
[100015327,"TUBE FLEXIBLE LG=12,5M","DY897",347,null,"/","/","/",3661238380134,8.6999999999999993,1200,1220,250,"C0"]
[100015326,"TUBE FLEXIBLE LG=50M","DY896",1216,null,"/","/","/",3661238380127,35,1600,1660,410,"C0"]
[84887618,"ETOILE DE CENTRAGE POUR FLEXIBLE Ø 80  mm (2 PIÈCES)","DY618",36,null,"/","/","/",3661238012912,0.2,300,300,70,"C0"]
[100015328,"PIÈCE DE COUPLAGE FLEXIBLE Ø 80 mm","DY898",70,null,"/","/","/",3661238380141,0.25,150,150,150,"C0"]
[100015331,"OUTIL D'AIDE À L'INSERTION Ø 80 mm","DY901",174,null,"/","/","/",3661238380172,1.4,300,210,185,"C0"]
[100015330,"PIÈCE D'INSPECTION POUR TUBE FLEXIBLE","DY900",125,null,"/","/","/",3661238380165,0.5,295,140,140,"C0"]
[100015329,"TERMINAL AVEC SOLIN FLEX. Ø 80 mm","DY899",174,null,"/","/","/",3661238380158,1.74,385,385,250,"C0"]
[]
[]
[100005999,"DK 28/100-2","FS3",2068,null,"Pas concerné par l'étiquettage",null,null,3661238109421,180,750,670,1650,"D0"]
[100006000,"DK 35/150-2 ","FS4",2786,null,"Pas concerné par l'étiquettage",null,null,3661238109414,230,850,790,1700,"D0"]
[]
["OPTIONS"]
[100005977,"KIT DE RACCORDEMENT CHAUFFAGE","FL13",486,null,"/","/","/",3661238109438,14,560,440,315,"C0"]
[85287002,"KIT DE RACCORDEMENT SANITAIRE","FL11",194,null,"/","/","/",3661238028708,1.9,310,210,130,"C0"]
[88017904,"THERMOSTAT AMBIANCE PROGRAMMABLE","AD191",158,0.08,"/","/","/",3661238102415,0.25,135,90,55,"C0"]
[88017010,"THERMOSTAT D'AMBIANCE PROGRAMMABLE (SANS FILS)","AD192",280,0.08,"/","/","/",3661238102439,0.42499999999999999,180,150,90,"C0"]
[]
[]
[100004396,"PKX 264 CORPS MONTE",null,3564,null,"Pas concerné par l'étiquettage",null,null,3661238111318,null,null,null,null,"C0"]
[100004397,"PKX 265 CORPS MONTE",null,4130,null,"Pas concerné par l'étiquettage",null,null,3661238111301,null,null,null,null,"C0"]
[100004398,"PKX 266 CORPS MONTE",null,4478,null,"Pas concerné par l'étiquettage",null,null,3661238111295,null,null,null,null,"C0"]
[100004399,"PKX 267 CORPS MONTE",null,4775,null,"Pas concerné par l'étiquettage",null,null,3661238111288,null,null,null,null,"C0"]
[100004400,"PKX 268 CORPS MONTE",null,5078,null,"Pas concerné par l'étiquettage",null,null,3661238111271,null,null,null,null,"C0"]
[100004401,"PKX2 266 CORPS MONTE",null,4586,null,"Pas concerné par l'étiquettage",null,null,3661238111264,null,null,null,null,"C0"]
[100004402,"PKX2 267 CORPS MONTE",null,4883,null,"Pas concerné par l'étiquettage",null,null,3661238111257,null,null,null,null,"C0"]
[100004403,"PKX2 268 CORPS MONTE",null,5186,null,"Pas concerné par l'étiquettage",null,null,3661238111240,null,null,null,null,"C0"]
[100004404,"PKR 264 CORPS MONTE",null,4228,null,"Pas concerné par l'étiquettage",null,null,3661238111233,null,null,null,null,"C0"]
[100004405,"PKR 265 CORPS MONTE",null,4794,null,"Pas concerné par l'étiquettage",null,null,3661238111226,null,null,null,null,"C0"]
[100004406,"PKR 266 CORPS MONTE",null,5142,null,"Pas concerné par l'étiquettage",null,null,3661238111219,null,null,null,null,"C0"]
[100004407,"PKR 267 CORPS MONTE",null,5439,null,"Pas concerné par l'étiquettage",null,null,3661238111202,null,null,null,null,"C0"]
[100004408,"PKR 268 CORPS MONTE",null,5742,null,"Pas concerné par l'étiquettage",null,null,3661238111196,null,null,null,null,"C0"]
[100004409,"PKR 266 + AD217  CORPS MONTE",null,5430,null,"Pas concerné par l'étiquettage",null,null,3661238111189,null,null,null,null,"C0"]
[100004410,"PKR 267 + AD217  CORPS MONTE",null,5727,null,"Pas concerné par l'étiquettage",null,null,3661238111172,null,null,null,null,"C0"]
[100004411,"PKR 268 + AD217  CORPS MONTE",null,6030,null,"Pas concerné par l'étiquettage",null,null,3661238111165,null,null,null,null,"C0"]
[100004416,"PKX 264 CORPS MONTE + OBC 162 /TA",null,5650,null,"Pas concerné par l'étiquettage",null,null,3661238111158,null,null,null,null,"C0"]
[100004418,"PKX 265 CORPS MONTE + OBC 162 /TA",null,6216,null,"Pas concerné par l'étiquettage",null,null,3661238111141,null,null,null,null,"C0"]
[100004419,"PKX 264 CORPS MONTE + OBC 252 /TA",null,5986,null,"Pas concerné par l'étiquettage",null,null,3661238111134,null,null,null,null,"C0"]
[100004421,"PKX 265 CORPS MONTE + OBC 252 /TA",null,6552,null,"Pas concerné par l'étiquettage",null,null,3661238111127,null,null,null,null,"C0"]
[100004422,"PKR 264 CORPS MONTE + OBC 162 /TA",null,6314,null,"Pas concerné par l'étiquettage",null,null,3661238111110,null,null,null,null,"C0"]
[100004423,"PKR 265 CORPS MONTE + OBC 162 /TA",null,6880,null,"Pas concerné par l'étiquettage",null,null,3661238111103,null,null,null,null,"C0"]
[100004424,"PKR 264 CORPS MONTE + OBC 252 /TA",null,6650,null,"Pas concerné par l'étiquettage",null,null,3661238111097,null,null,null,null,"C0"]
[100004425,"PKR 265 CORPS MONTE + OBC 252 /TA",null,7216,null,"Pas concerné par l'étiquettage",null,null,3661238111080,null,null,null,null,"C0"]
[]
[100004478,"PKX 264 CORPS NON MONTE",null,3566,null,"Pas concerné par l'étiquettage",null,null,3661238110908,null,null,null,null,"C0"]
[100004479,"PKX 265 CORPS NON MONTE",null,4132,null,"Pas concerné par l'étiquettage",null,null,3661238110892,null,null,null,null,"C0"]
[100004480,"PKX 266 CORPS NON MONTE",null,4481,null,"Pas concerné par l'étiquettage",null,null,3661238110885,null,null,null,null,"C0"]
[100004481,"PKX 267 CORPS NON MONTE",null,4778,null,"Pas concerné par l'étiquettage",null,null,3661238110878,null,null,null,null,"C0"]
[100004482,"PKX 268 CORPS NON MONTE",null,5082,null,"Pas concerné par l'étiquettage",null,null,3661238110861,null,null,null,null,"C0"]
[100004483,"PKX2 266 CORPS NON MONTE",null,4589,null,"Pas concerné par l'étiquettage",null,null,3661238110854,null,null,null,null,"C0"]
[100004484,"PKX2 267 CORPS NON MONTE",null,4886,null,"Pas concerné par l'étiquettage",null,null,3661238110847,null,null,null,null,"C0"]
[100004485,"PKX2 268 CORPS NON MONTE",null,5190,null,"Pas concerné par l'étiquettage",null,null,3661238110830,null,null,null,null,"C0"]
[100004486,"PKR 264 CORPS NON MONTE",null,4230,null,"Pas concerné par l'étiquettage",null,null,3661238110823,null,null,null,null,"C0"]
[100004487,"PKR 265 CORPS NON MONTE",null,4796,null,"Pas concerné par l'étiquettage",null,null,3661238110816,null,null,null,null,"C0"]
[100004488,"PKR 266 CORPS NON MONTE",null,5145,null,"Pas concerné par l'étiquettage",null,null,3661238110809,null,null,null,null,"C0"]
[100004489,"PKR 267 CORPS NON MONTE",null,5442,null,"Pas concerné par l'étiquettage",null,null,3661238110793,null,null,null,null,"C0"]
[100004490,"PKR 268 CORPS NON MONTE",null,5746,null,"Pas concerné par l'étiquettage",null,null,3661238110786,null,null,null,null,"C0"]
[100004491,"PKR 266 + AD217  CORPS NON MONTE",null,5433,null,"Pas concerné par l'étiquettage",null,null,366123811077,null,null,null,null,"C0"]
[100004492,"PKR 267 + AD217  CORPS NON MONTE",null,5730,null,"Pas concerné par l'étiquettage",null,null,3661238110762,null,null,null,null,"C0"]
[100004493,"PKR 268 + AD217  CORPS NON MONTE",null,6034,null,"Pas concerné par l'étiquettage",null,null,3661238110755,null,null,null,null,"C0"]
[100004494,"PKX 264 CORPS NON MONTE + OBC 162 /TA",null,5652,null,"Pas concerné par l'étiquettage",null,null,3661238110748,null,null,null,null,"C0"]
[100004495,"PKX 265 CORPS NON MONTE + OBC 162 /TA",null,6218,null,"Pas concerné par l'étiquettage",null,null,3661238110731,null,null,null,null,"C0"]
[100004496,"PKX 264 CORPS NON MONTE + OBC 252 /TA",null,5988,null,"Pas concerné par l'étiquettage",null,null,3661238110724,null,null,null,null,"C0"]
[100004497,"PKX 265 CORPS NON MONTE + OBC 252 /TA",null,6554,null,"Pas concerné par l'étiquettage",null,null,3661238110717,null,null,null,null,"C0"]
[100004498,"PKR 264 CORPS NON MONTE + OBC 162 /TA",null,6316,null,"Pas concerné par l'étiquettage",null,null,3661238110700,null,null,null,null,"C0"]
[100004499,"PKR 265 CORPS NON MONTE + OBC 162 /TA",null,6882,null,"Pas concerné par l'étiquettage",null,null,3661238110694,null,null,null,null,"C0"]
[100004510,"PKR 264 CORPS NON MONTE + OBC 252 /TA",null,6652,null,"Pas concerné par l'étiquettage",null,null,3661238110687,null,null,null,null,"C0"]
[100004511,"PKR 265 CORPS NON MONTE + OBC 252 /TA",null,7218,null,"Pas concerné par l'étiquettage",null,null,3661238110670,null,null,null,null,"C0"]
[]
["COMPOSANTS"]
[200004483,"ELEMENT INTERMEDIAIRE PK 260",null,262,null,"/","/","/",3661238001787,35.83,650,410,125,"C0"]
[82270002,"ELEMENT AVANT PKR-250",null,267,null,"/","/","/",3661238020580,35.25,660,480,130,"C0"]
[82270003,"ELEMENT ARRIERE PKR-250",null,352,null,"/","/","/",3661238020573,42.5,690,410,130,"C0"]
[100004366,"CAISSE ACCESSOIRES 4 ELEMENTS","ME6",927,null,"/","/","/",3661238003620,45.5,645,610,390,"C0"]
[100004367,"CAISSE ACCESSOIRES 5 ELEMENTS","ME7",990,null,"/","/","/",3661238003613,45.5,645,610,390,"C0"]
[100004368,"CAISSE ACCESSOIRES 6 ELEMENTS","ME8",1054,null,"/","/","/",3661238003606,49,645,610,390,"C0"]
[100004369,"CAISSE ACCESSOIRES 7 ELEMENTS","ME9",1083,null,"/","/","/",3661238003590,49.5,645,610,390,"C0"]
[100004370,"CAISSE ACCESSOIRES 8 ELEMENTS","ME10",1115,null,"/","/","/",3661238003583,46.5,645,610,390,"C0"]
[100004531,"COLIS JAQUETTE PKR264 ","MF1",873,null,"/","/","/",3661238110489,27,1085,620,425,"C0"]
[100019219,"COLIS JAQUETTE PK265/PU265  ","MF6",1114,null,"/","/","/",3661238110472,37,1090,750,425,"C0"]
[100019220,"COLIS JAQUETTE PK266/PU266","MF7",1128,null,"/","/","/",3661238110465,34.5,1100,870,440,"C0"]
[100019221,"COLIS JAQUETTE PK267/PU267","MF8",1134,null,"/","/","/",3661238110458,44,1095,1045,440,"C0"]
[100004535,"COLIS JAQUETTE PKR268  ","MF5",1144,null,"/","/","/",3661238110441,47,1130,1095,440,"C0"]
[100004361,"CORPS ASSEMBLE 4 ELEMENTS","ME1",2068,null,"/","/","/",3661238003675,212,845,815,630,"C0"]
[100004362,"CORPS ASSEMBLE 5 ELEMENTS","ME2",2393,null,"/","/","/",3661238003668,248,975,815,630,"C0"]
[100004363,"CORPS ASSEMBLE 6 ELEMENTS   ","ME3",2727,null,"/","/","/",3661238003651,294,1105,815,630,"C0"]
[100004364,"CORPS ASSEMBLE 7 ELEMENTS","ME4",3018,null,"/","/","/",3661238003644,332,1230,815,630,"C0"]
[100004365,"CORPS ASSEMBLE 8 ELEMENTS","ME5",3311,null,"/","/","/",3661238003637,368.5,1355,815,630,"C0"]
[82277010,"LIASSE TIGE ASSEMB. 6 EL ",null,9,null,"/","/","/",3661238020511,0.43,700,15,10,"C0"]
[82277011,"LIASSE TIGE ASSEMB. 7 EL  ",null,9,null,"/","/","/",3661238020504,0.51,825,15,7,"C0"]
[82277012,"LIASSE TIGE ASSEMB. 8 EL  ",null,9,null,"/","/","/",3661238020498,0.61,1000,15,7,"C0"]
[100002001,"TABLEAU CDE X /TA","FT41",623,null,"/","/","/",3661238112766,4.8,415,425,195,"C0"]
[100004587,"TABLEAU  R/TA","FT63",1287,null,"/","/","/",3661238110427,5.2,415,425,195,"C0"]
[100004588,"TABLEAU CDE X2 / TA","FT64",731,null,"/","/","/",3661238110410,5.2,415,425,195,"C0"]
[100004294,"PLATINE 2 all./Mod./V3V","AD217",288,0.01,"/","/","/",3661238004191,0.75,200,145,130,"C0"]
[100001610,"OBC 162 /TA","BH105",1486,null,"/","/","/",3661238112780,94.5,680,680,1110,"C0"]
[100001611,"OBC 252 /TA","BH106",1822,null,"/","/","/",3661238112773,123,680,680,1480,"C0"]
[89557702,"PANNEAU AVANT","BH87",153,null,"/","/","/",3661238102361,3.85,680,640,100,"C0"]
[89997045,"TUB. LIAISON OBC/PKR 250","BH93",447,null,"/","/","/",3661238044494,6.5,575,505,140,"C0"]
[]
["OPTIONS TABLEAU"]
[100004294,"PLATINE 2 ALL./MOD./V3V","AD217",288,0.01,"/","/","/",3661238004191,0.75,200,145,130,"C0"]
[88017017,"SONDE DEPART v3v","AD199",79,0.01,"/","/","/",3661238049185,0.21,150,200,40,"C0"]
[88017014," PLATINE + SONDE V3V","AD196",176,0.01,"/","/","/",3661238102422,0.52,260,170,120,"C0"]
[85757742,"SONDE FUMEES","FM47",71,0.01,"/","/","/",3661238022744,0.17,210,160,40,"C0"]
[161118,"COMMANDE A DISTANCE INTERACTIVE AD194","AD194",193,null,"/","/","/",3661238106505,0.15,null,null,null,"C0"]
[100002803,"COMMANDE A DISTANCE SIMPLIFIEE AD208","AD208",102,0.08,"/","/","/",3661238554931,0.2,120,85,40,"C0"]
[88017887,"SONDES POUR BALLON TAMPON","AD160",95,0.01,"/","/","/",3661238048720,0.21,210,170,40,"C7"]
[88017851,"CABLE DE LIAISON BUS LG 12 M","AD134",108,0.01,"/","/","/",3661238048850,0.37,350,260,30,"C0"]
[88017904,"THERMOSTAT AMBIANCE PROGRAMMABLE","AD191",158,0.08,"/","/","/",3661238102415,0.25,135,90,55,"C0"]
[88017010,"THERMOSTAT D'AMBIANCE PROGRAMMABLE (SANS FILS)","AD192",280,0.08,"/","/","/",3661238102439,0.42499999999999999,180,150,90,"C0"]
[]
["OPTIONS ECS"]
[100000492,"KIT ANODE MAGNESIUM","EA103",65,null,"/","/","/",3661238011069,0.9,560,90,85,"C0"]
[89557010,"KIT ENSEMBLE CHAUFFANT 2400 W ","BH88",553,null,"/","/","/",3661238102378,3.2,660,215,215,"C0"]
[89557009,"KIT DE TRANSFORMATION G/R 3/4 '' ET 1 ''","BH84",31,null,"/","/","/",3661238047563,0.32500000000000001,200,140,45,"C0"]
[100000030,"COLIS OPTION SONDE ECS","AD212",48,0.01,"/","/","/",3661238011168,0.16,200,150,30,"C0"]
[100007835,"KIT LIAISON PK264-6","EA117",514,null,"/","/","/",3661238113312,6.5,600,500,135,"C0"]
[]
[]
[100004917,"PKX-355 CORPS NON MONTE",null,4161,null,"Pas concerné par l'étiquettage",null,null,3661238110014,null,null,null,null,"C3"]
[100004918,"PKX-356 CORPS NON MONTE",null,4580,null,"Pas concerné par l'étiquettage",null,null,3661238110007,null,null,null,null,"C3"]
[100004919,"PKX-357 CORPS NON MONTE",null,5066,null,"Pas concerné par l'étiquettage",null,null,3661238109995,null,null,null,null,"C3"]
[100004920,"PKX-358 CORPS NON MONTE",null,5945,null,"Pas concerné par l'étiquettage",null,null,3661238109988,null,null,null,null,"C3"]
[100004921,"PKX-359 CORPS NON MONTE",null,7082,null,"Pas concerné par l'étiquettage",null,null,3661238109971,null,null,null,null,"C3"]
[100004897,"PKX-355 CORPS MONTE ",null,4599,null,"Pas concerné par l'étiquettage",null,null,3661238110113,null,null,null,null,"C3"]
[100004898,"PKX-356 CORPS MONTE ",null,5136,null,"Pas concerné par l'étiquettage",null,null,3661238110106,null,null,null,null,"C3"]
[100004899,"PKX-357 CORPS MONTE ",null,5618,null,"Pas concerné par l'étiquettage",null,null,3661238110090,null,null,null,null,"C3"]
[100004910,"PKX-358 CORPS MONTE ",null,6501,null,"Pas concerné par l'étiquettage",null,null,3661238110083,null,null,null,null,"C3"]
[100004911,"PKX-359 CORPS MONTE ",null,7672,null,"Pas concerné par l'étiquettage",null,null,3661238110076,null,null,null,null,"C3"]
[100004922,"PKR-355 CORPS NON MONTE ",null,4334,null,"Pas concerné par l'étiquettage",null,null,3661238109964,null,null,null,null,"C3"]
[100004923,"PKR-356 CORPS NON MONTE ",null,4753,null,"Pas concerné par l'étiquettage",null,null,3661238109957,null,null,null,null,"C3"]
[100004924,"PKR-357 CORPS NON MONTE ",null,5239,null,"Pas concerné par l'étiquettage",null,null,3661238109940,null,null,null,null,"C3"]
[100004925,"PKR-358 CORPS NON MONTE ",null,6118,null,"Pas concerné par l'étiquettage",null,null,3661238109933,null,null,null,null,"C3"]
[100004926,"PKR-359 CORPS NON MONTE ",null,7255,null,"Pas concerné par l'étiquettage",null,null,3661238109926,null,null,null,null,"C3"]
[100004912,"PKR-355 CORPS MONTE     ",null,4772,null,"Pas concerné par l'étiquettage",null,null,3661238110069,null,null,null,null,"C3"]
[100004913,"PKR-356 CORPS MONTE     ",null,5309,null,"Pas concerné par l'étiquettage",null,null,3661238110052,null,null,null,null,"C3"]
[100004914,"PKR-357 CORPS MONTE     ",null,5791,null,"Pas concerné par l'étiquettage",null,null,3661238110045,null,null,null,null,"C3"]
[100004915,"PKR-358 CORPS MONTE     ",null,6674,null,"Pas concerné par l'étiquettage",null,null,3661238110038,null,null,null,null,"C3"]
[100004916,"PKR-359 CORPS MONTE     ",null,7845,null,"Pas concerné par l'étiquettage",null,null,3661238110021,null,null,null,null,"C3"]
[]
["COMPOSANTS"]
[85537067,"CORPS MONTE PKR355",null,2809,null,"/","/","/",3661238026179,600,1085,1085,670,"C3"]
[85537068,"CORPS MONTE PKR356",null,3215,null,"/","/","/",3661238026162,712.5,1250,1080,680,"C3"]
[85537069,"CORPS MONTE PKR357",null,3634,null,"/","/","/",3661238026155,824,1410,1080,680,"C3"]
[85537070,"CORPS MONTE PKR358",null,4048,null,"/","/","/",3661238026148,936,1550,1080,680,"C3"]
[85537071,"CORPS MONTE PKR359",null,4503,null,"/","/","/",3661238026131,1048,1730,1080,680,"C3"]
[100004866,"COLIS JAQUETTE LATERALE PK 355","MD8",555,null,"/","/","/",3661238002081,44,1180,980,330,"C3"]
[100004867,"COLIS JAQUETTE LATERALE PK 356","MD9",613,null,"/","/","/",3661238002074,80.5,1230,1350,390,"C3"]
[100004868,"COLIS JAQUETTE LATERALE PK 357","MD10",670,null,"/","/","/",3661238002067,95.25,1230,1350,390,"C3"]
[100004869,"COLIS JAQUETTE LATERALE PK 358","MD11",919,null,"/","/","/",3661238002050,91.25,1230,1650,390,"C3"]
[100004880,"COLIS JAQUETTE LATERALE PK 359","MD12",1571,null,"/","/","/",3661238002043,112.25,1230,1650,390,"C3"]
[100004927,"HABILLAGE AVANT  PK 350","MG3",114,null,"/","/","/",3661238109919,9.5,1010,820,120,"C3"]
[82190002,"ELEMENT AVANT   PKR350",null,489,null,"/","/","/",3661238020825,104,1070,620,170,"C3"]
[85537072,"ELEMENT ARRIERE PKR350",null,538,null,"/","/","/",3661238026124,130,1070,600,190,"C3"]
[82190001,"ELEMENT INTERM. PKR350",null,329,null,"/","/","/",3661238020832,111,990,600,165,"C3"]
[85537010,"ACCESSOIRES PKR355","FD10",503,null,"/","/","/",3661238026520,48,660,615,370,"C3"]
[85537011,"ACCESSOIRES PKR356","FD11",523,null,"/","/","/",3661238026513,49.5,660,615,370,"C3"]
[85537012,"ACCESSOIRES PKR357","FD12",597,null,"/","/","/",3661238026506,49.5,660,615,370,"C3"]
[85537013,"ACCESSOIRES PKR358 ","FD13",664,null,"/","/","/",3661238026490,50,660,615,370,"C3"]
[85537014,"ACCESSOIRES PKR359","FD14",704,null,"/","/","/",3661238026483,51.5,660,615,370,"C3"]
[82197713,"TURBULATEUR PKR355/356 ","BP17",203,null,"/","/","/",3661238020801,36,635,510,220,"C3"]
[82197715,"TURBULATEUR PKR357  ","BP19",209,null,"/","/","/",3661238020795,39,500,630,240,"C3"]
[82197716,"TURBULATEUR PKR358 ","BP20",429,null,"/","/","/",3661238020788,55,635,510,380,"C3"]
[82197717,"TURBULATEUR PKR359 ","BP21",482,null,"/","/","/",3661238020771,60,500,630,400,"C3"]
[85537015,"ACCESSOIRES CORPS ASS.  PKR 355-6","FD15",284,null,"/","/","/",3661238026476,26,680,525,190,"C3"]
[85537019,"ACCESSOIRES CORPS ASS.  PKR 356-7-8","FD19",357,null,"/","/","/",3661238026469,26.5,680,525,190,"C3"]
[85537020,"ACCESSOIRES CORPS ASS.  PKR 359","FD20",368,null,"/","/","/",3661238026452,27,680,525,190,"C3"]
[82198945,"TIGE ASSEMBL. PKR355",null,8,null,"/","/","/",3661238020641,1.56,700,50,50,"C3"]
[82198946,"TIGE ASSEMBL. PKR356",null,9,null,"/","/","/",3661238020634,1.9,865,50,50,"C3"]
[82198947,"TIGE ASSEMBL. PKR357",null,11,null,"/","/","/",3661238020627,2.25,1025,50,50,"C3"]
[82198948,"TIGE ASSEMBL. PKR358",null,14,null,"/","/","/",3661238020610,2.61,1185,50,50,"C3"]
[82198949,"TIGE ASSEMBL. PKR359",null,21,null,"/","/","/",3661238020603,2.92,1330,50,50,"C3"]
[85537061,"CHASSIS PKR355","FD31",130,null,"/","/","/",3661238026230,16,750,190,100,"C3"]
[85537062,"CHASSIS PKR356","FD32",141,null,"/","/","/",3661238026223,18.5,760,190,110,"C3"]
[85537063,"CHASSIS PKR357","FD33",159,null,"/","/","/",3661238026216,20.5,900,210,120,"C3"]
[85537064,"CHASSIS PKR358 ","FD34",170,null,"/","/","/",3661238026209,23,1060,210,130,"C3"]
[85537065,"CHASSIS PKR359","FD35",226,null,"/","/","/",3661238026193,25,1220,210,140,"C3"]
[100005564,"DOC.TECHN","MG5",39,null,"/","/","/",3661238109612,0.45,330,240,45,"C3"]
[100005565,"DOC. TECHN. ","MG6",39,null,"/","/","/",3661238109605,0.45,330,240,45,"C3"]
[100005566,"DOC. TECHN. ","MG7",39,null,"/","/","/",3661238109599,0.45,330,240,45,"C3"]
[100005567,"DOC. TECHN. ","MG8",39,null,"/","/","/",3661238109582,0.45,330,240,45,"C3"]
[100005568,"DOC. TECHN. ","MG9",39,null,"/","/","/",3661238109575,0.45,330,240,45,"C3"]
[82197718,"PORTE FOYERE PKR340 F135","BP13",277,null,"/","/","/",3661238020764,21.6,680,180,520,"C3"]
[100004380,"TABLEAU STANDARD OERTLI","MG1",318,null,"/","/","/",3661238111332,5.0599999999999996,800,200,200,"C3"]
[100004381,"TABLEAU R OERTLI","MG2",491,null,"/","/","/",3661238111325,10.39,830,430,270,"C3"]
[]
["OPTIONS"]
[100012592,"REA 060B",null,230,0.08,"/","/","/",null,null,null,null,null,"C0"]
[125392,"REA-130B POUR 1 CIRCUIT",null,651,0.08,"/","/","/",3661238108486,null,null,null,null,"C0"]
[125394,"REA-131B POUR 2 CIRCUITS",null,838,0.08,"/","/","/",3661238108479,null,null,null,null,"C0"]
[125400,"REA  232B : POUR 2 CIRCUITS VANNE",null,1127,0.08,"/","/","/",3661238108448,null,null,null,null,"C0"]
[126490,"CABLAGE POUR 2è VANNE MELANGEUSE",null,75,0.01,"/","/","/",3661238107496,null,null,null,null,"C0"]
[125355,"STATION D'AMBIANCE","RES11",345,0.08,"/","/","/",3661238108493,0.5,null,null,null,"C0"]
[125403,"SONDE WWF/ECS ( POUR TABLEAU AVEC REA)",null,48,0.01,"/","/","/",3661238108431,null,null,null,null,"C0"]
[126589,"OUTIL DE MONTAGE JD-TE Plus",null,3136,null,"/","/","/",3661238107489]
[126624,"COMMANDE A DISTANCE ","RFF60",150,0.08,"/","/","/",3661238107472,null,null,null,null,"C0"]
[82197729,"THERMOMETRE FUMEES    ","BP28",101,0.01,"/","/","/",3661238020733,0.33,195,150,125,"C0"]
[85537076,"KIT DE SECURITE < 115 kW","FD39",172,null,"/","/","/",3661238026087,2.41,425,255,120,"C0"]
[85537079,"KIT DE SECURITE 115 à 330 kW","FD42",238,null,"/","/","/",3661238026056,3.14,470,255,115,"C0"]
[85537075,"CONTRE BRIDE 2\"","FD38",72,null,"/","/","/",3661238026094,2.79,195,150,125,"C0"]
[85537074,"KIT VANNE DE CHASSE","FD37",274,null,"/","/","/",3661238026100,6.5,410,290,170,"C0"]
[100012251,"KIT RECIRCULATION GTU C 330","MD218",420,null,"/","/","/",3661238357921,17,660,490,300,"C3"]
[]
[]
[100013271,"PKX450-08   CORPS NON MONTE",null,9505,null,"Pas concerné par l'étiquettage",null,null,3661238552050,null,null,null,null,"C3"]
[100013272,"PKX450-09   CORPS NON MONTE",null,10495,null,"Pas concerné par l'étiquettage",null,null,3661238552067,null,null,null,null,"C3"]
[100013273,"PKX450-10   CORPS NON MONTE",null,11371,null,"Pas concerné par l'étiquettage",null,null,3661238552074,null,null,null,null,"C3"]
[100013274,"PKX450-11   CORPS NON MONTE",null,12340,null,"Pas concerné par l'étiquettage",null,null,3661238552081,null,null,null,null,"C3"]
[100013275,"PKX450-12   CORPS NON MONTE",null,13220,null,"Pas concerné par l'étiquettage",null,null,3661238552098,null,null,null,null,"C3"]
[100013276,"PKX450-13   CORPS NON MONTE",null,14214,null,"Pas concerné par l'étiquettage",null,null,3661238552104,null,null,null,null,"C3"]
[100013277,"PKX450-14   CORPS NON MONTE",null,15020,null,"Pas concerné par l'étiquettage",null,null,3661238552111,null,null,null,null,"C3"]
[100013265,"PKX450-08   CORPS MONTE",null,10288,null,"Pas concerné par l'étiquettage",null,null,3661238552128,null,null,null,null,"C3"]
[100013266,"PKX450-09   CORPS MONTE",null,11345,null,"Pas concerné par l'étiquettage",null,null,3661238552135,null,null,null,null,"C3"]
[100013267,"PKX450-10   CORPS MONTE",null,12314,null,"Pas concerné par l'étiquettage",null,null,3661238552142,null,null,null,null,"C3"]
[100013268,"PKX450-11   CORPS MONTE",null,13371,null,"Pas concerné par l'étiquettage",null,null,3661238552159,null,null,null,null,"C3"]
[100013269,"PKX450-12   CORPS MONTE",null,14343,null,"Pas concerné par l'étiquettage",null,null,3661238552166,null,null,null,null,"C3"]
[100013280,"PKX450-13   CORPS MONTE",null,15476,null,"Pas concerné par l'étiquettage",null,null,3661238552173,null,null,null,null,"C3"]
[100013281,"PKX450-14   CORPS MONTE",null,16419,null,"Pas concerné par l'étiquettage",null,null,3661238552180,null,null,null,null,"C3"]
[100013282,"PKR450-08   CORPS NON MONTE",null,9678,null,"Pas concerné par l'étiquettage",null,null,3661238552197,null,null,null,null,"C3"]
[100013283,"PKR450-09   CORPS NON MONTE",null,10668,null,"Pas concerné par l'étiquettage",null,null,3661238552203,null,null,null,null,"C3"]
[100013284,"PKR450-10   CORPS NON MONTE",null,11544,null,"Pas concerné par l'étiquettage",null,null,3661238552210,null,null,null,null,"C3"]
[100013285,"PKR450-11   CORPS NON MONTE",null,12513,null,"Pas concerné par l'étiquettage",null,null,3661238552227,null,null,null,null,"C3"]
[100013286,"PKR450-12   CORPS NON MONTE",null,13393,null,"Pas concerné par l'étiquettage",null,null,3661238552234,null,null,null,null,"C3"]
[100013287,"PKR450-13   CORPS NON MONTE",null,14387,null,"Pas concerné par l'étiquettage",null,null,3661238552241,null,null,null,null,"C3"]
[100013288,"PKR450-14   CORPS NON MONTE",null,15193,null,"Pas concerné par l'étiquettage",null,null,3661238552258,null,null,null,null,"C3"]
[100013289,"PKR450-08   CORPS MONTE",null,10461,null,"Pas concerné par l'étiquettage",null,null,3661238552265,null,null,null,null,"C3"]
[100013290,"PKR450-09   CORPS MONTE",null,11518,null,"Pas concerné par l'étiquettage",null,null,3661238552272,null,null,null,null,"C3"]
[100013291,"PKR450-10   CORPS MONTE",null,12487,null,"Pas concerné par l'étiquettage",null,null,3661238552289,null,null,null,null,"C3"]
[100013292,"PKR450-11   CORPS MONTE",null,13544,null,"Pas concerné par l'étiquettage",null,null,3661238552296,null,null,null,null,"C3"]
[100013293,"PKR450-12   CORPS MONTE",null,14516,null,"Pas concerné par l'étiquettage",null,null,3661238552302,null,null,null,null,"C3"]
[100013294,"PKR450-13   CORPS MONTE",null,15649,null,"Pas concerné par l'étiquettage",null,null,3661238552319,null,null,null,null,"C3"]
[100013295,"PKR450-14   CORPS MONTE",null,16592,null,"Pas concerné par l'étiquettage",null,null,3661238552326,null,null,null,null,"C3"]
[]
["COMPOSANTS"]
[100013270,"JAQUETTE PIECES COMMUNES PK450 MH1","MH1",899,null,"/","/","/",3661238365513,94,1130,1540,370,"C3"]
[100007214,"JAQUETTE PCES VAR LAT AR 770 GT430 MP2","MP2",412,null,"/","/","/",3661238092884,36.5,1470,800,300,"C3"]
[100007215,"JAQUETTE PCES VAR LAT AR 930 GT430 MP3","MP3",539,null,"/","/","/",3661238092877,68,1520,1035,400,"C3"]
[100007216,"JAQUETTE PCES VAR LAT CENT 480 GT430 MP4","MP4",374,null,"/","/","/",366123809286,23.5,1470,530,300,"C3"]
[100007217,"JAQUETTE PCES VAR LAT AR 610 GT430 MP5","MP5",336,null,"/","/","/",3661238092853,29.5,1470,635,300,"C3"]
[82297741,"CHEM,CABLE GT400 8E CS41","CS41",26,null,"/","/","/",3661238019195,4.26,1470,155,25,"C3"]
[82297742,"CHEM.CABLE GT400 9E CS42","CS42",29,null,"/","/","/",3661238019188,4.78,1630,155,25,"C3"]
[82297743,"CHEM.CABLE GT400 10E CS43","CS43",43,null,"/","/","/",3661238019171,5.24,1790,155,25,"C3"]
[82297744,"CHEM.CABLE GT400 11E CS44","CS44",44,null,"/","/","/",3661238019164,5.74,1950,155,25,"C3"]
[82297745,"CHEM.CABLE GT400 12E CS45","CS45",46,null,"/","/","/",3661238019157,6.07,2110,155,25,"C3"]
[82297746,"CHEM.CABLE GT400 13E CS46","CS46",52,null,"/","/","/",3661238019140,6.52,2270,155,25,"C3"]
[82297747,"CHEM.CABLE GT400 14E CS47","CS47",52,null,"/","/","/",3661238019133,7,2430,155,25,"C3"]
[82297751,"COL.ISOL.GT407-408 CS51","CS51",44,null,"/","/","/",3661238019126,2.1,1180,630,150,"C3"]
[82297753,"COL.ISOL.GT409-410  CS53","CS53",52,null,"/","/","/",3661238019102,2.8,1180,780,180,"C3"]
[82297755,"COL.ISOL.GT411-412  CS55","CS55",61,null,"/","/","/",3661238019102,4,1150,900,150,"C3"]
[82297757,"COL.ISOL.GT413-414  CS57","CS57",68,null,"/","/","/",3661238019096,3.5,1200,740,180,"C3"]
[82290002,"ELEMENT AVANT     PKR440",null,709,null,"/","/","/",3661238019522,155.5,1345,815,170,"C3"]
[82298904,"ELEMENT ARRIERE PKR440",null,759,null,"/","/","/",3661238018952,224.5,1340,830,230,"C3"]
[82290001,"ELEMENT INTERM  NORMAL PKR440",null,660,null,"/","/","/",3661238019539,185,1335,845,160,"C3"]
[82290005,"ELEMENT INTERM  SPECIAL PKR440",null,650,null,"/","/","/",3661238019515,164.5,1335,850,165,"C3"]
[82298900,"CHASSIS ASS PKR440/08",null,264,null,"/","/","/",3661238018990,37,1290,125,150,"C3"]
[82298901,"CHASSIS ASS PKR440/09-10",null,287,null,"/","/","/",3661238018983,44,1610,125,150,"C3"]
[82298902,"CHASSIS ASS PKR440/11-12",null,311,null,"/","/","/",3661238018976,55,1930,125,150,"C3"]
[82298903,"CHASSIS ASS PKR440/13-14",null,369,null,"/","/","/",3661238018969,62,2250,125,150,"C3"]
[82297730,"COLIS TURBUL, 7-8 CS30","CS30",449,null,"/","/","/",3661238019232,72.5,610,650,390,"C3"]
[82297731,"COLIS TURBUL, 9-10 CS31","CS31",541,null,"/","/","/",3661238019225,97,610,650,390,"C3"]
[82297732,"COLIS TURBUL, 11-12 CS32","CS32",665,null,"/","/","/",3661238019218,120.5,760,710,450,"C3"]
[82297733,"COLIS TURBUL, 13-14 CS33","CS33",785,null,"/","/","/",3661238019201,144,700,750,460,"C3"]
[100013310,"DOCUMENTATION TEC GENE PK 450-",null,35,null,"/","/","/",3661238362918,0.5,325,240,50,"C3"]
[100013311,"DOCUMENTATION TEC GENE PK 450-",null,35,null,"/","/","/",366123836292,0.5,325,240,50,"C3"]
[100013312,"DOCUMENTATION TEC GENE PK 450-",null,35,null,"/","/","/",3661238362932,0.5,325,240,50,"C3"]
[100013313,"DOCUMENTATION TEC GENE PK 450-",null,35,null,"/","/","/",3661238362949,0.5,325,240,50,"C3"]
[100013314,"DOCUMENTATION TEC GENE PK 450-",null,35,null,"/","/","/",3661238362956,0.5,325,240,50,"C3"]
[100013315,"DOCUMENTATION TEC GENE PK 450-",null,35,null,"/","/","/",366123836296,0.5,325,240,50,"C3"]
[100013316,"DOCUMENTATION TEC GENE PK 450-",null,35,null,"/","/","/",3661238362970,0.5,325,240,50,"C3"]
[82297722,"CAISSE ACC, VAR, GT408",null,958,null,"/","/","/",3661238019300,96,760,710,470,"C3"]
[82297723,"CAISSE ACC, VAR, GT409",null,991,null,"/","/","/",3661238019294,104,760,660,420,"C3"]
[82297724,"CAISSE ACC, VAR, GT410",null,1117,null,"/","/","/",3661238019287,111,760,710,470,"C3"]
[82297725,"CAISSE ACC, VAR, GT411",null,1141,null,"/","/","/",3661238019270,107,760,710,470,"C3"]
[82297726,"CAISSE ACC, VAR, GT412",null,1188,null,"/","/","/",3661238019263,113,760,710,470,"C3"]
[82297727,"CAISSE ACC, VAR, GT413",null,1255,null,"/","/","/",366123801925,118,760,660,420,"C3"]
[82297728,"CAISSE ACC, VAR, GT414",null,1274,null,"/","/","/",3661238019249,121,760,660,420,"C3"]
[82297720,"CAISSE ACC,COM,GT400 CS20","CS20",555,null,"/","/","/",3661238019317,70,760,710,430,"C3"]
[82298926,"CORPS GT408 ASSEMBLE",null,8022,null,"/","/","/",3661238018945,1640,1800,900,1450,"C3"]
[82298927,"CORPS GT409 ASSEMBLE",null,8813,null,"/","/","/",3661238018938,1860,1980,900,1450,"C3"]
[82298928,"CORPS GT410 ASSEMBLE",null,9692,null,"/","/","/",3661238018921,2040,2150,900,1450,"C3"]
[82298929,"CORPS GT411 ASSEMBLE",null,10497,null,"/","/","/",3661238018914,2220,2320,900,1450,"C3"]
[82298930,"CORPS GT412 ASSEMBLE",null,11296,null,"/","/","/",3661238018907,2400,2480,900,1450,"C3"]
[82298931,"CORPS GT413 ASSEMBLE",null,12227,null,"/","/","/",3661238018891,2610,2640,900,1450,"C3"]
[82298932,"CORPS GT414 ASSEMBLE",null,13043,null,"/","/","/",3661238018884,2795,2800,900,1450,"C3"]
[100004380,"TABLEAU STANDARD OERTLI","MG1",318,null,"/","/","/",3661238111332,5.0599999999999996,800,200,200,"C3"]
[100004381,"TABLEAU R OERTLI","MG2",491,null,"/","/","/",3661238111325,10.39,830,430,270,"C3"]
[]
["OPTIONS"]
[100012592,"REA 060B",null,230,0.08,"/","/","/",null,null,null,null,null,"C0"]
[125400,"REA  232B : POUR 2 CIRCUITS VANNE",null,1127,0.08,"/","/","/",3661238108448,null,null,null,null,"C0"]
[125355,"STATION D'AMBIANCE","RES11",345,0.08,"/","/","/",3661238108493,0.5,null,null,null,"C0"]
[125403,"SONDE WWF/ECS ( POUR TABLEAU AVEC REA)",null,48,0.01,"/","/","/",3661238108431,null,null,null,null,"C0"]
[126490,"CABLAGE POUR 2è VANNE MELANGEUSE",null,75,0.01,"/","/","/",3661238107496,null,null,null,null,"C0"]
[126624,"COMMANDE A DISTANCE ","RFF60",150,0.08,"/","/","/",3661238107472,null,null,null,null,"C0"]
[82197729,"THERMOMETRE FUMEES    ","BP28",101,0.01,"/","/","/",3661238020733,0.33,195,150,125,"C0"]
[126589,"OUTIL DE MONTAGE JD-TE Plus",null,3136,null,"/","/","/",3661238107489]
[]
[]
[100013870,"PKX 550-09 CORPS NON MONTE",null,12995,null,"Pas concerné par l'étiquettage",null,null,3661238552418,null,null,null,null,"C3"]
[100013871,"PKX 550-10 CORPS NON MONTE",null,13725,null,"Pas concerné par l'étiquettage",null,null,3661238552425,null,null,null,null,"C3"]
[100013872,"PKX 550-11 CORPS NON MONTE",null,14429,null,"Pas concerné par l'étiquettage",null,null,3661238552432,null,null,null,null,"C3"]
[100013873,"PKX 550-12 CORPS NON MONTE",null,15125,null,"Pas concerné par l'étiquettage",null,null,3661238552449,null,null,null,null,"C3"]
[100013874,"PKX 550-13 CORPS NON MONTE",null,15828,null,"Pas concerné par l'étiquettage",null,null,3661238552456,null,null,null,null,"C3"]
[100013875,"PKX 550-14 CORPS NON MONTE",null,16524,null,"Pas concerné par l'étiquettage",null,null,3661238552463,null,null,null,null,"C3"]
[100013876,"PKX 550-15 CORPS NON MONTE",null,17264,null,"Pas concerné par l'étiquettage",null,null,3661238552470,null,null,null,null,"C3"]
[100013877,"PKX 550-16 CORPS NON MONTE",null,18186,null,"Pas concerné par l'étiquettage",null,null,3661238552487,null,null,null,null,"C3"]
[100013878,"PKX 550-17 CORPS NON MONTE",null,19500,null,"Pas concerné par l'étiquettage",null,null,3661238552494,null,null,null,null,"C3"]
[100013879,"PKX 550-18 CORPS NON MONTE",null,20390,null,"Pas concerné par l'étiquettage",null,null,3661238552500,null,null,null,null,"C3"]
[100013880,"PKX 550-19 CORPS NON MONTE",null,21308,null,"Pas concerné par l'étiquettage",null,null,3661238552517,null,null,null,null,"C3"]
[100013881,"PKX 550-20 CORPS NON MONTE",null,21893,null,"Pas concerné par l'étiquettage",null,null,3661238552524,null,null,null,null,"C3"]
[100013882,"PKX 550-21 CORPS NON MONTE",null,23154,null,"Pas concerné par l'étiquettage",null,null,3661238552531,null,null,null,null,"C3"]
[100013883,"PKX 550-22 CORPS NON MONTE",null,24048,null,"Pas concerné par l'étiquettage",null,null,3661238552548,null,null,null,null,"C3"]
[100013884,"PKX 550-23 CORPS NON MONTE",null,24971,null,"Pas concerné par l'étiquettage",null,null,3661238552555,null,null,null,null,"C3"]
[100013885,"PKX 550-24 CORPS NON MONTE",null,25881,null,"Pas concerné par l'étiquettage",null,null,3661238552562,null,null,null,null,"C3"]
[100013886,"PKX 550-25 CORPS NON MONTE",null,26783,null,"Pas concerné par l'étiquettage",null,null,3661238552579,null,null,null,null,"C3"]
[100013888,"PKX 550-09 CORPS MONTE",null,14059,null,"Pas concerné par l'étiquettage",null,null,3661238552586,null,null,null,null,"C3"]
[100013889,"PKX 550-10 CORPS MONTE",null,14900,null,"Pas concerné par l'étiquettage",null,null,3661238552593,null,null,null,null,"C3"]
[100013890,"PKX 550-11 CORPS MONTE",null,15703,null,"Pas concerné par l'étiquettage",null,null,3661238552609,null,null,null,null,"C3"]
[100013891,"PKX 550-12 CORPS MONTE",null,16487,null,"Pas concerné par l'étiquettage",null,null,3661238552616,null,null,null,null,"C3"]
[100013892,"PKX 550-13 CORPS MONTE",null,17301,null,"Pas concerné par l'étiquettage",null,null,3661238552623,null,null,null,null,"C3"]
[100013893,"PKX 550-14 CORPS MONTE",null,18084,null,"Pas concerné par l'étiquettage",null,null,3661238552630,null,null,null,null,"C3"]
[100013894,"PKX 550-15 CORPS MONTE",null,18928,null,"Pas concerné par l'étiquettage",null,null,3661238552647,null,null,null,null,"C3"]
[100013895,"PKX 550-16 CORPS MONTE",null,19955,null,"Pas concerné par l'étiquettage",null,null,3661238552654,null,null,null,null,"C3"]
[100013896,"PKX 550-17 CORPS MONTE",null,21359,null,"Pas concerné par l'étiquettage",null,null,3661238552661,null,null,null,null,"C3"]
[100013897,"PKX 550-18 CORPS MONTE",null,22361,null,"Pas concerné par l'étiquettage",null,null,3661238552678,null,null,null,null,"C3"]
[100013898,"PKX 550-19 CORPS MONTE",null,23379,null,"Pas concerné par l'étiquettage",null,null,3661238552685,null,null,null,null,"C3"]
[100013899,"PKX 550-20 CORPS MONTE",null,24023,null,"Pas concerné par l'étiquettage",null,null,3661238552692,null,null,null,null,"C3"]
[100013901,"PKX 550-21 CORPS MONTE",null,25453,null,"Pas concerné par l'étiquettage",null,null,3661238552708,null,null,null,null,"C3"]
[100013902,"PKX 550-22 CORPS MONTE",null,26452,null,"Pas concerné par l'étiquettage",null,null,3661238552715,null,null,null,null,"C3"]
[100013903,"PKX 550-23 CORPS MONTE",null,27447,null,"Pas concerné par l'étiquettage",null,null,3661238552722,null,null,null,null,"C3"]
[100013904,"PKX 550-24 CORPS MONTE",null,28486,null,"Pas concerné par l'étiquettage",null,null,3661238552739,null,null,null,null,"C3"]
[100013905,"PKX 550-25 CORPS MONTE",null,29477,null,"Pas concerné par l'étiquettage",null,null,3661238552746,null,null,null,null,"C3"]
[100013906,"PKR 550-09 CORPS NON MONTE",null,13168,null,"Pas concerné par l'étiquettage",null,null,3661238552753,null,null,null,null,"C3"]
[100013907,"PKR 550-10 CORPS NON MONTE",null,13898,null,"Pas concerné par l'étiquettage",null,null,3661238552760,null,null,null,null,"C3"]
[100013908,"PKR 550-11 CORPS NON MONTE",null,14602,null,"Pas concerné par l'étiquettage",null,null,3661238552777,null,null,null,null,"C3"]
[100013909,"PKR 550-12 CORPS NON MONTE",null,15298,null,"Pas concerné par l'étiquettage",null,null,3661238552784,null,null,null,null,"C3"]
[100013910,"PKR 550-13 CORPS NON MONTE",null,16001,null,"Pas concerné par l'étiquettage",null,null,3661238552791,null,null,null,null,"C3"]
[100013911,"PKR 550-14 CORPS NON MONTE",null,16697,null,"Pas concerné par l'étiquettage",null,null,3661238552807,null,null,null,null,"C3"]
[100013912,"PKR 550-15 CORPS NON MONTE",null,17437,null,"Pas concerné par l'étiquettage",null,null,3661238552814,null,null,null,null,"C3"]
[100013913,"PKR 550-16 CORPS NON MONTE",null,18359,null,"Pas concerné par l'étiquettage",null,null,3661238552821,null,null,null,null,"C3"]
[100013914,"PKR 550-17 CORPS NON MONTE",null,19673,null,"Pas concerné par l'étiquettage",null,null,3661238552838,null,null,null,null,"C3"]
[100013915,"PKR 550-18 CORPS NON MONTE",null,20563,null,"Pas concerné par l'étiquettage",null,null,3661238552845,null,null,null,null,"C3"]
[100013916,"PKR 550-19 CORPS NON MONTE",null,21481,null,"Pas concerné par l'étiquettage",null,null,3661238552852,null,null,null,null,"C3"]
[100013917,"PKR 550-20 CORPS NON MONTE",null,22066,null,"Pas concerné par l'étiquettage",null,null,3661238552869,null,null,null,null,"C3"]
[100013918,"PKR 550-21 CORPS NON MONTE",null,23327,null,"Pas concerné par l'étiquettage",null,null,3661238552876,null,null,null,null,"C3"]
[100013919,"PKR 550-22 CORPS NON MONTE",null,24221,null,"Pas concerné par l'étiquettage",null,null,3661238552883,null,null,null,null,"C3"]
[100013920,"PKR 550-23 CORPS NON MONTE",null,25144,null,"Pas concerné par l'étiquettage",null,null,3661238552890,null,null,null,null,"C3"]
[100013921,"PKR 550-24 CORPS NON MONTE",null,26054,null,"Pas concerné par l'étiquettage",null,null,3661238552906,null,null,null,null,"C3"]
[100013922,"PKR 550-25 CORPS NON MONTE",null,26956,null,"Pas concerné par l'étiquettage",null,null,3661238552333,null,null,null,null,"C3"]
[100013923,"PKR 550-09 CORPS MONTE",null,14232,null,"Pas concerné par l'étiquettage",null,null,3661238552340,null,null,null,null,"C3"]
[100013924,"PKR 550-10 CORPS MONTE",null,15073,null,"Pas concerné par l'étiquettage",null,null,3661238552357,null,null,null,null,"C3"]
[100013925,"PKR 550-11 CORPS MONTE",null,15876,null,"Pas concerné par l'étiquettage",null,null,3661238552364,null,null,null,null,"C3"]
[100013926,"PKR 550-12 CORPS MONTE",null,16660,null,"Pas concerné par l'étiquettage",null,null,3661238552371,null,null,null,null,"C3"]
[100013927,"PKR 550-13 CORPS MONTE",null,17474,null,"Pas concerné par l'étiquettage",null,null,3661238552388,null,null,null,null,"C3"]
[100013928,"PKR 550-14 CORPS MONTE",null,18257,null,"Pas concerné par l'étiquettage",null,null,3661238552395,null,null,null,null,"C3"]
[100013929,"PKR 550-15 CORPS MONTE",null,19101,null,"Pas concerné par l'étiquettage",null,null,3661238552401,null,null,null,null,"C3"]
[100013930,"PKR 550-16 CORPS MONTE",null,20128,null,"Pas concerné par l'étiquettage",null,null,3661238553118,null,null,null,null,"C3"]
[100013931,"PKR 550-17 CORPS MONTE",null,21532,null,"Pas concerné par l'étiquettage",null,null,3661238553125,null,null,null,null,"C3"]
[100013932,"PKR 550-18 CORPS MONTE",null,22534,null,"Pas concerné par l'étiquettage",null,null,3661238553132,null,null,null,null,"C3"]
[100013933,"PKR 550-19 CORPS MONTE",null,23552,null,"Pas concerné par l'étiquettage",null,null,3661238553149,null,null,null,null,"C3"]
[100013934,"PKR 550-20 CORPS MONTE",null,24196,null,"Pas concerné par l'étiquettage",null,null,3661238553156,null,null,null,null,"C3"]
[100013935,"PKR 550-21 CORPS MONTE",null,25626,null,"Pas concerné par l'étiquettage",null,null,3661238553163,null,null,null,null,"C3"]
[100013936,"PKR 550-22 CORPS MONTE",null,26625,null,"Pas concerné par l'étiquettage",null,null,3661238553170,null,null,null,null,"C3"]
[100013937,"PKR 550-23 CORPS MONTE",null,27620,null,"Pas concerné par l'étiquettage",null,null,3661238553187,null,null,null,null,"C3"]
[100013938,"PKR 550-24 CORPS MONTE",null,28659,null,"Pas concerné par l'étiquettage",null,null,3661238553194,null,null,null,null,"C3"]
[100013939,"PKR 550-25 CORPS MONTE",null,29650,null,"Pas concerné par l'étiquettage",null,null,3661238553200,null,null,null,null,"C3"]
[]
["COMPOSANTS"]
[82280001,"ELEMENT INT. NORMAL",null,655,null,"/","/","/",3661238019805,174.25,1335,1055,170,"C3"]
[82280002,"ELEMENT INT SPECIAL",null,745,null,"/","/","/",3661238019799,203,1305,1060,160,"C3"]
[82288901,"ELEMENT ARRIERE",null,938,null,"/","/","/",3661238019553,252,1300,1040,175,"C3"]
[82288902,"ELEMENT AVANT",null,962,null,"/","/","/",3661238019546,208,1305,1040,180,"C3"]
[82590501,"CHASSIS 8-9 ELEMENTS",null,262,null,"/","/","/",3661238018860,30,1080,120,110,"C3"]
[82590502,"CHASSIS 10-11 ELEMENTS",null,293,null,"/","/","/",3661238018853,31.5,1300,120,110,"C3"]
[82590503,"CHASSIS 12-13 ELEMENTS",null,343,null,"/","/","/",3661238018846,39.5,1520,120,110,"C3"]
[82590504,"CHASSIS 14-15 ELEMENTS",null,347,null,"/","/","/",3661238018839,44,1750,110,120,"C3"]
[82590505,"CHASSIS 16-17 ELEMENTS",null,353,null,"/","/","/",3661238018822,51.5,1965,120,110,"C3"]
[82590506,"CHASSIS 18-19 ELEMENTS",null,417,null,"/","/","/",3661238018815,56,2190,120,110,"C3"]
[82590507,"CHASSIS 20-21 ELEMENTS",null,395,null,"/","/","/",3661238018808,60,2450,120,110,"C3"]
[82590508,"CHASSIS 22-23 ELEMENTS",null,449,null,"/","/","/",3661238018792,61.5,2670,120,110,"C3"]
[82590509,"CHASSIS 24-25 ELEMENTS",null,492,null,"/","/","/",3661238018785,69,2900,120,110,"C3"]
[82287759,"TIGES ASS.+OUTILS DE CHAUF 09 ELTS",null,94,null,"/","/","/",3661238019720,9,1300,140,60,"C3"]
[82287760,"TIGES ASS.+OUTILS DE CHAUF 10 ELTS",null,98,null,"/","/","/",3661238019713,10,1300,140,60,"C3"]
[82287761,"TIGES ASS.+OUTILS DE CHAUF 11 ELTS",null,101,null,"/","/","/",3661238019706,10,1800,140,60,"C3"]
[82287762,"TIGES ASS.+OUTILS DE CHAUF 12 ELTS",null,105,null,"/","/","/",3661238019690,11,1800,140,60,"C3"]
[82287763,"TIGES ASS.+OUTILS DE CHAUF 13 ELTS",null,107,null,"/","/","/",3661238019683,11,1800,140,60,"C3"]
[82287764,"TIGES ASS.+OUTILS DE CHAUF 14 ELTS",null,113,null,"/","/","/",3661238019676,13,1800,140,60,"C3"]
[82287765,"TIGES ASS.+OUTILS DE CHAUF 15 ELTS",null,114,null,"/","/","/",3661238019669,13,1800,140,60,"C3"]
[82287766,"TIGES ASS.+OUTILS DE CHAUF 16 ELTS",null,128,null,"/","/","/",3661238019652,15,1908,140,60,"C3"]
[82287767,"TIGES ASS.+OUTILS DE CHAUF 17 ELTS",null,142,null,"/","/","/",3661238019645,16,2021,140,60,"C3"]
[82287768,"TIGES ASS.+OUTILS DE CHAUF 18 ELTS",null,145,null,"/","/","/",3661238019638,16,2133,140,60,"C3"]
[82287769,"TIGES ASS.+OUTILS DE CHAUF 19 ELTS",null,147,null,"/","/","/",3661238019621,16.5,2260,150,70,"C3"]
[82287770,"TIGES ASS.+OUTILS DE CHAUF 20 ELTS",null,149,null,"/","/","/",3661238019614,18,2398,140,60,"C3"]
[82287771,"TIGES ASS.+OUTILS DE CHAUF 21 ELTS",null,157,null,"/","/","/",3661238019607,18,2511,140,60,"C3"]
[82287772,"TIGES ASS.+OUTILS DE CHAUF 22 ELTS",null,159,null,"/","/","/",3661238019591,19,2623,140,60,"C3"]
[82287773,"TIGES ASS.+OUTILS DE CHAUF 23 ELTS",null,166,null,"/","/","/",3661238019584,20,2736,140,60,"C3"]
[82287774,"TIGES ASS.+OUTILS DE CHAUF 24 ELTS",null,170,null,"/","/","/",3661238019577,21,2848,140,60,"C3"]
[82287775,"TIGES ASS.+OUTILS DE CHAUF 25 ELTS",null,179,null,"/","/","/",3661238019560,20.5,3000,150,70,"C3"]
[85557089,"ACCESSOIRES CORPS 09 EL.",null,1509,null,"/","/","/",3661238024861,124,760,710,450,"C3"]
[85557090,"ACCESSOIRES CORPS 10 EL.",null,1510,null,"/","/","/",3661238024854,128,760,710,450,"C3"]
[85557091,"ACCESSOIRES CORPS 11 EL.",null,1518,null,"/","/","/",3661238024847,139,760,710,450,"C3"]
[85557092,"ACCESSOIRES CORPS 12 EL.",null,1441,null,"/","/","/",3661238024830,146,760,710,450,"C3"]
[85557093,"ACCESSOIRES CORPS 13 EL.",null,1460,null,"/","/","/",3661238024823,149,760,710,450,"C3"]
[85557094,"ACCESSOIRES CORPS 14 EL.",null,1484,null,"/","/","/",3661238024816,154,760,710,450,"C3"]
[85557095,"ACCESSOIRES CORPS 15 EL.",null,1475,null,"/","/","/",3661238024809,164,760,710,450,"C3"]
[85557096,"ACCESSOIRES CORPS 16 EL.",null,1599,null,"/","/","/",3661238024793,169,760,710,450,"C3"]
[85557097,"ACCESSOIRES CORPS 17 EL.",null,1917,null,"/","/","/",3661238024786,178,760,710,450,"C3"]
[85557098,"ACCESSOIRES CORPS 18 EL.",null,1703,null,"/","/","/",3661238024779,189,760,710,600,"C3"]
[85557099,"ACCESSOIRES CORPS 19 EL.",null,1845,null,"/","/","/",3661238024762,195,760,710,600,"C3"]
[85557100,"ACCESSOIRES CORPS 20 EL.",null,1581,null,"/","/","/",3661238024755,194,760,710,600,"C3"]
[85557101,"ACCESSOIRES CORPS 21 EL.",null,1919,null,"/","/","/",3661238024748,203,760,710,600,"C3"]
[85557102,"ACCESSOIRES CORPS 22 EL.",null,1995,null,"/","/","/",3661238024731,207,760,710,600,"C3"]
[85557103,"ACCESSOIRES CORPS 23 EL.",null,2092,null,"/","/","/",3661238024724,213,760,710,600,"C3"]
[85557104,"ACCESSOIRES CORPS 24 EL.",null,2236,null,"/","/","/",3661238024717,226,760,710,600,"C3"]
[85557105,"ACCESSOIRES CORPS 25 EL.",null,2353,null,"/","/","/",3661238024700,231,760,710,600,"C3"]
[85557109,"ACCESSOIRES COMPL. CV 09 EL.",null,745,null,"/","/","/",3661238024670,20,635,510,380,"C3"]
[85557110,"ACCESSOIRES COMPL. CV 10 EL.",null,704,null,"/","/","/",3661238024663,20,635,510,380,"C3"]
[85557111,"ACCESSOIRES COMPL. CV 11 EL.",null,700,null,"/","/","/",3661238024656,30,635,510,380,"C3"]
[85557112,"ACCESSOIRES COMPL. CV 12 EL.",null,667,null,"/","/","/",3661238024649,31,635,510,380,"C3"]
[85557113,"ACCESSOIRES COMPL. CV 13 EL.",null,670,null,"/","/","/",3661238024632,24,660,615,370,"C3"]
[85557114,"ACCESSOIRES COMPL. CV 14 EL.",null,696,null,"/","/","/",3661238024625,24,660,615,370,"C3"]
[85557115,"ACCESSOIRES COMPL. CV 15 EL.",null,591,null,"/","/","/",3661238024618,24,660,615,370,"C3"]
[85557116,"ACCESSOIRES COMPL. CV 16 EL.",null,658,null,"/","/","/",3661238024601,24,660,615,370,"C3"]
[85557117,"ACCESSOIRES COMPL. CV 17 EL.",null,888,null,"/","/","/",3661238024595,36.5,660,615,370,"C3"]
[85557118,"ACCESSOIRES COMPL. CV 18 EL.",null,785,null,"/","/","/",3661238024588,25,660,615,370,"C3"]
[85557119,"ACCESSOIRES COMPL. CV 19 EL.",null,830,null,"/","/","/",3661238024571,39,660,615,370,"C3"]
[85557120,"ACCESSOIRES COMPL. CV 20 EL.",null,660,null,"/","/","/",3661238024564,26,660,615,370,"C3"]
[85557121,"ACCESSOIRES COMPL. CV 21 EL.",null,866,null,"/","/","/",3661238024557,41,660,615,370,"C3"]
[85557122,"ACCESSOIRES COMPL. CV 22 EL.",null,876,null,"/","/","/",3661238024540,28,660,615,370,"C3"]
[85557123,"ACCESSOIRES COMPL. CV 23 EL.",null,948,null,"/","/","/",3661238024533,28,660,615,370,"C3"]
[85557124,"ACCESSOIRES COMPL. CV 24 EL.",null,991,null,"/","/","/",3661238024526,41.5,660,615,370,"C3"]
[85557125,"ACCESSOIRES COMPL. CV 25 EL.",null,1070,null,"/","/","/",3661238024519,44.5,660,615,370,"C3"]
[82590523,"PORTE FOYERE PLEINE PEINTE",null,352,null,"/","/","/",3661238018778,39,610,490,140,"C3"]
[80080539,"PLAQUE RACCORD.EMB.D.300",null,197,null,"/","/","/",3661238001688,20,800,595,110,"C3"]
[80080535,"PLAQUE RACCORD.EMB.D.350",null,171,null,"/","/","/",3661238001701,19,800,595,110,"C3"]
[80080536,"PLAQUE RACCORD.EMB.D.400",null,175,null,"/","/","/",3661238001695,18.5,800,595,110,"C3"]
[80080534,"PLAQUE RACCORD.PLEINE",null,121,null,"/","/","/",3661238001718,20.5,800,595,50,"C3"]
[82088960,"DEPART DUMEE TOLE CDE 800",null,464,null,"/","/","/",3661238020863,27.5,960,950,245,"C3"]
[80087700,"TUBE REPARTITEUR 20-22",null,197,null,"/","/","/",3661238001671,6.5,1235,235,250,"C3"]
[80087701,"TUBE REPARTITEUR 23-24",null,242,null,"/","/","/",3661238001664,8,1235,235,250,"C3"]
[80087702,"TUBE REPARTITEUR 25",null,248,null,"/","/","/",3661238001657,8,1235,235,250,"C3"]
[82597761,"TURBULATEURS CM22",null,84,null,"/","/","/",3661238018747,12.5,610,470,190,"C3"]
[82597762,"TURBULATEURS CM23",null,147,null,"/","/","/",3661238018730,23.5,610,470,190,"C3"]
[85557031,"ISOLATION CORPS  8-9 ELEMENTS",null,196,null,"/","/","/",3661238025370,16,1615,1215,420,"C3"]
[85557032,"ISOLATION CORPS 10 ELEMENTS",null,218,null,"/","/","/",3661238025363,17.5,1615,1215,420,"C3"]
[85557033,"ISOLATION CORPS 11-12 ELEMENTS",null,237,null,"/","/","/",3661238025356,18.5,1615,1215,420,"C3"]
[85557034,"ISOLATION CORPS 13-14 ELEMENTS",null,238,null,"/","/","/",3661238025349,20,1615,1215,420,"C3"]
[85557035,"ISOLATION CORPS 15 ELEMENTS",null,261,null,"/","/","/",3661238025332,22,1615,1215,420,"C3"]
[85557036,"ISOLATION CORPS 16-17 ELEMENTS",null,294,null,"/","/","/",3661238025325,22.5,1615,1215,420,"C3"]
[85557037,"ISOLATION CORPS 18-19 ELEMENTS",null,342,null,"/","/","/",3661238025318,24,1670,1260,610,"C3"]
[85557038,"ISOLATION CORPS 20 ELEMENTS",null,305,null,"/","/","/",3661238025301,25,1670,1260,610,"C3"]
[85557039,"ISOLATION CORPS 21-22 ELEMENTS",null,390,null,"/","/","/",3661238025295,27,1670,1260,610,"C3"]
[85557040,"ISOLATION CORPS 23-24 ELEMENTS",null,414,null,"/","/","/",3661238025288,28,1670,1260,610,"C3"]
[85557041,"ISOLATION CORPS 25 ELEMENTS",null,426,null,"/","/","/",3661238025271,29.5,1670,1260,610,"C3"]
[100013745,"COLIS DOC. TECHN. PKX-PKR 550/09","MS3",251,null,"/","/","/",3661238365797,1.2,3210,230,120,"C3"]
[100013747,"COLIS DOC. TECHN. PKX-PKR 550/10","MS4",251,null,"/","/","/",3661238365810,1.2,3210,230,120,"C3"]
[100013748,"COLIS DOC. TECHN. PKX-PKR 550/11","MS5",251,null,"/","/","/",3661238365827,1.2,3210,230,120,"C3"]
[100013749,"COLIS DOC. TECHN. PKX-PKR 550/12","MS6",251,null,"/","/","/",3661238365834,1.2,3210,230,120,"C3"]
[100013750,"COLIS DOC. TECHN. PKX-PKR 550/13","MS7",251,null,"/","/","/",3661238365841,1.2,3210,230,120,"C3"]
[100013751,"COLIS DOC. TECHN. PKX-PKR 550/14","MS8",251,null,"/","/","/",3661238365858,1.2,3210,230,120,"C3"]
[100013752,"COLIS DOC. TECHN. PKX-PKR 550/15","MS9",251,null,"/","/","/",3661238365865,1.2,3210,230,120,"C3"]
[100013753,"COLIS DOC. TECHN. PKX-PKR 550/16","MS10",251,null,"/","/","/",3661238365872,1.2,3210,230,120,"C3"]
[100013757,"COLIS DOC. TECHN. PKX-PKR 550/17","MS11",251,null,"/","/","/",3661238365896,1.2,3210,230,120,"C3"]
[100013758,"COLIS DOC. TECHN. PKX-PKR 550/18","MS12",261,null,"/","/","/",3661238365902,1.2,3210,230,120,"C3"]
[100013759,"COLIS DOC. TECHN. PKX-PKR 550/19","MS13",261,null,"/","/","/",3661238365919,1.2,3210,230,120,"C3"]
[100013760,"COLIS DOC. TECHN. PKX-PKR 550/20","MS14",261,null,"/","/","/",3661238365926,1.2,3210,230,120,"C3"]
[100013761,"COLIS DOC. TECHN. PKX-PKR 550/21","MS15",261,null,"/","/","/",3661238365933,1.2,3210,230,120,"C3"]
[100013762,"COLIS DOC. TECHN. PKX-PKR 550/22","MS16",261,null,"/","/","/",3661238365940,1.2,3210,230,120,"C3"]
[100013763,"COLIS DOC. TECHN. PKX-PKR 550/23","MS17",261,null,"/","/","/",3661238365957,1.2,3210,230,120,"C3"]
[100013764,"COLIS DOC. TECHN. PKX-PKR 550/24","MS18",261,null,"/","/","/",3661238365964,1.2,3210,230,120,"C3"]
[100013765,"COLIS DOC. TECHN. PKX-PKR 550/25","MS19",261,null,"/","/","/",3661238365971,1.2,3210,230,120,"C3"]
[100013680,"COLIS PANNEAU AVANT 9 A 17 ELMTS","MS1",830,null,"/","/","/",3661238365520,77,750,1270,420,"C3"]
[100013681,"COLIS PANNEAU AVANT 18 A 25 ELMTS","MS2",1041,null,"/","/","/",3661238365537,77,750,1270,420,"C3"]
[100007220,"JAQUETTE LATERALE AVANT 800 GT530","MR3",240,null,"/","/","/",3661238092822,57.5,870,1550,220,"C3"]
[100007221,"JAQUETTE LATERALE AVANT 940 GT530","MR4",329,null,"/","/","/",3661238092815,76.5,1020,1550,220,"C3"]
[100007222,"JAQUETTE LATERALE AVANT 1050 GT530","MR5",352,null,"/","/","/",3661238092808,74,1020,1550,220,"C3"]
[85557010,"JAQUETTE LATERALE ARRIERE 400","FA10",164,null,"/","/","/",3661238025523,18.25,1510,430,80,"C3"]
[85557011,"JAQUETTE LATERALE ARRIERE 600","FA11",208,null,"/","/","/",3661238025516,25.5,1510,630,100,"C3"]
[85557016,"JAQUETTE PIECES VARIABLES COMPL.","FA16",276,null,"/","/","/",3661238025509,26.5,1290,450,80,"C3"]
[85557017,"JAQUETTE PIECES VARIABLES  7 ELTS","FA17",342,null,"/","/","/",3661238025493,26,1290,450,80,"C3"]
[85557018,"JAQUETTE PIECES VARIABLES 8 ELTS","FA18",395,null,"/","/","/",3661238025486,27.5,1430,450,80,"C3"]
[85557019,"JAQUETTE PIECES VARIABLES 9 ELTS","FA19",422,null,"/","/","/",3661238025479,31,1550,450,80,"C3"]
[85557020,"JAQUETTE PIECES VARIABLES 10 ELTS","FA20",422,null,"/","/","/",3661238025462,32.5,1700,450,80,"C3"]
[85557021,"JAQUETTE PIECES VARIABLES 11 ELTS","FA21",422,null,"/","/","/",3661238025455,33.5,1740,450,80,"C3"]
[85557022,"JAQUETTE PIECES VARIABLES 12 ELTS","FA22",422,null,"/","/","/",3661238025448,36.5,1840,450,80,"C3"]
[85557023,"JAQUETTE PIECES VARIABLES 13 ELTS","FA23",422,null,"/","/","/",3661238025431,38.5,1940,450,80,"C3"]
[85557024,"JAQUETTE PIECES VARIABLES 14 ELTS","FA24",423,null,"/","/","/",3661238025424,41.5,2100,450,80,"C3"]
[85557025,"JAQUETTE PIECES VARIABLES 15 ELTS","FA25",425,null,"/","/","/",3661238025417,46,2340,450,80,"C3"]
[85557026,"JAQUETTE PIECES VARIABLES 16 ELTS","FA26",425,null,"/","/","/",3661238025400,46,2330,450,80,"C3"]
[85557027,"JAQUETTE PIECES VARIABLES 17 ELTS","FA27",425,null,"/","/","/",3661238025394,47,2340,450,80,"C3"]
[85558529,"CORPS ASSEMBLE 09 EL.",null,11374,null,"/","/","/",3661238024311,1980,1870,1060,1480,"C3"]
[85558530,"CORPS ASSEMBLE 10 EL.",null,12109,null,"/","/","/",3661238024304,2193,1980,1060,1480,"C3"]
[85558531,"CORPS ASSEMBLE 11 EL.",null,12894,null,"/","/","/",3661238024298,2373,2090,1060,1480,"C3"]
[85558532,"CORPS ASSEMBLE 12 EL.",null,13581,null,"/","/","/",3661238024281,2520,2200,1060,1480,"C3"]
[85558533,"CORPS ASSEMBLE 13 EL.",null,14371,null,"/","/","/",3661238024274,2750,2310,1060,1480,"C3"]
[85558534,"CORPS ASSEMBLE 14 EL.",null,15177,null,"/","/","/",3661238024267,2937,2420,1060,1480,"C3"]
[85558535,"CORPS ASSEMBLE 15 EL.",null,15823,null,"/","/","/",3661238024250,3122,2530,1060,1480,"C3"]
[85558536,"CORPS ASSEMBLE 16 EL.",null,16792,null,"/","/","/",3661238024243,3180,2640,1060,1480,"C3"]
[85558537,"CORPS ASSEMBLE 17 EL.",null,18099,null,"/","/","/",3661238024236,3360,2750,1060,1480,"C3"]
[85558538,"CORPS ASSEMBLE 18 EL.",null,18616,null,"/","/","/",3661238024229,3540,2860,1060,1480,"C3"]
[85558539,"CORPS ASSEMBLE 19 EL.",null,19560,null,"/","/","/",3661238024212,3831,2970,1060,1480,"C3"]
[85558540,"CORPS ASSEMBLE 20 EL.",null,20121,null,"/","/","/",3661238024205,4046,3080,1060,1480,"C3"]
[85558541,"CORPS ASSEMBLE 21 EL.",null,21429,null,"/","/","/",3661238024199,4230,3190,1060,1480,"C3"]
[85558542,"CORPS ASSEMBLE 22 EL.",null,22314,null,"/","/","/",3661238024182,4415,3300,1060,1480,"C3"]
[85558543,"CORPS ASSEMBLE 23 EL.",null,23262,null,"/","/","/",3661238024175,4596,3410,1060,1480,"C3"]
[85558544,"CORPS ASSEMBLE 24 EL.",null,24280,null,"/","/","/",3661238024168,4784,3520,1060,1480,"C3"]
[85558545,"CORPS ASSEMBLE 25 EL.",null,25235,null,"/","/","/",3661238024151,4800,3630,1060,1480,"C3"]
[82287750,"OUTILS DE CHAUF 7 A 10 ELTS",null,44,null,"/","/","/",3661238019782,4,140,65,1840,"C3"]
[82287751,"OUTILS DE CHAUF 11 A 15 ELTS",null,46,null,"/","/","/",3661238019775,5,null,null,null,"C3"]
[82287752,"OUTILS DE CHAUF 16 A 21 ELTS",null,63,null,"/","/","/",3661238019768,5,null,null,null,"C3"]
[82287753,"OUTILS DE CHAUF 22 ELTS",null,63,null,"/","/","/",3661238019751,5,null,null,null,"C3"]
[82287757,"OUTILS DE CHAUF 23 A 25 ELTS",null,68,null,"/","/","/",3661238019744,3,130,160,60,"C3"]
[100004380,"TABLEAU STANDARD OERTLI","MG1",318,null,"/","/","/",3661238111332,5.0599999999999996,800,200,200,"C3"]
[100004381,"TABLEAU R OERTLI","MG2",491,null,"/","/","/",3661238111325,10.39,830,430,270,"C3"]
[]
["OPTIONS"]
[100012592,"REA 060B",null,230,0.08,"/","/","/",null,null,null,null,null,"C0"]
[125400,"REA  232B : POUR 2 CIRCUITS VANNE",null,1127,0.08,"/","/","/",3661238108448,null,null,null,null,"C0"]
[125355,"STATION D'AMBIANCE","RES11",345,0.08,"/","/","/",3661238108493,0.5,null,null,null,"C0"]
[125403,"SONDE WWF/ECS ( POUR TABLEAU AVEC REA)",null,48,0.01,"/","/","/",3661238108431,null,null,null,null,"C0"]
[126490,"CABLAGE POUR 2è VANNE MELANGEUSE",null,75,0.01,"/","/","/",3661238107496,null,null,null,null,"C0"]
[126624,"COMMANDE A DISTANCE ","RFF60",150,0.08,"/","/","/",3661238107472,null,null,null,null,"C0"]
[82197729,"THERMOMETRE FUMEES    ","BP28",101,0.01,"/","/","/",3661238020733,0.33,195,150,125,"C0"]
[126589,"OUTIL DE MONTAGE JD-TE Plus",null,3136,null,"/","/","/",3661238107489]
[]
["FAMILLE:","REGULATION TEMPERATURE EXTERIEURE"]
[]
[100018255,"OE-TRONIC 4 MR","AD282",1031,0.08,"/","/","/",3661238514454,2,360,280,140,"C0"]
[]
["OPTIONS"]
[100018920,"BOITIER MURAL INTERFACE OTH/MIDBUS","AD286",136,0.08,"/","/","/",3661238544918,1,213,113,100,"C0"]
[100000030,"COLIS OPTION SONDE ECS","AD212",48,0.01,"/","/","/",3661238011168,0.16,200,150,30,"C0"]
[88017017,"SONDE DEPART v3v","AD199",79,0.01,"/","/","/",3661238049185,0.21,150,200,40,"C0"]
[100013477,"CDE A DISTANCE FILAIRE RS 400   ","AD257",174,0.08,"/","/","/",3661238364257,0.253,175,122,60,"C0"]
[100013472,"CDE A DISTANCE RADIO RS 400R     ","AD255",233,0.08,"/","/","/",3661238364233,0.253,175,122,60,"C0"]
[100013307,"MODULE CHAUDIERE RADIO (EMETTEUR)","AD252",121,0.08,"/","/","/",3661238363601,0.32,260,160,130,"C0"]
[100002803,"COMMANDE A DISTANCE SIMPLIFIEE AD208","AD208",102,0.08,"/","/","/",3661238554931,null,null,null,null,"C0"]
[88017851,"CABLE DE LIAISON BUS LG 12 M","AD134",108,0.01,"/","/","/",3661238048850,0.37,350,260,30,"C0"]
[100013305,"COLIS SONDE SYSTÈME OE-TRONIC 4","AD250",45,0.01,"/","/","/",3661238363588,0.13400000000000001,150,210,25,"C0"]
[100013306,"SONDE EXTERIEURE RADIO ","AD251",76,0.08,"/","/","/",3661238363595,0.15,150,210,40,"C0"]
[100013307,"MODULE CHAUDIERE RADIO (EMETTEUR)","AD252",121,0.08,"/","/","/",3661238363601,0.32,260,160,130,"C0"]
[88017878,"MODULE DE TELESURVEILLANCE VOCAL TELCOM 2","AD152",690,0.08,"/","/","/",3661238048751,1.05,210,190,105,"C0"]
[88017836,"CABLE BUS RX11  LG 1,5 M","AD124",83,0.01,"/","/","/",3661238048911,0.06,210,160,5,"C0"]
[81997720,"CABLE LIAIS.CDI 40M ","DB119",146,0.01,"/","/","/",3661238001350,1.34,310,215,130,"C0"]
[85757741,"SONDE EXTERIEURE","FM46",40,0.01,"/","/","/",3661238022751,0.12,200,150,40,"C0"]
[7618086,"INTERFACE MODBUS+MOD.INTERNET OE",null,408,null,"/","/","/",null,1.6,315,310,115]
[]
[]
[88017904,"THERMOSTAT AMBIANCE PROGRAMMABLE","AD191",158,0.08,"/","/","/",3661238102415,0.25,135,90,55,"C0"]
[88017010,"THERMOSTAT D'AMBIANCE PROGRAMMABLE (SANS FILS)","AD192",280,0.08,"/","/","/",3661238102439,0.42499999999999999,180,150,90,"C0"]
[100000030,"COLIS OPTION SONDE ECS","AD212",48,0.01,"/","/","/",3661238011168,0.16,200,150,30,"C0"]
[88017017,"SONDE DEPART v3v","AD199",79,0.01,"/","/","/",3661238049185,0.21,150,200,40,"C0"]
[88017014," PLATINE + SONDE V3V","AD196",176,0.01,"/","/","/",3661238102422,0.52,260,170,120,"C0"]
[161118," COMMANDE A DISTANCE INTERACTIVE  AD194","AD194",193,null,"/","/","/",3661238106505,0.15,0,0,0,"C0"]
[100002803,"COMMANDE A DISTANCE SIMPLIFIEE AD208","AD208",102,0.08,"/","/","/",3661238554931,0.2,120,85,40,"C0"]
[85757742,"SONDE FUMEES","FM47",71,0.01,"/","/","/",3661238022744,0.17,210,160,40,"C0"]
[88017851,"CABLE DE LIAISON BUS LG 12 M","AD134",108,0.01,"/","/","/",3661238048850,0.37,350,260,30,"C0"]
[88017887,"ENSEMBLE DE 2 SONDES SOLAIRES","AD160",95,0.01,"/","/","/",3661238048720,0.21,210,170,40,"C7"]
[100012352,"COLIS OETRONIC 3 MR ","AD243",1572,null,"/","/","/",3661238554955,2.52,null,null,null,"C0"]
[]
[]
[125392,"REA-130B POUR 1 CIRCUIT",null,651,0.08,"/","/","/",3661238108486,null,null,null,null,"C0"]
[125394,"REA-131B POUR 2 CIRCUITS",null,838,0.08,"/","/","/",3661238108479,null,null,null,null,"C0"]
[125400,"REA  232B : POUR 2 CIRCUITS VANNE",null,1127,0.08,"/","/","/",3661238108448,null,null,null,null,"C0"]
[100012592,"REA 060B",null,230,0.08,"/","/","/",null,null,null,null,null,"C0"]
[125355,"STATION D'AMBIANCE","RES11",345,0.08,"/","/","/",3661238108493,0.5,null,null,null,"C0"]
[125403,"SONDE WWF/ECS ( POUR TABLEAU AVEC REA)",null,48,0.01,"/","/","/",3661238108431,null,null,null,null,"C0"]
[126624,"COMMANDE A DISTANCE ","RFF60",150,0.08,"/","/","/",3661238107472,null,null,null,null,"C0"]
[126490,"CABLAGE POUR 2è VANNE MELANGEUSE",null,75,0.01,"/","/","/",3661238107496,null,null,null,null,"C0"]
[]
["FAMILLE:","EAU CHAUDE SANITAIRE"]
[]
[]
[89529086,"PREPARATEUR OBD 150","GM29",1486,null,"/","/","/",3661238102408,101,695,910,1040,"C0"]
[89527720,"COLIS RENFORT","EA82",58,null,"/","/","/",3661238047839,1.79,615,170,120,"C0"]
[100002340,"BALLON OBC 162/TA + PANNEAU AVANT",null,{"$f":"+D4802+D4803","v":1639},null,"/","/","/",3661238111981,null,null,null,null,"C0"]
[100001610,"OBC 162 /TA","BH105",1486,null,"/","/","/",3661238112780,94.5,680,680,1110,"C0"]
[89557702,"PANNEAU AVANT","BH87",153,null,"/","/","/",3661238102361,3.85,680,640,100,"C0"]
[100002341,"BALLON OBC 252/TA + PANNEAU AVANT",null,{"$f":"+D4805+D4806","v":1975},null,"/","/","/",3661238111974,null,null,null,null,"C0"]
[100001611,"OBC 252 /TA","BH106",1822,null,"/","/","/",3661238112773,123,680,680,1480,"C0"]
[89557702,"PANNEAU AVANT","BH87",153,null,"/","/","/",3661238102361,3.85,680,640,100,"C0"]
[100009972,"BALLON OBA 150","EA84",1477,null,"/","/","/",3661238375239,106.5,700,900,1290,"C0"]
[]
["OPTIONS"]
[100000492,"KIT ANODE MAGNESIUM","EA103",65,null,"/","/","/",3661238011069,0.9,560,90,85,"C0"]
[89997049,"KIT DE LIAISION GS 140 - OBD 150","EA92",447,null,"/","/","/",3661238044463,7,575,505,140,"C0"]
[100006328,"KIT DE LIAISON GSR 140 P - OBD 150","EA113",435,null,"/","/","/",3661238100954,4.5,575,500,140,"C0"]
[89557001,"COLIS TUBULURE PK-PU-CU 150 / OBC 162/252","BH73",447,null,"/","/","/",3661238047600,6,575,500,135,"C0"]
[89557002,"COLIS TUBULURE PK-PU-CU 150 / OBC 162/252","BH75",447,null,"/","/","/",3661238047594,6,575,500,135,"C0"]
[89997045,"TUB. LIAISON OBC/PKR 250","BH93",447,null,"/","/","/",3661238044494,6.5,575,505,140,"C0"]
[89557010,"KIT ENSEMBLE CHAUFFANT 2400 W ","BH88",553,null,"/","/","/",3661238102378,3.2,660,215,215,"C0"]
[89557009,"KIT DE TRANSFORMATION G/R 3/4 '' ET 1 ''","BH84",31,null,"/","/","/",3661238047563,0.32500000000000001,200,140,45,"C0"]
[]
[]
["PREPARATEUR EMAILLE HAUTES \"PERFORMANCE\" OBPB"]
[100019196,"PREPARATEUR VERTICAL OBPB 150","EC624",1372,null,"/","C stockage \nECS",null,3661238551121,68,900,800,1093,"C0"]
[100019197,"PREPARATEUR VERTICAL OBPB 200","EC625",1524,null,"/","C stockage \nECS",null,3661238551138,85,900,800,1363,"C0"]
[100019198,"PREPARATEUR VERTICAL OBPB 300","EC626",1943,null,"/","C stockage \nECS",null,3661238551145,110,900,800,1883,"C0"]
[100019199,"PREPARATEUR VERTICAL OBPB 400","EC627",2842,null,"/","C stockage \nECS",null,3661238551152,146,980,850,1771,"C0"]
[100019200,"PREPARATEUR VERTICAL OBPB 500","EC628",3121,null,"/","C stockage \nECS",null,3661238551169,173,980,850,1889,"C0"]
[]
["PREPARATEUR  OBLC   (Oertli Priméa)"]
[100018187,"PREPARATEUR VERTICAL OBLC 150","EC614",1118,null,"/","C stockage \nECS",null,3661238548114,68,900,800,1110,"C0"]
[100018188,"PREPARATEUR VERTICAL OBLC 200","EC615",1283,null,"/","C stockage \nECS",null,3661238548121,85,900,800,1380,"C0"]
[100018189,"PREPARATEUR VERTICAL OBLC 300","EC616",1578,null,"/","C stockage \nECS",null,3661238548138,11,900,800,1900,"C0"]
[100018190,"PREPARATEUR VERTICAL OBLC 400","EC617",2367,null,"/","C stockage \nECS",null,3661238548145,146,380,860,1820,"C0"]
[100018191,"PREPARATEUR VERTICAL OBLC 500","EC618",2545,null,"/","C stockage \nECS",null,3661238548152,173,980,860,1910,"C0"]
[]
["OPTIONS"]
[100007832,"REGULATION POMPE DE CHARGE SLA 2","EC320",204,0.08,"/","/","/",3661238101494,0.66,225,195,85,"C0"]
[100010652,"KIT OECOPROTEC avec OETRONIC, jusqu'à 300 L","EC431",121,null,"/","/","/",3661238364745,0.49,255,170,120,"C7"]
[126765,"ANODE ACI CORREX UP BALLON > 300 LITRES","AM7",521,0.01,"/","/","/",3661238047440,0.44,425,100,55,"C0"]
[163179,"ANODE A COURANT IMPOSE (150 A 300L)","AJ38",300,0.01,"/","/","/",3661238046849,0.35,250,95,50,"C0"]
[100020083,"KIT RESISTANCE ELECTRIQUE 3 KW","ER336",384,null,"/","/","/",3661238573314,2.8,1210,190,140,"C0"]
[]
["KITS DE LIAISON"]
[100007834,"KIT DE LIAISON PKR-PUR / OB (<=300 L)","EA116",514,null,"/","/","/",3661238113350,7,600,500,135,"C0"]
[100007835,"KIT LIAISON PK264-6","EA117",514,null,"/","/","/",3661238113312,6.5,600,500,135,"C0"]
[100007837,"KIT LIAISON CHAUDIERE / BALLON","EA119",590,null,"/","/","/",3661238113336,7,600,500,135,"C0"]
[100007836,"TUBULURE GSR 230 - PKR256 à 258/OB(<=300)  ","EA118",514,null,"/","/","/",3661238113343,6.5,600,500,135,"C0"]
[100007827,"KIT LIAISON CHAUDIERE / BALLON","EA121",590,null,"/","/","/",3661238116528,6.5,600,500,135,"C0"]
[100015479,"VANNE INVERSION CHAUFF/SANITAIRE + SONDE ECS","EH145",328,null,"/","/","/",3661238381605,4.2,410,210,125,"C6"]
[]
[]
[100011343,"OB 650 B",null,{"$f":"D4855+D4856","v":4535},null,"Pas concerné par l'étiquettage",null,null,3661238351516,null,null,null,null,"C0"]
[125549,"OB-800 B",null,{"$f":"D4857+D4858","v":5757},null,"Pas concerné par l'étiquettage",null,null,3661238108400,null,null,null,null,"C0"]
[125550,"OB-1000 B",null,{"$f":"D4859+D4860","v":6165},null,"Pas concerné par l'étiquettage",null,null,3661238108394,null,null,null,null,"C0"]
[]
["COMPOSANTS"]
[100011344,"CUVE  650L","AJ45",3465,null,"/","/","/",3661238351523,280,1200,1200,1940,"C0"]
[7636968,"HABILLAGE B 650","AJ48",1070,null,"/","/","/",3661238351530,12.5,1240,325,2000,"C0"]
[100008737,"CUVE 800 L ","AJ40",4555,null,"/","/","/",3661238166394,287,1000,990,2345,"C0"]
[89757743,"HABILLAGE 800L  ","AJ29",1202,null,"/","/","/",3661238046917,35,950,950,2220,"C0"]
[100008738,"CUVE 1000 L ","AJ41",4629,null,"/","/","/",3661238166387,384,900,900,2400,"C0"]
[89757745,"HABILLAGE 1000L ","AJ31",1536,null,"/","/","/",3661238046894,39.5,650,650,2220,"C0"]
[]
["OPTIONS"]
[89757752,"ANODE A COURANT IMPOSE (150 A 300L)","AJ38",300,0.01,"/","/","/",3661238046849,0.35,250,95,50,"C0"]
[89608920,"ANODE ACI CORREX UP BALLON > 300 LITRES","AM7",521,0.01,"/","/","/",3661238047440,0.44,425,100,55,"C0"]
[89757746,"THERMOMETRE","AJ32",50,null,"/","/","/",3661238046887,0.18,145,190,125,"C0"]
[100007832,"REGULATION POMPE DE CHARGE SLA 2","EC320",204,0.08,"/","/","/",3661238101494,0.66,225,195,85,"C0"]
[7628986,"RESISTANCE ELECTRIQUE BLINDEE 1,7 à 5,3 KW ","EC740",255,0.42,"/","/","/",3661238644618,6,565,370,235,"C0"]
[]
[]
["MODULES ECS INSTANTANEE FWM COMPLET"]
[7606029,"MODULE ECS INST 3 M3 FWM 50-170","EC682",3635,null,"/","/","/",3661238584860,45,880,650,300,"C7"]
[7606142,"MODULE ECS INST 4 M3 FWM 70-240","EC683",4153,null,"/","/","/",3661238584877,52,880,650,300,"C7"]
[]
[7606152,"GROUPE DE RECIRCULATION 2M3 DN20 FWM","EC689",468,null,"/","/","/",3661238584938,8,350,250,200,"C7"]
[7618250,"GROUPE DE RECIRCULATION 3M3 DN32 FWM","EC685",1090,null,"/","/","/",3661238604025,13,1200,300,200,"C7"]
[7618251,"KIT CASCADE DN 25 2 FWM 50","EC690",1246,null,"/","/","/",3661238604032,13,1200,300,200,"C7"]
[7618252,"KIT CASCADE DN 32 2 FWM 70","EC691",1765,null,"/","/","/",3661238604049,18,1200,300,200,"C7"]
[7606147,"VANNE 3 VOIES DN25 FWM50 ET SONDES ","EC686",364,null,"/","/","/",3661238584907,3,150,150,100,"C7"]
[7606150,"VANNE 3 VOIES DN32 FWM70 ET SONDES ","EC687",468,null,"/","/","/",3661238584914,4,150,150,100,"C7"]
[]
[]
[7606985,"BALLON PRIMAIRE PSE 500 "," EC640",1592,null,"/","C stockage \nECS",null,3661238585324,130,1200,800,2000,"C0"]
[7606986,"BALLON PRIMAIRE PSE 750 "," EC641",1699,null,"/","C stockage \nECS",null,3661238585331,150,1200,800,2000,"C0"]
[7607004,"BALLON PRIMAIRE PSE 1000 ",null,{"$f":"D4889+D4892","v":1870},null,"/","C stockage \nECS",null,null,null,null,null,null,"C0"]
[7607005,"BALLON PRIMAIRE PSE 2000 ",null,{"$f":"D4890+D4893","v":3260},null,"/","C stockage \nECS",null,null,null,null,null,null,"C0"]
[7607007,"BALLON PRIMAIRE PSE 3000 ",null,{"$f":"D4891+D4894","v":4328},null,"/","C stockage \nECS",null,null,null,null,null,null,"C0"]
[]
["COMPOSANTS"]
[7606988,"CUVE PSE 1000","EC643",1549,null,"/","/","/",3661238585348,170,1200,800,2200,"C0"]
[7606992,"CUVE PSE 2000","EC646",2725,null,"/","/","/",3661238585362,250,1200,800,2200,"C0"]
[7606995,"CUVE PSE 3000","EC649",3366,null,"/","/","/",3661238585386,250,1500,800,2200,"C0"]
[7606989,"HABILLAGE ISOLATION PSE 1000","EC644",321,null,"/","/","/",3661238585355,40,1200,800,2200,"C0"]
[7606993,"HABILLAGE ISOLATION PSE 2000","EC647",535,null,"/","/","/",3661238585379,50,1400,800,2200,"C0"]
[7606996,"HABILLAGE ISOLATION PSE 3000","EC650",962,null,"/","/","/",3661238585393,70,1800,800,2200,"C0"]
[]
["FAMILLE:","BRULEUR  FIOUL"]
[]
[]
["107140FA","OES-151L EV",null,{"$f":"+D4905+D4909+D4911","v":1176},null,"Pas concerné par l'étiquettage",null,null,3661238109124,14,500,300,385,"B0"]
["107141FA","OES 151L E",null,{"$f":"+D4906+D4909+D4911","v":1025},null,"Pas concerné par l'étiquettage",null,null,3661238109100,14,500,300,385,"B0"]
["107300FA","OES-152L E",null,{"$f":"+D4907+D4909+D4911","v":1025},null,"Pas concerné par l'étiquettage",null,null,3661238109018,14,500,300,385,"B0"]
[100005322,"OES 153 LE",null,{"$f":"D4908+D4910","v":1110},null,"Pas concerné par l'étiquettage",null,null,null,14,500,300,385,"B1"]
[]
["COMPOSANTS"]
[107140,"OES-151L EV",null,1169,null,"/","/","/",3661238109131,14,500,300,385,"B0"]
[107141,"OES 151L E",null,1018,null,"/","/","/",3661238109117,14,500,300,385,"B0"]
[107300,"OES-152L E",null,1018,null,"/","/","/",3661238109025,14,500,300,385,"B0"]
[100005070,"OES 153 LE",null,1103,null,"/","/","/",3661238582613,14,500,300,385,"B1"]
[107177,"NOTICE BRULEUR OES 151/152",null,null,null,"/","/","/",3661238109070,null,null,null,null,"B2"]
[100006710,"NOTICE BRULEUR OES 153+ pse Wieland",null,7,null,"/","/","/",null,null,null,null,null,"B1"]
[83176,"PRISE WIELAND MALE 7P ",null,7,null,"/","/","/",3661238113114,null,null,null,null,"B1"]
[]
[]
["108786FA","OEN-151-1 LEV + Prise",null,{"$f":"D4918+D4920+D4921","v":1435},null,"Pas concerné par l'étiquettage",null,null,3661238108684,14,800,305,400,"B1"]
["107840FA","OEN-155 L EV + Prise",null,{"$f":"D4919+D4920+D4921","v":1560},null,"Pas concerné par l'étiquettage",null,null,3661238108905,14,800,305,400,"B1"]
[]
["COMPOSANTS"]
[108786,"OEN-151-1 LEV",null,1428,null,"/","/","/",3661238108691,14,800,305,400,"B1"]
[107840,"OEN-155 L EV ",null,1553,null,"/","/","/",3661238108912,14,800,305,400,"B1"]
[107331,"NOTICE BRULEUR",null,0,null,"/","/","/",3661238109001,null,null,null,null,"B1"]
[83176,"PRISE WIELAND MALE 7P ",null,7,null,null,null,null,3661238113114,null,null,null,null,"B1"]
[]
["OPTIONS"]
[602523,"CONTRE-PLAQUE PERCAGE 120/DIX.150",null,83,null,"/","/","/",3661238106208,1,null,null,null,"B1"]
[100012500,"FILTRE DEGAZEUR TIGERLOOP COMBI",null,133,null,"/","/","/",null,1.4,null,null,null,"B1"]
[]
[]
[100010370,"OECO FIRST OEX 4",null,{"$f":"SUM(D4931:D4933)","v":770},null,null,null,null,null,null,null,null,null,"B3"]
[]
["COMPOSANTS"]
[100009280,"OEX 4",null,750,null,null,null,null,3661238649026,14,null,null,null,"B3"]
[100010374,"SACHET NOTICE ",null,0,null,null,null,null,null,null,null,null,null,"B3"]
[7615461,"GICLEUR ",null,20,null,null,null,null,3661238601918,0.2,null,null,null,"B3"]
[]
[]
["107936FA","OES 255 LE ",null,{"$f":"D4943+D4947+D4949","v":1226},null,"Pas concerné par l'étiquettage",null,null,3661238108882,17,800,305,400,"B1"]
["107938FA","OES 255 LZ",null,{"$f":"D4944+D4947+D4949+D4948","v":1814},null,"Pas concerné par l'étiquettage",null,null,3661238108868,18,800,305,400,"B1"]
[]
[]
["107188FA","OEN 251 LE",null,{"$f":"D4945+D4947+D4949","v":2154},null,"Pas concerné par l'étiquettage",null,null,3661238109049,18,800,305,400,"B1"]
[]
["COMPOSANTS"]
[107936,"OES 255 LE",null,1219,null,"/","/","/",3661238108899,17,800,305,400,"B1"]
[107938,"OES 255 LZ",null,1801,null,"/","/","/",3661238108875,18,800,305,400,"B1"]
[100019686,"OEN 251 LE",null,2147,null,"/","/","/",3661238109056,18,800,305,400,"B1"]
[108481,"NOTICE OES 250",null,0,null,"/","/","/",3661238108769,null,null,null,null,"B2"]
[108494,"NOTICE OEN 250",null,0,null,"/","/","/",3661238108752,null,null,null,null,"B2"]
[83191,"PRISE WIELAND MALE 4P ",null,6,null,"/","/","/",3661238113107,null,null,null,null,"B1"]
[83176,"PRISE WIELAND MALE 7P ",null,7,null,"/","/","/",3661238113114,null,null,null,null,"B1"]
[]
[]
[100004980,"OES 352 LE",null,{"$f":"D4962+D4970","v":1268},null,"Pas concerné par l'étiquettage",null,null,3661238109858,24,780,370,420,"B1"]
[100004981,"OES 353 LE",null,{"$f":"D4963+D4970","v":1471},null,"Pas concerné par l'étiquettage",null,null,3661238109841,24,780,370,420,"B1"]
[100004982,"OES 354 LE",null,{"$f":"D4964+D4970","v":1535},null,"Pas concerné par l'étiquettage",null,null,3661238109834,24,780,370,420,"B1"]
[100004984,"OES 352 LZ",null,{"$f":"D4965+D4970","v":1805},null,"Pas concerné par l'étiquettage",null,null,3661238109827,25,780,370,420,"B1"]
[100004985,"OES 353 LZ",null,{"$f":"D4966+D4970","v":1872},null,"Pas concerné par l'étiquettage",null,null,3661238109810,25,780,370,420,"B1"]
[100004986,"OES 354 LZ",null,{"$f":"D4967+D4970","v":1939},null,"Pas concerné par l'étiquettage",null,null,3661238109803,25,780,370,420,"B1"]
[100004987,"OES 355 LZ",null,{"$f":"D4968+D4970","v":2072},null,"Pas concerné par l'étiquettage",null,null,3661238109797,33,900,370,500,"B1"]
[100004988,"OES 356 LZ",null,{"$f":"D4969+D4970","v":2340},null,"Pas concerné par l'étiquettage",null,null,3661238109780,33,900,370,500,"B1"]
[]
["COMPOSANTS"]
[100004070,"OES 352 LE",null,1256,null,"/","/","/",3661238111509,24,780,370,420,"B1"]
[100004071,"OES 353 LE",null,1459,null,"/","/","/",3661238111493,24,780,370,420,"B1"]
[100004072,"OES 354 LE",null,1523,null,"/","/","/",3661238111486,24,780,370,420,"B1"]
[100004074,"OES 352 LZ",null,1793,null,"/","/","/",3661238111479,25,780,370,420,"B1"]
[100004075,"OES 353 LZ",null,1860,null,"/","/","/",3661238111462,25,780,370,420,"B1"]
[100004076,"OES 354 LZ",null,1927,null,"/","/","/",3661238111455,25,780,370,420,"B1"]
[100004077,"OES 355 LZ",null,2060,null,"/","/","/",3661238111448,33,900,370,500,"B1"]
[100003700,"OES 356 LZ",null,2328,null,"/","/","/",3661238111660,33,900,370,500,"B1"]
[100004999,"Sachet DOCUMENTATION OES 350 L FR (notice + 2 prises W)",null,12,null,"/","/","/",3661238109681,0.2,null,null,null,"B2"]
[]
["OPTIONS"]
[602523,"CONTRE-PLAQUE PERCAGE 120/DIX.150",null,83,null,"/","/","/",3661238106208,1,200,200,5,"B1"]
[602519,"CONTRE-PLAQUE PERCAGE 130/DIX.170",null,76,null,"/","/","/",3661238001770,3,260,260,6,"B1"]
[88027180,"CAISSON INSONORISANT POUR 350",null,1541,null,"/","/","/",3661238048270,47,515,640,910,"B1"]
[]
[]
["105617FA","OES-441-1 LZ",null,{"$f":"D4985+D4986+D4996+D4997","v":2575},null,"Pas concerné par l'étiquettage",null,null,3661238109254,63,1190,550,535,"B1"]
["106124FA","OES-441-2 LZ",null,{"$f":"D4987+D4988+D4996+D4997","v":3114},null,"Pas concerné par l'étiquettage",null,null,3661238109223,63,1190,550,535,"B1"]
["105518FA","OES-441-3 LZ",null,{"$f":"D4989+D4990+D4996+D4997","v":3335},null,"Pas concerné par l'étiquettage",null,null,3661238109315,69,1190,550,535,"B1"]
["105519FA","OES-442 LZ",null,{"$f":"D4991+D4992+D4996+D4997","v":3605},null,"Pas concerné par l'étiquettage",null,null,3661238109292,69,1190,550,535,"B1"]
["105520FA","OES-443 LZ",null,{"$f":"D4993+D4994+D4995+D4996+D4997","v":3870},null,"Pas concerné par l'étiquettage",null,null,3661238109278,76,1190,550,535,"B1"]
[]
["COMPOSANTS"]
[105617,"OES-441-1 LZ",null,2553,null,"/","/","/",3661238109261,63,1190,550,535,"B1"]
[106284,"GICLEUR 6.50G 45° B",null,9,null,"/","/","/",3661238109209,0.03,null,null,null,"B1"]
[106124,"OES-441-2 LZ",null,3092,null,"/","/","/",3661238109230,63,1190,550,535,"B1"]
[106285,"GICLEUR 7.50G 45° B",null,9,null,"/","/","/",3661238109193,0.03,null,null,null,"B2"]
[105518,"OES-441-3 LZ",null,3313,null,"/","/","/",3661238109322,69,1190,550,535,"B1"]
[106287,"GICLEUR 10.00G 45° B",null,9,null,"/","/","/",3661238109186,0.03,null,null,null,"B2"]
[105519,"OES-442 LZ",null,3583,null,"/","/","/",3661238109308,69,1190,550,535,"B1"]
[106287,"GICLEUR 10.00G 45° B",null,9,null,"/","/","/",3661238109186,0.5,null,null,null,"B2"]
[105520,"OES-443 LZ",null,3839,null,"/","/","/",3661238109285,76,1190,550,535,"B1"]
[106291,"GICLEUR 10,00G 60° B",null,9,null,"/","/","/",3661238109179,0.03,null,null,null,"B1"]
[106282,"GICLEUR 5,00G 45° B",null,9,null,"/","/","/",3661238109216,0.03,null,null,null,"B1"]
[83176,"PRISE WIELAND MALE 7P ",null,7,null,"/","/","/",3661238113114,null,null,null,null,"B1"]
[83191,"PRISE WIELAND MALE 4P ",null,6,null,"/","/","/",3661238113107,null,null,null,null,"B1"]
[]
["OPTIONS"]
[88027182,"CAISSON INSONORISANT POUR  440L",null,2157,null,"/","/","/",3661238048263,98,1160,970,890,"B2"]
[]
[]
[108005,"OES 541 LZ (2 allures) ",null,4774,null,"/","/","/",3661238108851,65,1390,700,660,"B2"]
[]
["FAMILLE:","BRULEUR  GAZ"]
[]
[]
["107580FA","OES 151GE",null,{"$f":"D5012+D5015+D5014","v":1758},null,"Pas concerné par l'étiquettage",null,null,3661238108967,15,800,310,400,"B2"]
["107590FA","OES 155 GE",null,{"$f":"D5013+D5015+D5014","v":2041},null,"Pas concerné par l'étiquettage",null,null,3661238108943,16.5,800,310,400,"B2"]
[]
["COMPOSANTS"]
[107580,"OES 151GE",null,1751,null,"/","/","/",3661238108974,15,800,310,400,"B2"]
[107590,"OES 155 GE",null,2034,null,"/","/","/",3661238108950,16.5,800,310,400,"B2"]
[107558,"Notice",null,0,null,"/","/","/",3661238108981,null,null,null,null,"B2"]
[83176,"PRISE WIELAND MALE 7P       ",null,7,null,"/","/","/",3661238113114,null,null,null,null,"B1"]
[]
["OPTIONS"]
[88027289,"KIT GPL POUR BRUL G100 DD",null,144,null,"/","/","/",3661238048089,0.26,230,180,250,"B2"]
[88027290,"KIT GPL POUR BRUL G200/1",null,143,null,"/","/","/",3661238048072,0.25,340,190,35,"B2"]
[]
[]
["108534FA","OEN 255 GE",null,{"$f":"D5026+D5030+D5028","v":2326},null,"Pas concerné par l'étiquettage",null,null,3661238108738,20,800,305,400,"B2"]
["108535FA","OEN 255 GI",null,{"$f":"D5027+D5030+D5028+D5029","v":2770},null,"Pas concerné par l'étiquettage",null,null,3661238108714,21.5,800,305,400,"B2"]
[]
["COMPOSANTS"]
[108534,"OEN 255 GE",null,2319,null,"/","/","/",3661238108745,20,800,305,400,"B2"]
[108535,"OEN 255 GI",null,2757,null,"/","/","/",3661238108721,21.5,800,305,400,"B2"]
[83176,"PRISE WIELAND MALE 7P ",null,7,null,"/","/","/",3661238113114,0.05,null,null,null,"B1"]
[83191,"PRISE WIELAND MALE 4P ",null,6,null,"/","/","/",3661238113107,0.05,null,null,null,"B1"]
[108665,"NOTICE",null,0,null,"/","/","/",3661238108707,null,null,null,null,"B2"]
[]
["OPTIONS"]
[200001978,"KIT DE CONVERSION PROPANE",null,441,null,"/","/","/",3661238001794,0.6,430,180,80,"B2"]
[92089,"CONTROLEUR D'ETANCHEITE VPS 504",null,1129,null,"/","/","/"]
[100002804,"SET CONTROLEUR ETANCHEITE TC116 W05-T",null,1095,null,"/","/","/",null,null,null,null,null,"B2"]
[]
[]
[100004989,"OES 352 GE",null,{"$f":"D5046+D5052","v":2943},null,"Pas concerné par l'étiquettage",null,null,3661238109773,32,900,365,490,"B2"]
[100004990,"OES 353 GE",null,{"$f":"D5047+D5052","v":3213},null,"Pas concerné par l'étiquettage",null,null,3661238109766,32,900,365,490,"B2"]
[100004991,"OES 352 GI",null,{"$f":"D5048+D5052","v":3142},null,"Pas concerné par l'étiquettage",null,null,3661238109759,32,900,365,490,"B2"]
[100004992,"OES 353 GI",null,{"$f":"D5049+D5052","v":3479},null,"Pas concerné par l'étiquettage",null,null,3661238109742,32,900,365,490,"B2"]
[100004993,"OES 355 GI - 20 mbar",null,{"$f":"D5050+D5052","v":4283},null,"Pas concerné par l'étiquettage",null,null,3661238109735,40,900,365,490,"B2"]
[100004994,"OES 355 GI - 300 mbar",null,{"$f":"D5051+D5052","v":3947},null,"Pas concerné par l'étiquettage",null,null,3661238109728,39,900,365,490,"B2"]
[]
["COMPOSANTS"]
[100004593,"OES 352 GE",null,2931,null,"/","/","/",3661238110403,32,900,365,490,"B2"]
[100004594,"OES 353 GE",null,3201,null,"/","/","/",3661238110397,32,900,365,490,"B2"]
[100004595,"OES 352 GI",null,3130,null,"/","/","/",3661238110380,32,900,365,490,"B2"]
[100004596,"OES 353 GI",null,3467,null,"/","/","/",3661238110373,32,900,365,490,"B2"]
[100004597,"OES 355 GI - 20 mbar",null,4271,null,"/","/","/",3661238110366,40,900,365,490,"B2"]
[100004598,"OES 355 GI - 300 mbar",null,3935,null,"/","/","/",3661238110359,39,900,365,490,"B2"]
[100005000,"SACHET DOCUMENTATION OES 350 G FR (notice + 2 prises W)",null,12,null,"/","/","/",3661238109674,0.2,null,null,null,"B2"]
[]
["OPTIONS"]
[602524,"CONTRE-PLAQUE PERCAGE 170/DIX. 200",null,117,null,"/","/","/",3661238106192,null,null,null,null,"B1"]
[200005840,"KIT DE CONVERSION PROPANE",null,426,null,"/","/","/",3661238166295,0.49,230,140,60,"B2"]
[200005841,"KIT DE CONVERSION PROPANE",null,426,null,"/","/","/",3661238166288,0.6,430,180,80,"B2"]
[88027180,"CAISSON INSONORISANT POUR 350",null,1541,null,"/","/","/",3661238048270,null,null,null,null,"B1"]
[130716,"INTERRUPTEUR +/- POUR GI (CPR)",null,"P/R",null,"/","/","/"]
[]
[]
[100004995,"OEN 352 GI",null,{"$f":"D5067+D5070","v":3344},null,"Pas concerné par l'étiquettage",null,null,3661238109711,32,900,365,490,"B2"]
[100004996,"OEN 353 GI",null,{"$f":"D5068+D5070","v":3881},null,"Pas concerné par l'étiquettage",null,null,3661238109704,36,900,365,490,"B2"]
[100004997,"OEN 355 GI - 20 mbar",null,{"$f":"D5069+D5070","v":4414},null,"Pas concerné par l'étiquettage",null,null,3661238109698,42,900,365,490,"B2"]
[]
["COMPOSANTS"]
[100004599,"OEN 352 GI",null,3332,null,"/","/","/",3661238110342,32,900,365,490,"B2"]
[100004600,"OEN 353 GI",null,3869,null,"/","/","/",3661238110335,36,900,365,490,"B2"]
[100004601,"OEN 355 GI - 20 mbar",null,4402,null,"/","/","/",3661238110328,42,900,365,490,"B2"]
[100005001,"Sachet DOCUMENTATION OEN 350 G FR (notice + 2 prises W)",null,12,null,"/","/","/",3661238109667,0.2,null,null,null,"B2"]
[]
["OPTIONS"]
[602524,"CONTRE-PLAQUE PERCAGE 170/DIX. 200",null,117,null,"/","/","/",3661238106192,3.5,300,300,6,"B1"]
[7626036,"KIT REGULATEUR RWF55 ","MW1",1219,0.08,"/","/","/",3661238048065,2.7,250,210,165,"B2"]
[200005580,"S/E POTENTIOMETRE DE RECOPIE",null,366,null,"/","/","/",null,null,null,null,null,"B2"]
[106446,"CAISSON INSONORISANT POUR 350",null,1541,null,"/","/","/",3661238048270,47,510,640,910,"B1"]
[130716,"INTERRUPTEUR +/- POUR GI (CPR)",null,"P/R",null,"/","/","/",3661238150539]
[]
[]
[106401,"OES 441.2 GI",null,3402,null,"/","/","/",3661238109162,61,1180,550,535,"B2"]
[106402,"OES 441.3 GI",null,4742,null,"/","/","/",3661238109155,60.5,1180,550,535,"B2"]
[106404,"OES 443 GI",null,5247,null,"/","/","/",3661238109148,67.5,1180,550,535,"B2"]
[]
["OPTIONS"]
[100019540,"RAMPE GAZ MB-VEF 415 S32",null,1401,null,"/","/","/",3661238564770,9,null,null,null,"B2"]
[100019542,"RAMPE GAZ MB-VEF 420 S12",null,1812,null,"/","/","/",3661238564794,9,null,null,null,"B2"]
[100019543,"RAMPE GAZ MB-VEF 425 S12",null,2633,null,"/","/","/",3661238564800,9,null,null,null,"B2"]
[88027177,"REGULATEUR PRESSION 300 mbar GDJ 50 RACCORDT. Ø 2''","GDJ50",423,null,"/","/","/",3661238048287,3.1,255,220,205,"B2"]
[88027182,"CAISSON INSONNORISANT",null,2157,null,"/","/","/",3661238048263,98,1160,970,890,"B2"]
[97955833,"SET RACCORDEMENT  RAMPE FOYER",null,33,null,"/","/","/",3661238102118,0.14000000000000001,null,null,null,"B2"]
[88027317,"KIT POUR FONCTIONNEMENT BRULEUR EN 2 ALLURES (THERMOSTAT  2 POINTS)",null,111,0.08,"/","/","/",3661238047952,1,260,270,170,"B2"]
[105627,"CHARIOT BRULEUR OE 440",null,1084,null,"/","/","/",3661238109247,14,1200,800,500,"B2"]
[7626036,"KIT REGULATEUR RWF55 ","MW1",1219,0.08,"/","/","/",3661238048065,2.7,250,210,165,"B2"]
[200005582,"KIT POTENTIOMETRE DE RECOPIE ",null,366,null,"/","/","/",null,0.52,180,420,80,"B2"]
[]
[]
[108286,"OES 541 GI (modulant)",null,6047,null,"/","/","/",3661238108844,70,1395,710,660,"B2"]
[108287,"OES 542 GI (modulant)",null,7775,null,"/","/","/",3661238108837,105,1400,1000,670,"B2"]
[]
["OPTIONS"]
[108055,"RAMPE MBD  420 CTD (100-300 mbar)",null,1802,null,"/","/","/",3661238048126,12.5,570,350,290,"B2"]
[108380,"ADAPTATEUR FN 65 2\"",null,202,null,"/","/","/",3661238048034,6.2,320,240,240,"B2"]
[88027299,"ADAPTATEUR FN 80 FN 65",null,345,null,"/","/","/",3661238048027,11,470,380,390,"B2"]
[88027317,"KIT POUR FONCTIONNEMENT BRULEUR EN 2 ALLURES (THERMOSTAT  2 POINTS)",null,111,0.08,"/","/","/",3661238047952,1,260,270,170,"B2"]
[130990,"RWD 40 POUR OEN 540 GI",null,"P/R",null,"/","/","/",3661238321489]
[100006662,"SET POTENTIOMETRE DE RECOPIE",null,487,null,"/","/","/",3661238161740,0.2,170,90,70,"B2"]
[]
["FAMILLE:","CHAUDIERE A COMBUSTIBLE SOLIDE"]
[]
[]
[603464,"COMBUSTIBLE SOLIDE  ","CF124",{"$f":"D5119+D5125+D5131+D5137","v":3545},null,"Pas concerné par l'étiquettage",null,null,3661238106130,null,null,null,null,"C0"]
[603465,"COMBUSTIBLE SOLIDE  ","CF125",{"$f":"D5120+D5126+D5132+D5137","v":4032},null,"Pas concerné par l'étiquettage",null,null,3661238106123,null,null,null,null,"C0"]
[603466,"COMBUSTIBLE SOLIDE","CF126",{"$f":"D5121+D5127+D5133+D5137","v":4559},null,"Pas concerné par l'étiquettage",null,null,3661238106116,null,null,null,null,"C0"]
[603467,"COMBUSTIBLE SOLIDE  ","CF127",{"$f":"D5122+D5128+D5134+D5137","v":4997},null,"Pas concerné par l'étiquettage",null,null,3661238106109,null,null,null,null,"C0"]
[603468,"COMBUSTIBLE SOLIDE ","CF128",{"$f":"D5123+D5129+D5135+D5137","v":5408},null,"Pas concerné par l'étiquettage",null,null,3661238106093,null,null,null,null,"C0"]
[603469,"COMBUSTIBLE SOLIDE  ","CF129",{"$f":"D5124+D5130+D5136+D5137","v":5893},null,"Pas concerné par l'étiquettage",null,null,3661238106086,null,null,null,null,"C0"]
[]
["COMPOSANTS"]
[82627704,"CORPS CHAUDIERE CF 124CSE",null,1978,null,"/","/","/",3661238018723,176,1030,425,445,"C0"]
[82627705,"CORPS CHAUDIERE CF 125CSE",null,2434,null,"/","/","/",3661238018716,215.5,1035,540,445,"C0"]
[82627706,"CORPS CHAUDIERE CF 126CSE",null,2916,null,"/","/","/",3661238018709,255.5,1035,645,445,"C0"]
[82627707,"CORPS CHAUDIERE CF 127CSE",null,3331,null,"/","/","/",3661238018693,297,1040,755,445,"C0"]
[82627708,"CORPS CHAUDIERE CF 128CSE",null,3707,null,"/","/","/",3661238018686,335.5,1040,865,445,"C0"]
[82627709,"CORPS CHAUDIERE CF 129CSE",null,4161,null,"/","/","/",3661238018679,373.5,1040,975,445,"C0"]
[82627714,"ACCESSOIRES CF 124 CSE L2",null,871,null,"/","/","/",3661238018662,51,660,615,370,"C0"]
[82627715,"ACCESSOIRES CF 125 CSE L3",null,892,null,"/","/","/",3661238018655,55,660,615,370,"C0"]
[82627716,"ACCESSOIRES CF 126 CSE L4",null,930,null,"/","/","/",3661238018648,59.5,660,615,370,"C0"]
[82627717,"ACCESSOIRES CF 127 CSE L5",null,950,null,"/","/","/",3661238018631,61.5,660,615,370,"C0"]
[82627718,"ACCESSOIRES CF 128 CSE L6",null,974,null,"/","/","/",3661238018624,65,660,615,370,"C0"]
[82627719,"ACCESSOIRES CF 129 CSE L7",null,1003,null,"/","/","/",3661238018617,69,660,615,370,"C0"]
[82697704,"GARNITURE JAQUETTE 4 ELTS L34",null,656,null,"/","/","/",3661238018457,7.5,1070,680,140,"C0"]
[82697705,"GARNITURE JAQUETTE 5 ELTS L35",null,666,null,"/","/","/",3661238018440,22,1070,680,140,"C0"]
[82697706,"GARNITURE JAQUETTE 6 ELTS L36",null,673,null,"/","/","/",3661238018433,24,1070,680,140,"C0"]
[82697707,"GARNITURE JAQUETTE 7 ELTS L37",null,676,null,"/","/","/",3661238018426,27.5,1070,1010,140,"C0"]
[82697708,"GARNITURE JAQUETTE 8 ELTS L38",null,687,null,"/","/","/",3661238018419,29.5,1070,1020,150,"C0"]
[82697709,"GARNITURE JAQUETTE 9 ELTS L39",null,689,null,"/","/","/",3661238018402,35.5,1070,1020,150,"C0"]
[80018701,"OUTILS DE CHAUFFE COMPLET",null,40,null,"/","/","/",3661238001763,1.81,1070,105,50,"C0"]
[]
["OPTIONS"]
[82697720,"ECHANGEUR DE SECURITE S/VANNE ","CF124/5",628,null,"/","/","/",3661238018396,7,800,170,170,"C0"]
[82697721,"ECHANGEUR DE SECURITE S/VANNE ","CF126/7",628,null,"/","/","/",3661238018389,7.5,1170,130,180,"C0"]
[82697722,"ECHANGEUR DE SECURITE S/VANNE ","CF128/9",628,null,"/","/","/",3661238018372,8.3000000000000007,125,1160,14,"C0"]
[82697701,"VANNE DE COMMANDE DE L'ECHANGEUR DE SECURITE","L33",211,null,"/","/","/",3661238018464,0.63,215,130,40,"C0"]
[]
[]
[100013120,"CHAUDIÈRE BÛCHES 20 KW INVERSE  CBI-II 20","ML37",4832,null,"Pas concerné par l'étiquettage",null,null,3661238362024,329,770,590,1180,"C0"]
[100013121,"CHAUDIÈRE BÛCHES 30 KW INVERSE  CBI-II 30","ML38",5948,null,"Pas concerné par l'étiquettage",null,null,3661238362031,347,970,590,1180,"C0"]
[100013122,"CHAUDIÈRE BÛCHES 40 KW INVERSE  CBI-II 40","ML39",7376,null,"Pas concerné par l'étiquettage",null,null,3661238362017,398,970,670,1260,"C0"]
[100020114,"CHAUDIÈRE BÛCHES 30 KW INVERSE OCBI 30 C5","ML49",5808,null,"Pas concerné par l'étiquettage"]
[]
[]
[100004770,"CHAUDIERE BUCHES 20 KW A TIRAGE NATUREL  CBB 20 ","ML1",3880,null,"Pas concerné par l'étiquettage",null,null,3661238002340,288,700,1155,1430,"C0"]
[100004771,"CHAUDIERE BUCHES 30 KW A TIRAGE NATUREL CBB 30","ML2",4578,null,"Pas concerné par l'étiquettage",null,null,3661238002333,344,695,1150,1600,"C0"]
[100004772,"CHAUDIERE BUCHES 15 KW A TIRAGE NATUREL  OCBB 15 E","ML3",4348,null,"Pas concerné par l'étiquettage",null,null,3661238002326,302,685,1000,1365,"C0"]
[]
["OPTIONS"]
[100004803,"GROUPE DE RELEVE DU RETOUR  FRR L21","ML9",893,null,"/","/","/",3661238002197,9.5,370,190,230,"C0"]
[100020120,"MODULE DE TEMPERAURE RETOUR ","ML52",675,null,"/","/","/",3661238574403,5.2,null,null,null,"C0"]
[82697701,"VANNE DE COMMANDE DE L'ECHANGEUR DE SECURITE",null,211,null,"/","/","/",3661238018464,0.63,215,130,40,"C0"]
[]
["OPTIONS REGULATIONS CIRCUIT ECS-CHAUFFAGE"]
[125392,"REA-130B POUR 1 CIRCUIT",null,651,0.08,"/","/","/",3661238108486,null,null,null,null,"C0"]
[125394,"REA-131B POUR 2 CIRCUITS",null,838,0.08,"/","/","/",3661238108479,null,null,null,null,"C0"]
[125400,"REA  232B : POUR 2 CIRCUITS VANNE",null,1127,0.08,"/","/","/",3661238108448,null,null,null,null,"C0"]
[84907702,"THERMOSTAT DE FUMEE (CDE Chaudière Fioul/gaz) ",null,476,null,"/","/","/",3661238033115,1,305,205,125,"C0"]
[100002330,"MODULE HYDRAULIQUE CH. BOIS ","EA108",815,null,"/","/","/",3661238007444,8,400,270,230,"C0"]
[]
["FAMILLE:","POÊLE A BOIS ET GRANULES"]
[]
[]
[100019281,"POÊLE A BOIS OPBE 7 T","LB6",1318,null,"Pas concerné par l'étiquettage",null,null,3661238550827,131,580,710,1210,"C2"]
[100019282,"POÊLE A BOIS OPBE 7 G","LB7",1318,null,"Pas concerné par l'étiquettage",null,null,3661238550834,152,715,580,1210,"C2"]
[100019283,"POÊLE A BOIS OPBA 6 T","LB8",2086,null,"Pas concerné par l'étiquettage",null,null,3661238550841,165,650,710,1350,"C2"]
[100019284,"POÊLE A BOIS OPBA 6 O    ","LB9",2086,null,"Pas concerné par l'étiquettage",null,null,3661238550858,168,650,710,1350,"C2"]
[]
[]
[7617764,"POÊLE OPBR 5 T   TÔLE NOIRE","LB44",2443,null,"Pas concerné par l'étiquettage",null,null,3661238602977,157,1500,714,637,"C2"]
[]
[]
[7618738,"POÊLE OPBR 5 CR   HABILLAGE CERAM ROUGE",null,{"$f":"D5185+D5186","v":3867},null,"Pas concerné par l'étiquettage",null,null,null,null,null,null,null,"C2"]
[7618737,"POÊLE OPBR 5 CB   HABILLAGE CERAM BLANC",null,{"$f":"D5185+D5187","v":3867},null,"Pas concerné par l'étiquettage",null,null,null,null,null,null,null,"C2"]
[7618736,"POÊLE OPBR 5 CN   HABILLAGE CERAM NOIR",null,{"$f":"D5185+D5188","v":3867},null,"Pas concerné par l'étiquettage",null,null,null,null,null,null,null,"C2"]
[]
["COMPOSANTS"]
[7617766,"POÊLE OPBR 5 C CORPS SEUL CERAM","LB46",2035,null,"/","/","/",3661238602991,125,1460,714,637,"C2"]
[7617767,"HABILLAGE OPBR CERAMIQUE BORDEAUX","LB47",1832,null,"/","/","/",3661238603004,82,572,1535,600,"C2"]
[7617769,"HABILLAGE OPBR CERAMIQUE BLANCHE","LB49",1832,null,"/","/","/",3661238603035,82,572,1535,600,"C2"]
[7617768,"HABILLAGE OPBR CERAMIQUE NOIR","LB48",1832,null,"/","/","/",3661238603028,82,572,1535,600,"C2"]
[]
[]
[7618739,"POÊLE OPBR 5 PG PIERRE DE GRES ",null,{"$f":"D5195+D5196","v":2645},null,"Pas concerné par l'étiquettage",null,null,null,null,null,null,null,"C2"]
[7618740,"POÊLE OPBR 5 PO PIERRE OLAIRE",null,{"$f":"D5195+D5197","v":2645},null,"Pas concerné par l'étiquettage",null,null,null,null,null,null,null,"C2"]
[]
["COMPOSANTS"]
[7617765,"CORPS SEUL PIERRE","LB45",2035,null,"/","/","/",3661238602984,132,1460,714,637,"C2"]
[7617770,"HABILLAGE OPBR PIERRE DE GRES","LB50",610,null,"/","/","/",3661238603042,86,500,1500,200,"C2"]
[7617773,"HABILLAGE OPBR PIERRE OLAIRE","LB51",610,null,"/","/","/",3661238603059,100,550,1535,300,"C2"]
[]
["OPTIONS"]
[7617774,"BLOC ACCUMULATION OPBR","LB52",250,null,"/","/","/",3661238603066,84,265,1080,360,"C2"]
[100019287,"PROTECTION DE SOL ARROND 1000X100","LB17",110,null,"/","/","/",3661238550889,15,1060,1025,20,"C2"]
[]
[]
[7617755,"POÊLE A PELLETS OPPA 8 V","LB38",3402,null,"Pas concerné par l'étiquettage",null,null,3661238603011,119,1202,714,637,"C2"]
[7617756,"POÊLE A PELLETS OPPA 8 PVI","LB39",3579,null,"Pas concerné par l'étiquettage",null,null,3661238602922,119,1202,714,637,"C2"]
[7617757,"POÊLE A PELLETS OPPA 8 GVI","LB40",4097,null,"Pas concerné par l'étiquettage",null,null,3661238602939,138,1417,714,637,"C2"]
[null,null,null,null,null,null,null,null,3661238602977,157,1500,714,637,"C2"]
["OPTIONS VENTOUSE HORIZONTALE POUR POELE A PELLETS BBC"]
[7607218,"KIT VENTOUSE H 80-130 PGI","LB25",954,null,"/","/","/",3661238585713,14.8,1030,530,535,"C2"]
[7607219,"ELEMENT DROIT L1000 80-130 PGI ","LB26",151,null,"/","/","/",3661238585720,2.6,1030,105,105,"C2"]
[7607220,"ELEMENT DROIT L450 80-130 PGI","LB27",104,null,"/","/","/",3661238585737,1.4,510,105,105,"C2"]
[7607221,"ELEMENT DROIT L250 80-130 PGI","LB28",88,null,"/","/","/",3661238585744,1,330,105,105,"C2"]
[7607222,"ELEMENT REGLABLE 80-130 PGI","LB29",131,null,"/","/","/",3661238585751,2,510,105,105,"C2"]
[7607223,"KIT TRAVERSEE MUR STH 80-130 PGI","LB30",357,null,"/","/","/",3661238585768,10.6,500,500,510,"C2"]
[7607224,"COLLIER MURAL D130","LB31",29,null,"/","/","/",3661238585775,0.2,400,270,30,"C2"]
[]
["OPTIONS"]
[100019286,"PROTECTION DE SOL RECT 900X750  ","LB16",93,null,"/","/","/",3661238550872,11.3,940,810,20,"C2"]
[100019287,"PROTECTION DE SOL ARROND 1000X100","LB17",110,null,"/","/","/",3661238550889,15,1060,1025,20,"C2"]
[]
["FAMILLE:","CHAUDIERE  ELECTRIQUE"]
[]
[100013409,"CER 8M",null,2676,3.33,"D","/","/",3661238572959,22,310,495,260,"C8"]
[100013450,"CER 12M",null,2757,3.33,"D","/","/",3661238572911,22,310,495,260,"C8"]
[100013452,"CER 12TR",null,2924,3.33,"D","/","/",3661238572966,22,310,495,260,"C8"]
[]
["OPTIONS"]
[100013456,"SONDE EXTERIEURE CER","JE7",73,0.01,"/","/","/",3661238573215,0.1,46,64,30,"C8"]
[100003690,"SONDE PT 1000 CER SUR CABLE SILICONE (sonde départ V3V)","EC171",61,0.01,"/","/","/",3661238573239,0.112,0,0,0,"C8"]
[100013562,"RELAIS STATIQUE SIP 8A/230 V (2 pces)","JE8",25,0.01,"/","/","/",3661238572942,0.01,23,23,4,"C8"]
[89997002,"KIT DE SECURITE ","EA47",127,null,"/","/","/",3661238044654,6.1,635,195,170,"C0"]
[100020073,"THERMOSTAT SIMPLIFIE CER T87 OPEN THERM FILAIRE","JE5",154,0.08,"/","/","/",3661238102156,6.55,405,270,240,"C8"]
[100020074,"THERMOSTAT SIMPLIFIE CER Y87 OPEN THERM RADIO FREQUENCE","JE6",417,0.08,"/","/","/",3661238102149,8.1999999999999993,405,270,240,"C8"]
[100020075,"THERMOSTAT PROGRAMMABLE CER 850-2 OPEN THERM FILAIRE","JE4",429,0.08,"/","/","/",3661238044739,1.56,400,230,130,"C8"]
[]
[100013563,"PRESSE ETOUPE COMPLET M25",null,6,null,"/","/","/",null,null,null,null,null,"C8"]
["COMPOSANTS"]
[100013568,"PRESSE ETOUPE M25",null,3,null,"/","/","/",null,0.02,48,30,0,"C8"]
[100013569,"ECROU POUR PRESSE ETOUPE M25",null,3,null,"/","/","/",null,0.02,9,32," ","C8"]
[]
[100013564,"PRESSE ETOUPE COMPLET M16",null,4,null,"/","/","/",null,null,null,null,null,"C8"]
["COMPOSANTS"]
[100013570,"PRESSE ETOUPE M16",null,2,null,"/","/","/",null,7.0000000000000007E-2,42,19,0,"C8"]
[100013571,"ECROU POUR PRESSE ETOUPE M16",null,2,null,"/","/","/",null,5.0000000000000001E-3,9,22,0,"C8"]
[null,null,null,null,null,null,null,null,null,null,null,null,null,"C8"]
[100013565,"PRESSE ETOUPE COMPLET M12",null,4,null,"/","/","/",null,null,null,null,null,"C8"]
["COMPOSANTS"]
[100013572,"PRESSE ETOUPE M12",null,2,null,"/","/","/",null,0.05,35,12,0,"C8"]
[100013573,"ECROU POUR PRESSE ETOUPE M12",null,2,null,"/","/","/",null,3.0000000000000001E-3,9,15,0,"C8"]
[100020165,"CONSOLE MUR COLLECTEUR ","EA141",43,null,"/","/","/",3661238108653,1.2,220,125,70,"C0"]
[100020166,"CONSOLE MUR 1 MODULE ","EA142",114,null,"/","/","/",3661238108646,1.6,220,125,70,"C0"]
[100020167,"CIRCUIT DIRECT P.ELEC CLASSE A  ","EA143",631,0.17,"/","/","/",3661238108639,5.0999999999999996,460,270,235,"C0"]
[100020168,"CIRCUIT V3V P.ELEC","EA144",897,0.17,"/","/","/",3661238575059,6,460,270,235,"C0"]
[100020169,"MODULE HYDR COMPACT 2 CIRCUITS HEE","EA145",1122,0.17399999999999999,"/","/","/",3661238108622,9,525,415,210,"C0"]
[]
[null,"TARIF INDICATIF DES MISES  EN SERVICE 2016"]
[]
[null,"MISE EN SERVICE CHAUDIERE ELECTRIQUE ",null,146]
[null,"MISE EN SERVICE OENOVIAPAC (tous modèles)",null,427]
[null,"MISE EN SERVICE PAC HYBRIDES",null,507]
[null,"MISE EN SERVICE OTWH SPLIT ",null,238]
[null,"MISE EN SERVICE OTWH",null,162]
[null,"MISE EN SERVICE CESI BASICSUN/POWERSUN/PERFECTSUN",null,135]
[null,"MISE EN SERVICE SSC OECOSUN ",null,160]
[null,"MISE EN SERVICE SSC OECOSUN AVEC PAC",null,517]
[null,"MISE EN SERVICE GMR 1000/3000 CONDENS GMX - GMR 1000/2000",null,146]
[null,"MISE EN SERVICE GMR 5000 CONDENS",null,151]
[null,"MISE EN SERVICE 2 X GMR 5000 CONDENS",null,273]
[null,"MISE EN SERVICE 3 X GMR 5000 CONDENS",null,363]
[null,"MISE EN SERVICE 4 X GMR 5000 CONDENS",null,424]
[null,"MISE EN SERVICE POELE A PELLETS  OPPA",null,139]
[null,"MISE EN SERVICE GSR 140-45 A 115 CONDENS",null,146]
[null,"MISE EN SERVICE GSR 230 CONDENS",null,372]
[null,"MISE EN SERVICE GSR 330 DUO CONDENS ",null,576]
[null,"MISE EN SERVICE GSR 330 CONDENS VD/VG",null,404]
[null,"MISE EN SERVICE OECOIL TOUS MODELES",null,152]
[null,"MISE EN SERVICE PU 260 CONDENS",null,212]
[null,"MISE EN SERVICE OENOVIAFIOUL CONFORT",null,212]
[null,"MISE EN SERVICE OENOVIAGAZ TOUS MODELES",null,146]
[null,"MISE EN SERVICE OEX",null,152]
[null,"MISE EN SERVICE OES/OEN 150L EV",null,152]
[null,"MISE EN SERVICE OES/OEN 250L ",null,152]
[null,"MISE EN SERVICE OES 350-1 ALL",null,233]
[null,"MISE EN SERVICE OES 350-2 ALL",null,233]
[null,"MISE EN SERVICE 440 LZ",null,250]
[null,"MISE EN SERVICE OES 540 L",null,295]
[null,"MISE EN SERVICE OES 150 G",null,162]
[null,"MISE EN SERVICE OES 350 GE",null,202]
[null,"MISE EN SERVICE OES 350 GI",null,283]
[null,"MISE EN SERVICE OEN-350 GI",null,286]
[null,"MISE EN SERVICE  OES 440 GI",null,304]
[null,"MISE EN SERVICE OES 540 GM/GI ",null,351]

{"sheet":"MAtériels&calculs","index":1,"n_rows":74,"n_cols":34,"rows_kept":74,"cut":false,"hidden":true,"merged":[]}
["références","Dénomination","Colis","Prix"]
[null,null,null,null,null,"Surface","Station",null,"Régulation"]
["Stations",null,null,null,null,"≤ 20 ","DKS 8-20",7619964,"Deltasol E (à ajouter)",{"$f":"A13","v":7619972}]
[7619964,{"$f":"VLOOKUP(A4,Tarif!$1:$1048576,2,FALSE)","v":"STATION SOLAIRE SKS 13-45"},{"$f":"VLOOKUP(A4,Tarif!$1:$1048576,3,FALSE)","v":"ER665"},{"$f":"VLOOKUP(A4,Tarif!$1:$1048576,4,FALSE)","v":662},null,"21-30","DKCS 8-30",{"$f":"A5","v":7619966},"Deltasol E (à ajouter)",{"$f":"A13","v":7619972}]
[7619966,{"$f":"VLOOKUP(A5,Tarif!$1:$1048576,2,FALSE)","v":"STATION SOLAIRE STS 14-30 CME"},{"$f":"VLOOKUP(A5,Tarif!$1:$1048576,3,FALSE)","v":"ER667"},{"$f":"VLOOKUP(A5,Tarif!$1:$1048576,4,FALSE)","v":2649},null,"31-50","DKCS 8-50 CME",{"$f":"A6","v":7619967},"Deltasol E (intégrée)",{"$f":"\"\"","v":""}]
[7619967,{"$f":"VLOOKUP(A6,Tarif!$1:$1048576,2,FALSE)","v":"STATION SOLAIRE STS 14-50 CME"},{"$f":"VLOOKUP(A6,Tarif!$1:$1048576,3,FALSE)","v":"ER668"},{"$f":"VLOOKUP(A6,Tarif!$1:$1048576,4,FALSE)","v":3057},null,"51-100","DKCS 12-100 CME",{"$f":"A7","v":7619968},"Deltasol E (intégrée)",{"$f":"\"\"","v":""}]
[7619968,{"$f":"VLOOKUP(A7,Tarif!$1:$1048576,2,FALSE)","v":"STATION SOLAIRE STS 14-100 CME"},{"$f":"VLOOKUP(A7,Tarif!$1:$1048576,3,FALSE)","v":"ER669"},{"$f":"VLOOKUP(A7,Tarif!$1:$1048576,4,FALSE)","v":6114},null,"101-200","DKCS 11-200 CME",{"$f":"A8","v":7619970},"Deltasol E (intégrée)",{"$f":"\"\"","v":""}]
[7619970,{"$f":"VLOOKUP(A8,Tarif!$1:$1048576,2,FALSE)","v":{"$error":"#N/A"}},{"$f":"VLOOKUP(A8,Tarif!$1:$1048576,3,FALSE)","v":{"$error":"#N/A"}},{"$f":"VLOOKUP(A8,Tarif!$1:$1048576,4,FALSE)","v":{"$error":"#N/A"}},null,"201-300","DKCS 11-300 CME",{"$f":"A9","v":7619971},"Deltasol E (intégrée)",{"$f":"\"\"","v":""}]
[7619971,{"$f":"VLOOKUP(A9,Tarif!$1:$1048576,2,FALSE)","v":{"$error":"#N/A"}},{"$f":"VLOOKUP(A9,Tarif!$1:$1048576,3,FALSE)","v":{"$error":"#N/A"}},{"$f":"VLOOKUP(A9,Tarif!$1:$1048576,4,FALSE)","v":{"$error":"#N/A"}}]
[]
["Régulation deltasol E",null,null,null,null,"Appoint"]
[null,null,null,null,null,"Electrique"]
[7619972,{"$f":"VLOOKUP(A13,Tarif!$1:$1048576,2,FALSE)","v":"REGULATION SOL COLLECTIF SC5 "},{"$f":"VLOOKUP(A13,Tarif!$1:$1048576,3,FALSE)","v":"ER672"},{"$f":"VLOOKUP(A13,Tarif!$1:$1048576,4,FALSE)","v":596},null,"Hydraulique"]
[]
["Sondes",null,null,null,null,"Hydraulique","CME","DL2","CS10","COMPT ACS","COMPT ECHO solaire","COMPT ECHO (relève)","COMPT ECHO bouclage","Compt elec accessoire","Compteur elec appoint","PT 1000"]
[null,null,null,null,null,"référence",{"$f":"A31","v":100017498},{"$f":"A35","v":100013514},{"$f":"A17","v":89804815},{"$f":"VLOOKUP(XnA!E51,'MAtériels&calculs'!F38:G41,2,FALSE)","v":100017492},{"$f":"IF(OR(XnA!E42='MAtériels&calculs'!F18,XnA!E42='MAtériels&calculs'!F17),G34,\"\")","v":100017495},{"$f":"IF(AND(XnA!E45=\"Hydraulique\",XnA!O45=\"Non\"),VLOOKUP(XnA!E47,'MAtériels&calculs'!F34:G36,2,FALSE),\"\")","v":100017495},{"$f":"IF(XnA!I42=\"Oui\",VLOOKUP(XnA!I45,'MAtériels&calculs'!F34:G37,2,FALSE),\"\")","v":""},null,null,{"$f":"A18","v":100003690}]
[89804815,{"$f":"VLOOKUP(A17,Tarif!$1:$1048576,2,FALSE)","v":"SONDE D'IRRADIATION CS10"},{"$f":"VLOOKUP(A17,Tarif!$1:$1048576,3,FALSE)","v":"EC175"},{"$f":"VLOOKUP(A17,Tarif!$1:$1048576,4,FALSE)","v":142},null,"≤ 20 ",1,1,1,1,1,{"$f":"IF(O17=1,0,IF(XnA!$E$45=\"Hydraulique\",1,0))","v":1},{"$f":"IF(XnA!$I$42=\"Oui\",1,0)","v":0},1,{"$f":"IF(XnA!$E$45=\"Electrique\",1,0)","v":0},{"$f":"2+SUM(J17+K17+L17+M17)*2","v":8}]
[100003690,{"$f":"CONCATENATE(VLOOKUP(A18,Tarif!$1:$1048576,2,FALSE),\" (2 par compteur)\")","v":"SONDE A APPLIQUE PT1000 (2 par compteur)"},{"$f":"VLOOKUP(A18,Tarif!$1:$1048576,3,FALSE)","v":"EC171"},{"$f":"VLOOKUP(A18,Tarif!$1:$1048576,4,FALSE)","v":61},null,"21-30",1,1,1,1,1,{"$f":"IF(O18=1,0,IF(XnA!$E$45=\"Hydraulique\",1,0))","v":1},{"$f":"IF(XnA!$I$42=\"Oui\",1,0)","v":0},1,{"$f":"IF(XnA!$E$45=\"Electrique\",1,0)","v":0},8]
[null,null,null,null,null,"31-50",1,1,1,1,0,{"$f":"IF(O19=1,0,IF(XnA!$E$45=\"Hydraulique\",1,0))","v":1},{"$f":"IF(XnA!$I$42=\"Oui\",1,0)","v":0},1,{"$f":"IF(XnA!$E$45=\"Electrique\",1,0)","v":0},6]
["Comptage",null,null,null,null,"51-100",1,1,1,1,0,{"$f":"IF(O20=1,0,IF(XnA!$E$45=\"Hydraulique\",1,0))","v":1},{"$f":"IF(XnA!$I$42=\"Oui\",1,0)","v":0},1,{"$f":"IF(XnA!$E$45=\"Electrique\",1,0)","v":0},6]
[null,null,null,null,null,"101-200",1,1,1,1,0,{"$f":"IF(O21=1,0,IF(XnA!$E$45=\"Hydraulique\",1,0))","v":1},{"$f":"IF(XnA!$I$42=\"Oui\",1,0)","v":0},1,{"$f":"IF(XnA!$E$45=\"Electrique\",1,0)","v":0},6]
[100017492,{"$f":"CONCATENATE(VLOOKUP(A22,Tarif!$1:$1048576,2,FALSE),\" (besoins ecs)\")","v":"COMPTEUR EAU FROIDE ACS 3,5m3/H (besoins ecs)"},{"$f":"VLOOKUP(A22,Tarif!$1:$1048576,3,FALSE)","v":"ER307"},{"$f":"VLOOKUP(A22,Tarif!$1:$1048576,4,FALSE)","v":678},null,"201-300",1,1,1,1,0,{"$f":"IF(O22=1,0,IF(XnA!$E$45=\"Hydraulique\",1,0))","v":1},{"$f":"IF(XnA!$I$42=\"Oui\",1,0)","v":0},1,{"$f":"IF(XnA!$E$45=\"Electrique\",1,0)","v":0},6]
[100017493,{"$f":"CONCATENATE(VLOOKUP(A23,Tarif!$1:$1048576,2,FALSE),\" (besoins ecs)\")","v":"COMPTEUR EAU FROIDE ACS 5m3/H (besoins ecs)"},{"$f":"VLOOKUP(A23,Tarif!$1:$1048576,3,FALSE)","v":"ER308"},{"$f":"VLOOKUP(A23,Tarif!$1:$1048576,4,FALSE)","v":747}]
[100017494,{"$f":"CONCATENATE(VLOOKUP(A24,Tarif!$1:$1048576,2,FALSE),\" (besoins ecs)\")","v":"COMPTEUR EAU FROIDE ACS 10m3/H (besoins ecs)"},{"$f":"VLOOKUP(A24,Tarif!$1:$1048576,3,FALSE)","v":"ER309"},{"$f":"VLOOKUP(A24,Tarif!$1:$1048576,4,FALSE)","v":961},null,"Electrique","CME","DL2","CS10","COMPT ACS","COMPT ECHO solaire","COMPT ECHO (relève)","COMPT ECHO bouclage","Compt elec accessoire","Compteur elec appoint","Pt 1000"]
[100017495,{"$f":"VLOOKUP(A25,Tarif!$1:$1048576,2,FALSE)","v":"COMPT.FLU.CHAUD US ECHO 1.5M3"},{"$f":"VLOOKUP(A25,Tarif!$1:$1048576,3,FALSE)","v":"ER310"},{"$f":"VLOOKUP(A25,Tarif!$1:$1048576,4,FALSE)","v":430},null,"≤ 20 ",1,1,1,1,1,{"$f":"IF(O25=1,0,1)","v":1},{"$f":"IF(XnA!$I$42=\"Oui\",1,0)","v":0},1,{"$f":"IF(XnA!$E$45=\"Electrique\",1,0)","v":0},{"$f":"SUM(J25+K25+L25+M25)*2","v":6}]
[100017496,{"$f":"VLOOKUP(A26,Tarif!$1:$1048576,2,FALSE)","v":"COMPT.FLU.CHAUD US ECHO 2.5M3"},{"$f":"VLOOKUP(A26,Tarif!$1:$1048576,3,FALSE)","v":"ER311"},{"$f":"VLOOKUP(A26,Tarif!$1:$1048576,4,FALSE)","v":476},null,"21-30",1,1,1,1,1,1,{"$f":"IF(XnA!$I$42=\"Oui\",1,0)","v":0},1,{"$f":"IF(XnA!$E$45=\"Electrique\",1,0)","v":0},6]
[100017497,{"$f":"VLOOKUP(A27,Tarif!$1:$1048576,2,FALSE)","v":"COMPT.FLU.CHAUD US ECHO 3.5M3/H "},{"$f":"VLOOKUP(A27,Tarif!$1:$1048576,3,FALSE)","v":"ER312"},{"$f":"VLOOKUP(A27,Tarif!$1:$1048576,4,FALSE)","v":531},null,"31-50",1,1,1,1,0,1,{"$f":"IF(XnA!$I$42=\"Oui\",1,0)","v":0},1,{"$f":"IF(XnA!$E$45=\"Electrique\",1,0)","v":0},4]
[null,null,null,null,null,"51-100",1,1,1,1,0,1,{"$f":"IF(XnA!$I$42=\"Oui\",1,0)","v":0},1,{"$f":"IF(XnA!$E$45=\"Electrique\",1,0)","v":0},4]
["Centrale CME",null,null,null,null,"101-200",1,1,1,1,0,1,{"$f":"IF(XnA!$I$42=\"Oui\",1,0)","v":0},1,{"$f":"IF(XnA!$E$45=\"Electrique\",1,0)","v":0},4]
[null,null,null,null,null,"201-300",1,1,1,1,0,1,{"$f":"IF(XnA!$I$42=\"Oui\",1,0)","v":0},1,{"$f":"IF(XnA!$E$45=\"Electrique\",1,0)","v":0},4,null,null,null,null,null,null,null,null,null,null,null,null,null,null,"Débit nominal","Calibre"]
[100017498,{"$f":"VLOOKUP(A31,Tarif!$1:$1048576,2,FALSE)","v":"CENTRALE DE MESURE D'ENERGIE CME"},{"$f":"VLOOKUP(A31,Tarif!$1:$1048576,3,FALSE)","v":"ER313"},{"$f":"VLOOKUP(A31,Tarif!$1:$1048576,4,FALSE)","v":1641},null,null,null,null,null,null,null,null,null,null,null,null,null,null,null,null,null,null,null,null,null,null,null,null,null,null,"1,5 m3/h","DN 15"]
[null,null,null,null,null,null,null,null,null,null,null,null,null,null,null,null,null,null,null,null,null,null,null,null,null,null,null,null,null,null,"2,5 m3/h","DN 20"]
["Interface DL2",null,null,null,null,"Débit",null,null,null,null,null,null,null,null,null,null,null,null,null,null,null,null,null,null,null,null,null,null,null,null,"3,5 m3/h","DN 25"]
[null,null,null,null,"ECHO","1,5 m3/h",{"$f":"A25","v":100017495},null,{"$f":"IF(OR(XnA!E42='MAtériels&calculs'!F17,XnA!E42='MAtériels&calculs'!F18,XnA!E42='MAtériels&calculs'!F19,XnA!E42='MAtériels&calculs'!F20),1,0)","v":1},100017495,null,null,null,null,null,null,null,null,null,null,null,null,null,null,null,null,null,null,null,null,"5 m3/h","DN 30"]
[100013514,{"$f":"VLOOKUP(A35,Tarif!$1:$1048576,2,FALSE)","v":"DATALOGGER DL2 POUR GRS"},{"$f":"VLOOKUP(A35,Tarif!$1:$1048576,3,FALSE)","v":"ER55"},{"$f":"VLOOKUP(A35,Tarif!$1:$1048576,4,FALSE)","v":451},null,"2,5 m3/h",{"$f":"A26","v":100017496},null,{"$f":"IF(XnA!E42=F21,1,0)","v":0},100017496,null,null,null,null,null,null,null,null,null,null,null,null,null,null,null,null,null,null,null,null,"10 m3/h","DN 40"]
[null,null,null,null,null,"3,5 m3/h",{"$f":"A27","v":100017497},null,{"$f":"IF(XnA!E42=F22,1,0)","v":0},100017497]
[100017499,{"$f":"VLOOKUP(A37,Tarif!$1:$1048576,2,FALSE)","v":"MODULE REPORT DE PANNE OETROSOL AM1"},{"$f":"VLOOKUP(A37,Tarif!$1:$1048576,3,FALSE)","v":"ER314"},{"$f":"VLOOKUP(A37,Tarif!$1:$1048576,4,FALSE)","v":176},null,"> 3,5 m3/h"]
[null,null,null,null,"ACS","3,5 m3/h",{"$f":"A22","v":100017492}]
[null,null,null,null,null,"5 m3/h",{"$f":"A23","v":100017493}]
[null,null,null,null,null,"10 m3/h",{"$f":"A24","v":100017494}]
[7619964,{"$f":"CONCATENATE(VLOOKUP(A41,Tarif!$1:$1048576,2,FALSE),\" (besoins ecs)\")","v":"STATION SOLAIRE SKS 13-45 (besoins ecs)"},{"$f":"VLOOKUP(A41,Tarif!$1:$1048576,3,FALSE)","v":"ER665"},{"$f":"VLOOKUP(A41,Tarif!$1:$1048576,4,FALSE)","v":662},null,{"$f":"\"\"","v":""},100019195]
[7619966,{"$f":"CONCATENATE(VLOOKUP(A42,Tarif!$1:$1048576,2,FALSE),\" (besoins ecs)\")","v":"STATION SOLAIRE STS 14-30 CME (besoins ecs)"},{"$f":"VLOOKUP(A42,Tarif!$1:$1048576,3,FALSE)","v":"ER667"},{"$f":"VLOOKUP(A42,Tarif!$1:$1048576,4,FALSE)","v":2649}]
[7619967,{"$f":"CONCATENATE(VLOOKUP(A43,Tarif!$1:$1048576,2,FALSE),\" (besoins ecs)\")","v":"STATION SOLAIRE STS 14-50 CME (besoins ecs)"},{"$f":"VLOOKUP(A43,Tarif!$1:$1048576,3,FALSE)","v":"ER668"},{"$f":"VLOOKUP(A43,Tarif!$1:$1048576,4,FALSE)","v":3057},null,"Chiffrage"]
[7619968,{"$f":"CONCATENATE(VLOOKUP(A44,Tarif!$1:$1048576,2,FALSE),\" (besoins ecs)\")","v":"STATION SOLAIRE STS 14-100 CME (besoins ecs)"},{"$f":"VLOOKUP(A44,Tarif!$1:$1048576,3,FALSE)","v":"ER669"},{"$f":"VLOOKUP(A44,Tarif!$1:$1048576,4,FALSE)","v":6114}]
[7619970,{"$f":"CONCATENATE(VLOOKUP(A45,Tarif!$1:$1048576,2,FALSE),\" (besoins ecs)\")","v":{"$error":"#N/A"}},{"$f":"VLOOKUP(A45,Tarif!$1:$1048576,3,FALSE)","v":{"$error":"#N/A"}},{"$f":"VLOOKUP(A45,Tarif!$1:$1048576,4,FALSE)","v":{"$error":"#N/A"}},null,"référence","Désignation","Colis","Prix","Quantité"]
[7619971,{"$f":"CONCATENATE(VLOOKUP(A46,Tarif!$1:$1048576,2,FALSE),\" (besoins ecs)\")","v":{"$error":"#N/A"}},{"$f":"VLOOKUP(A46,Tarif!$1:$1048576,3,FALSE)","v":{"$error":"#N/A"}},{"$f":"VLOOKUP(A46,Tarif!$1:$1048576,4,FALSE)","v":{"$error":"#N/A"}}]
[null,null,null,null,null,{"$f":"G16","v":100017498},{"$f":"IF(F47=\"\",\"\",VLOOKUP(F47,$A$5:$D$35,2,FALSE))","v":"CENTRALE DE MESURE D'ENERGIE CME"},{"$f":"IF(F47=\"\",\"\",VLOOKUP(F47,$A$5:$D$35,3,FALSE))","v":"ER313"},{"$f":"IF(F47=\"\",\"\",VLOOKUP(F47,$A$5:$D$35,4,FALSE))","v":1641},1]
["Régulation deltasol E",null,null,null,null,{"$f":"H16","v":100013514},{"$f":"IF(F48=\"\",\"\",VLOOKUP(F48,$A$5:$D$35,2,FALSE))","v":"DATALOGGER DL2 POUR GRS"},{"$f":"IF(F48=\"\",\"\",VLOOKUP(F48,$A$5:$D$35,3,FALSE))","v":"ER55"},{"$f":"IF(F48=\"\",\"\",VLOOKUP(F48,$A$5:$D$35,4,FALSE))","v":451},1]
[null,null,null,null,null,{"$f":"J16","v":100017492},"COMPTEUR EAU FROIDE ACS 3,5m3/H (besoins ecs)","ER307",678,1]
[7619972,{"$f":"CONCATENATE(VLOOKUP(A50,Tarif!$1:$1048576,2,FALSE),\" (besoins ecs)\")","v":"REGULATION SOL COLLECTIF SC5  (besoins ecs)"},{"$f":"VLOOKUP(A50,Tarif!$1:$1048576,3,FALSE)","v":"ER672"},{"$f":"VLOOKUP(A50,Tarif!$1:$1048576,4,FALSE)","v":596},null,{"$f":"K16","v":100017495},"COMPT.FLU.CHAUD US ECHO 1.5M3","ER310",430,{"$f":"IF(F50=\"\",\"\",1)","v":1},null,null,null,null,null,null,null,null,null,null,null,null,null,null,null,null,null,null,null,null,"RSB + ballon en relève",null,1,-1]
[null,null,null,null,null,{"$f":"L16","v":100017495},"COMPT.FLU.CHAUD US ECHO 1.5M3","ER310",430,{"$f":"IF(F51=\"\",\"\",1)","v":1},null,null,null,null,null,null,null,null,null,null,null,null,null,null,null,null,null,null,null,null,"RSB en série + ballon en relève",null,2,-1]
["Sondes",null,null,null,null,{"$f":"M16","v":""},"","","",{"$f":"IF(F52=\"\",\"\",1)","v":""},null,null,null,null,null,null,null,null,null,null,null,null,null,null,null,null,null,null,null,null,"RSB en parallèle + ballon en relève",null,3,-1]
[null,null,null,null,null,{"$f":"P16","v":100003690},"SONDE A APPLIQUE PT1000 (2 par compteur)","EC171",61,{"$f":"VLOOKUP(XnA!E42,F17:P22,11,FALSE)+VLOOKUP(XnA!E12,'MAtériels&calculs'!AE50:AH57,4,FALSE)","v":7},{"$f":"VLOOKUP(XnA!E12,'MAtériels&calculs'!AE50:AH57,4,FALSE)","v":-1},null,null,null,null,null,null,null,null,null,null,null,null,null,null,null,null,null,null,null,"Préparateur FWS ECS instantannée",null,4,-2]
[89804815,{"$f":"CONCATENATE(VLOOKUP(A54,Tarif!$1:$1048576,2,FALSE),\" (besoins ecs)\")","v":"SONDE D'IRRADIATION CS10 (besoins ecs)"},{"$f":"VLOOKUP(A54,Tarif!$1:$1048576,3,FALSE)","v":"EC175"},{"$f":"VLOOKUP(A54,Tarif!$1:$1048576,4,FALSE)","v":142},null,{"$f":"IF(XnA!E12='MAtériels&calculs'!AE57,VLOOKUP(1,'MAtériels&calculs'!I34:J36,2,FALSE),\"\")","v":""},"","","",{"$f":"IF(I54=\"\",\"\",1)","v":""},null,null,null,null,null,null,null,null,null,null,null,null,null,null,null,null,null,null,null,null,"Préparateur FWS avec décharge",null,5,-2]
[100003690,{"$f":"CONCATENATE(VLOOKUP(A55,Tarif!$1:$1048576,2,FALSE),\" (besoins ecs)\")","v":"SONDE A APPLIQUE PT1000 (besoins ecs)"},{"$f":"VLOOKUP(A55,Tarif!$1:$1048576,3,FALSE)","v":"EC171"},{"$f":"VLOOKUP(A55,Tarif!$1:$1048576,4,FALSE)","v":61},null,"Compteur électrique pour auxiliaires (pompes, régulation)",null,null,null,1,null,null,null,null,null,null,null,null,null,null,null,null,null,null,null,null,null,null,null,null,"Préparateur à serpentin avec relève intégrée",null,6,-2]
[null,null,null,null,null,"Compteur électrique pour appoint par résistance électrique",null,null,null,{"$f":"O18","v":0},null,null,null,null,null,null,null,null,null,null,null,null,null,null,null,null,null,null,null,null,"Préparateur à serpentin + ballon en relève",null,7,-1]
["Comptage",null,null,null,null,null,null,null,null,null,null,null,null,null,null,null,null,null,null,null,null,null,null,null,null,null,null,null,null,null,"Tampon primaire + ballon en relève",null,8,1]
[]
[100017492,{"$f":"CONCATENATE(VLOOKUP(A59,Tarif!$1:$1048576,2,FALSE),\" (besoins ecs)\")","v":"COMPTEUR EAU FROIDE ACS 3,5m3/H (besoins ecs)"},{"$f":"VLOOKUP(A59,Tarif!$1:$1048576,3,FALSE)","v":"ER307"},{"$f":"VLOOKUP(A59,Tarif!$1:$1048576,4,FALSE)","v":678}]
[100017493,{"$f":"CONCATENATE(VLOOKUP(A60,Tarif!$1:$1048576,2,FALSE),\" (besoins ecs)\")","v":"COMPTEUR EAU FROIDE ACS 5m3/H (besoins ecs)"},{"$f":"VLOOKUP(A60,Tarif!$1:$1048576,3,FALSE)","v":"ER308"},{"$f":"VLOOKUP(A60,Tarif!$1:$1048576,4,FALSE)","v":747},null,null,null,null,null,null,null,null,null,null,null,null,null,null,null,null,null,null,null,null,null,null,null,null,null,null,null,null,{"$f":"VLOOKUP(XnA!E12,'MAtériels&calculs'!AE50:AG57,3,FALSE)","v":1}]
[100017494,{"$f":"CONCATENATE(VLOOKUP(A61,Tarif!$1:$1048576,2,FALSE),\" (besoins ecs)\")","v":"COMPTEUR EAU FROIDE ACS 10m3/H (besoins ecs)"},{"$f":"VLOOKUP(A61,Tarif!$1:$1048576,3,FALSE)","v":"ER309"},{"$f":"VLOOKUP(A61,Tarif!$1:$1048576,4,FALSE)","v":961}]
[100017495,{"$f":"CONCATENATE(VLOOKUP(A62,Tarif!$1:$1048576,2,FALSE),\" (besoins ecs)\")","v":"COMPT.FLU.CHAUD US ECHO 1.5M3 (besoins ecs)"},{"$f":"VLOOKUP(A62,Tarif!$1:$1048576,3,FALSE)","v":"ER310"},{"$f":"VLOOKUP(A62,Tarif!$1:$1048576,4,FALSE)","v":430}]
[100017496,{"$f":"CONCATENATE(VLOOKUP(A63,Tarif!$1:$1048576,2,FALSE),\" (besoins ecs)\")","v":"COMPT.FLU.CHAUD US ECHO 2.5M3 (besoins ecs)"},{"$f":"VLOOKUP(A63,Tarif!$1:$1048576,3,FALSE)","v":"ER311"},{"$f":"VLOOKUP(A63,Tarif!$1:$1048576,4,FALSE)","v":476}]
[100017497,{"$f":"CONCATENATE(VLOOKUP(A64,Tarif!$1:$1048576,2,FALSE),\" (besoins ecs)\")","v":"COMPT.FLU.CHAUD US ECHO 3.5M3/H  (besoins ecs)"},{"$f":"VLOOKUP(A64,Tarif!$1:$1048576,3,FALSE)","v":"ER312"},{"$f":"VLOOKUP(A64,Tarif!$1:$1048576,4,FALSE)","v":531},null,null,null,null,null,null,null,null,null,null,null,null,null,null,null,null,null,null,null,null,null,null,null,null,null,null,null,1]
[100019195,"COMPTEUR EAU FROIDE ACS 20m3/H (besoins ecs)","ER317",1800,null,null,null,null,null,null,null,null,null,null,null,null,null,null,null,null,null,null,null,null,null,null,null,null,null,null,null,2]
["Centrale CME",null,null,null,null,null,null,null,null,null,null,null,null,null,null,null,null,null,null,null,null,null,null,null,null,null,null,null,null,null,null,3]
[null,null,null,null,null,null,null,null,null,null,null,null,null,null,null,null,null,null,null,null,null,null,null,null,null,null,null,null,null,null,null,4]
[100017498,"CENTRALE DE MESURE D'ENERGIE CME","ER313",1450,null,null,null,null,null,null,null,null,null,null,null,null,null,null,null,null,null,null,null,null,null,null,null,null,null,null,null,5]
[null,null,null,null,null,null,null,null,null,null,null,null,null,null,null,null,null,null,null,null,null,null,null,null,null,null,null,null,null,null,null,6]
["Interface DL2",null,null,null,null,null,null,null,null,null,null,null,null,null,null,null,null,null,null,null,null,null,null,null,null,null,null,null,null,null,null,7]
[null,null,null,null,null,null,null,null,null,null,null,null,null,null,null,null,null,null,null,null,null,null,null,null,null,null,null,null,null,null,null,8]
[100013514,"DATALOGGER DL2 POUR GRS","ER55",399.8]
[]
[100017499,"MODULE REPORT DE PANNE DIEMASOL AM1","ER314",156]

{"sheet":"XnA","index":2,"n_rows":87,"n_cols":15,"rows_kept":87,"cut":false,"hidden":false,"merged":[[45,7,45,9],[9,3,9,10],[47,2,47,5],[72,3,72,7],[66,3,66,7],[65,3,65,7],[64,3,64,7],[63,3,63,7],[2,4,2,8],[41,4,41,5],[7,3,7,10],[50,4,50,5],[46,4,46,5],[80,2,80,8],[74,3,74,7],[75,3,75,7],[3,4,3,8],[78,3,78,7],[43,7,43,8],[8,3,8,10],[80,9,80,10],[44,8,44,9],[73,3,73,7],[62,3,62,7],[44,4,44,5],[56,3,56,7],[41,8,41,9],[11,4,11,10],[57,3,57,7],[51,2,51,5],[58,3,58,7],[59,3,59,7],[61,3,61,7],[79,3,79,7],[77,3,77,7]]}
[]
[]
[null,null,null,null,"Chiffrage métrologie solaire"]
[null,null,null,null,"Procédure Xna",null,null,null,null,null,null,"Version 01/2016"]
[]
[]
[]
[null,null,"Références"]
[]
[]
[]
[null,null,"Schéma de principe",null,"RSB + ballon en relève"]
[]
[]
[]
[]
[]
[]
[]
[]
[]
[]
[]
[]
[]
[]
[]
[]
[]
[]
[]
[]
[]
[]
[]
[]
[]
[]
[]
[]
[]
[null,null,null,"Surface de capteurs","≤ 20 ",null,"m²","Bouclage ECS","Non"]
[]
[null,null,null,null,{"$f":"IF(AND(E42<>surf1,E42<>\"21-30\"),\"Comptage inclus dans la station solaire\",\"\")","v":""}]
[null,null,null,"Appoint","Hydraulique",null,null,"Débit bouclage","3,5 m3/h",null,null,null,null,null,"Non"]
[null,null,{"$f":"IF(E45=\"Electrique\",\"Mise en place compteur électrique pour l'appoint(non fourni par DD)\",\"\")","v":""},null,null,null,null,{"$f":"IF(I45=\"> 3,5 m3/h\",\"Compteur non fourni par De Dietrich\",\"\")","v":""}]
[null,null,null,"Débit relève hydraulique","1,5 m3/h"]
[null,null,{"$f":"IF(E47=\"> 3,5 m3/h\",\"Compteur non fourni par De Dietrich\",\"\")","v":""},null,null,null,null,"Pour information, relation entre le débit nominal et le DN de la conduite"]
[]
[]
[null,null,null,"Soutirage ECS de pointe","3,5 m3/h"]
[null,null,{"$f":"IF(E51=\"> 10 m3/h\",\"Compteur non fourni par De Dietrich\",\"\")","v":""}]
[]
[]
[null,null,"Chiffrage de la solution pour comptage d'énergie"]
[]
[null,null,"Référence","Désignation",null,null,null,null,"Colis","Qté","Prix"]
[null,null,"Métrologie"]
[null,null,{"$f":"'MAtériels&calculs'!F47","v":100017498},{"$f":"'MAtériels&calculs'!G47","v":"CENTRALE DE MESURE D'ENERGIE CME"},null,null,null,null,{"$f":"'MAtériels&calculs'!H47","v":"ER313"},{"$f":"'MAtériels&calculs'!J47","v":1},{"$f":"IF(C59<>\"\",J59*'MAtériels&calculs'!I47,\"\")","v":1641}]
[null,null,{"$f":"'MAtériels&calculs'!F48","v":100013514},{"$f":"'MAtériels&calculs'!G48","v":"DATALOGGER DL2 POUR GRS"},null,null,null,null,{"$f":"'MAtériels&calculs'!H48","v":"ER55"},{"$f":"'MAtériels&calculs'!J48","v":1},{"$f":"IF(C60<>\"\",J60*'MAtériels&calculs'!I48,\"\")","v":451}]
[]
[null,null,{"$f":"IF(E51=\"> 10 m3/h\",\"\",'MAtériels&calculs'!F49)","v":100017492},{"$f":"IF(E51=\"> 10 m3/h\",\"\",'MAtériels&calculs'!G49)","v":"COMPTEUR EAU FROIDE ACS 3,5m3/H (besoins ecs)"},null,null,null,null,{"$f":"IF(E51=\"> 10 m3/h\",\"\",'MAtériels&calculs'!H49)","v":"ER307"},{"$f":"IF(E51=\"> 10 m3/h\",\"\",'MAtériels&calculs'!J49)","v":1},{"$f":"IF(C62<>\"\",J62*'MAtériels&calculs'!I49,\"\")","v":678}]
[null,null,{"$f":"'MAtériels&calculs'!F50","v":100017495},{"$f":"'MAtériels&calculs'!G50","v":"COMPT.FLU.CHAUD US ECHO 1.5M3"},null,null,null,null,{"$f":"'MAtériels&calculs'!H50","v":"ER310"},{"$f":"'MAtériels&calculs'!J50","v":1},{"$f":"IF(C63<>\"\",J63*'MAtériels&calculs'!I50,\"\")","v":430}]
[null,null,{"$f":"IF(E47=\"> 3,5 m3/h\",\"\",'MAtériels&calculs'!F51)","v":100017495},{"$f":"IF(E47=\"> 3,5 m3/h\",\"\",'MAtériels&calculs'!G51)","v":"COMPT.FLU.CHAUD US ECHO 1.5M3"},null,null,null,null,{"$f":"IF(E47=\"> 3,5 m3/h\",\"\",'MAtériels&calculs'!H51)","v":"ER310"},{"$f":"IF(E47=\"> 3,5 m3/h\",\"\",'MAtériels&calculs'!J51)","v":1},{"$f":"IF(C64<>\"\",J64*'MAtériels&calculs'!I51,\"\")","v":430}]
[null,null,{"$f":"IF(I45=\"> 3,5 m3/h\",\"\",'MAtériels&calculs'!F52)","v":""},{"$f":"IF(I45=\"> 3,5 m3/h\",\"\",'MAtériels&calculs'!G52)","v":""},null,null,null,null,{"$f":"IF(I45=\"> 3,5 m3/h\",\"\",'MAtériels&calculs'!H52)","v":""},{"$f":"IF(I45=\"> 3,5 m3/h\",\"\",'MAtériels&calculs'!J52)","v":""},{"$f":"IF(C65<>\"\",J65*'MAtériels&calculs'!I52,\"\")","v":""}]
[null,null,{"$f":"'MAtériels&calculs'!F53","v":100003690},{"$f":"'MAtériels&calculs'!G53","v":"SONDE A APPLIQUE PT1000 (2 par compteur)"},null,null,null,null,{"$f":"'MAtériels&calculs'!H53","v":"EC171"},{"$f":"'MAtériels&calculs'!J53","v":7},{"$f":"IF(C66<>\"\",J66*'MAtériels&calculs'!I53,\"\")","v":427}]
[null,null,{"$f":"'MAtériels&calculs'!F54","v":""},{"$f":"'MAtériels&calculs'!G54","v":""},null,null,null,null,{"$f":"'MAtériels&calculs'!H54","v":""},{"$f":"'MAtériels&calculs'!J54","v":""},{"$f":"IF(C67<>\"\",J67*'MAtériels&calculs'!I54,\"\")","v":""}]
[null,null,"Compteur(s) obligatoire(s) pour le comptage d'énergie"]
[null,null,{"$f":"'MAtériels&calculs'!F55","v":"Compteur électrique pour auxiliaires (pompes, régulation)"},null,null,null,null,null,null,{"$f":"'MAtériels&calculs'!J55","v":1}]
[null,null,{"$f":"'MAtériels&calculs'!F56","v":"Compteur électrique pour appoint par résistance électrique"},null,null,null,null,null,null,{"$f":"'MAtériels&calculs'!J56","v":0}]
[]
[null,null,"Options"]
[null,null,{"$f":"VLOOKUP(E42,'MAtériels&calculs'!F3:H8,3,FALSE)","v":7619964},{"$f":"VLOOKUP(C73,'MAtériels&calculs'!$A$4:$D$35,2,FALSE)","v":"STATION SOLAIRE SKS 13-45"},null,null,null,null,{"$f":"VLOOKUP(C73,'MAtériels&calculs'!$A$4:$D$35,3,FALSE)","v":"ER665"},0,{"$f":"IF(J73=0,\"\",J73*VLOOKUP(C73,'MAtériels&calculs'!$A$5:$D$35,4,FALSE))","v":""}]
[null,null,{"$f":"VLOOKUP(E42,'MAtériels&calculs'!F3:J8,5,FALSE)","v":7619972},{"$f":"IF(C74=\"\",\"\",VLOOKUP(C74,'MAtériels&calculs'!A5:D36,2,FALSE))","v":"REGULATION SOL COLLECTIF SC5 "},null,null,null,null,{"$f":"IF(C74=\"\",\"\",VLOOKUP(C74,'MAtériels&calculs'!A5:D36,3,FALSE))","v":"ER672"},0]
[null,null,{"$f":"'MAtériels&calculs'!A17","v":89804815},{"$f":"'MAtériels&calculs'!B17","v":"SONDE D'IRRADIATION CS10"},null,null,null,null,{"$f":"'MAtériels&calculs'!C17","v":"EC175"},1,{"$f":"IF(C75<>\"\",J75*'MAtériels&calculs'!D17,\"\")","v":142}]
[null,null,{"$f":"'MAtériels&calculs'!A37","v":100017499},{"$f":"'MAtériels&calculs'!B37","v":"MODULE REPORT DE PANNE OETROSOL AM1"},null,null,null,null,{"$f":"'MAtériels&calculs'!C37","v":"ER314"},1,{"$f":"J76*'MAtériels&calculs'!D37","v":176}]
[]
[]
[]
[]
[null,null,"Total PPHT 2016 : ",null,null,null,null,null,null,{"$f":"SUM(K59:K80)","v":4375}]
[]
[]
[]
[]
[]
[null,null,"Les résultats de cette feuille de calcul sont donnés à titre indicatif. La responsabilité de OERTLI ne peut en aucun cas être engagée."]