{"text_format":"1","workbook":"xlsx","n_sheets":5,"sheets":["calculs2","Données-Résultats","chaudDD","Base","MAJ"],"not_rendered":{"charts":0,"images":3,"macros":1,"external_links":0,"defined_names":4,"comments":1,"pivot_tables":0},"unopened":[],"bounds":{"document_bytes":16777216,"sheet_cells":100000,"rows_first":2000,"rows_last":500,"rows_between":2000,"halvings":0,"cell_chars":16384,"cell_head_chars":4096},"cells_cut":0,"cells_raw":0,"read":"whole","date_system":"1900"}

{"sheet":"calculs2","index":0,"n_rows":89,"n_cols":16,"rows_kept":89,"cut":false,"hidden":true,"merged":[[19,7,20,7],[19,9,20,9],[19,11,20,11],[19,5,20,5]]}
[null,null,null,null,null,{"$f":"'Données-Résultats'!G16","v":"Circuit A"},null,{"$f":"'Données-Résultats'!J16","v":"Circuit B"},null,{"$f":"'Données-Résultats'!M16","v":"Circuit C"},null,{"$f":"'Données-Résultats'!P16","v":"Circuit D"}]
[]
[null,{"$f":"'Données-Résultats'!C16","v":"Utilisation"}]
[null,{"$f":"'Données-Résultats'!C19","v":"Référence"},{"$f":"'Données-Résultats'!D19","v":"-"},{"$f":"'Données-Résultats'!E19","v":"-"},{"$f":"'Données-Résultats'!F19","v":":"},{"$f":"'Données-Résultats'!G19","v":0},"choix1",{"$f":"'Données-Résultats'!J19","v":0},"choix2",{"$f":"'Données-Résultats'!M19","v":0},"choix3",{"$f":"'Données-Résultats'!P19","v":0},"choix4"]
[null,{"$f":"'Données-Résultats'!C20","v":"Puissance nominale d'utilisation"},{"$f":"'Données-Résultats'!D20","v":"Pu"},{"$f":"'Données-Résultats'!E20","v":"kW"},{"$f":"'Données-Résultats'!F20","v":":"},{"$f":"'Données-Résultats'!G20","v":0},null,{"$f":"'Données-Résultats'!J20","v":0},null,{"$f":"'Données-Résultats'!M20","v":0},null,{"$f":"'Données-Résultats'!P20","v":0}]
[null,{"$f":"'Données-Résultats'!C21","v":"Température de départ nominale"},"Tdu",{"$f":"'Données-Résultats'!E21","v":"°C"},{"$f":"'Données-Résultats'!F21","v":":"},{"$f":"'Données-Résultats'!G21","v":0},null,{"$f":"'Données-Résultats'!J21","v":0},null,{"$f":"'Données-Résultats'!M21","v":0},null,{"$f":"'Données-Résultats'!P21","v":0}]
[null,"maximum T départ",null,"°C",{"$f":"MAX(F6,H6,J6,L6)","v":0}]
[null,{"$f":"'Données-Résultats'!C29","v":"Température de retour d'utilisation"},"Tru",{"$f":"'Données-Résultats'!E22","v":"°C"},{"$f":"'Données-Résultats'!F22","v":":"},{"$f":"'Données-Résultats'!H22","v":0},{"$f":"'Données-Résultats'!G22","v":0},{"$f":"'Données-Résultats'!K22","v":0},{"$f":"'Données-Résultats'!J22","v":0},{"$f":"'Données-Résultats'!N22","v":0},{"$f":"'Données-Résultats'!M22","v":0},{"$f":"'Données-Résultats'!Q22","v":0},{"$f":"'Données-Résultats'!P22","v":0}]
[null,"ou Débit d'utilisation","qvu","m3/h",":"]
[]
[null,"Débit d'utilisation","qvu",null,null,{"$f":"IF(G8=\"Tru\",F5/(1.163*(F6-F8)),\"***\")","v":"***"},null,{"$f":"IF(I8=\"Tru\",H5/(1.163*(H6-H8)),\"***\")","v":"***"},null,{"$f":"IF(K8=\"Tru\",J5/(1.163*(J6-J8)),\"***\")","v":"***"},null,{"$f":"IF(M8=\"Tru\",L5/(1.163*(L6-L8)),\"***\")","v":"***"}]
[null,"valeur sans div0",null,null,null,{"$f":"IF(OR(F5=0,F6=0,F8=0),0,F11)","v":0},null,{"$f":"IF(OR(H5=0,H6=0,H8=0),0,H11)","v":0},null,{"$f":"IF(OR(J5=0,J6=0,J8=0),0,J11)","v":0},null,{"$f":"IF(OR(L5=0,L6=0,L8=0),0,L11)","v":0}]
[null,"Temp retour utilisation","Tru",null,null,{"$f":"IF(G8=\"qvu\",F6-(F5/(F8*1.163)),\"***\")","v":"***"},null,{"$f":"IF(I8=\"qvu\",H6-(H5/(H8*1.163)),\"***\")","v":"***"},null,{"$f":"IF(K8=\"qvu\",J6-(J5/(J8*1.163)),\"***\")","v":"***"},null,{"$f":"IF(M8=\"qvu\",L6-(L5/(L8*1.163)),\"***\")","v":"***"}]
[null,"valeur sans div0",null,null,null,{"$f":"IF(OR(F5=0,F6=0,F8=0),0,F13)","v":0},null,{"$f":"IF(OR(H5=0,H6=0,H8=0),0,H13)","v":0},null,{"$f":"IF(OR(J5=0,J6=0,J8=0),0,J13)","v":0},null,{"$f":"IF(OR(L5=0,L6=0,L8=0),0,L13)","v":0}]
[null,"Débit de génération","qvg",null,null,{"$f":"IF(G8=\"Tru\",F5/(1.163*($E$7-F8)),F5/(1.163*($E$7-F14)))","v":{"$error":"#DIV/0!"}},null,{"$f":"IF(I8=\"Tru\",H5/(1.163*($E$7-H8)),H5/(1.163*($E$7-H14)))","v":{"$error":"#DIV/0!"}},null,{"$f":"IF(K8=\"Tru\",J5/(1.163*($E$7-J8)),J5/(1.163*($E$7-J14)))","v":{"$error":"#DIV/0!"}},null,{"$f":"IF(M8=\"Tru\",L5/(1.163*($E$7-L8)),L5/(1.163*($E$7-L14)))","v":{"$error":"#DIV/0!"}}]
[null,"valeur sans div0",null,null,null,{"$f":"IF(OR(F5=0,F6=0,F8=0),0,F15)","v":0},null,{"$f":"IF(OR(H5=0,H6=0,H8=0),0,H15)","v":0},null,{"$f":"IF(OR(J5=0,J6=0,J8=0),0,J15)","v":0},null,{"$f":"IF(OR(L5=0,L6=0,L8=0),0,L15)","v":0}]
[null,"Temp retour utilisation","Tru",null,null,{"$f":"IF(G8=\"qvu\",F6-(F5/(F8*1.163)),F8)","v":0},null,{"$f":"IF(I8=\"qvu\",H6-(H5/(H8*1.163)),H8)","v":0},null,{"$f":"IF(K8=\"qvu\",J6-(J5/(J8*1.163)),J8)","v":0},null,{"$f":"IF(M8=\"qvu\",L6-(L5/(L8*1.163)),L8)","v":0}]
[null,"valeur sans div0",null,null,null,{"$f":"IF(OR(F5=0,F6=0,F8=0),0,F17)","v":0},null,{"$f":"IF(OR(H5=0,H6=0,H8=0),0,H17)","v":0},null,{"$f":"IF(OR(J5=0,J6=0,J8=0),0,J17)","v":0},null,{"$f":"IF(OR(L5=0,L6=0,L8=0),0,L17)","v":0}]
[null,"rapport Tmax/Td",null,null,null,{"$f":"$E$7/F6","v":{"$error":"#DIV/0!"}},null,{"$f":"$E$7/H6","v":{"$error":"#DIV/0!"}},null,{"$f":"$E$7/J6","v":{"$error":"#DIV/0!"}},null,{"$f":"$E$7/L6","v":{"$error":"#DIV/0!"}}]
[null,"vanne ou pas",null,null,null,{"$f":"IF(F19>1,\"mettre une vanne de mélange\",\"\")","v":{"$error":"#DIV/0!"}},null,{"$f":"IF(H19>1,\"mettre une vanne de mélange\",\"\")","v":{"$error":"#DIV/0!"}},null,{"$f":"IF(J19>1,\"mettre une vanne de mélange\",\"\")","v":{"$error":"#DIV/0!"}},null,{"$f":"IF(L19>1,\"mettre une vanne de mélange\",\"\")","v":{"$error":"#DIV/0!"}}]
[]
[null,"valeur sans div0",null,null,null,{"$f":"IF(OR(F5=0,F6=0,F8=0),\"\",F20)","v":""},null,{"$f":"IF(OR(H5=0,H6=0,H8=0),\"\",H20)","v":""},null,{"$f":"IF(OR(J5=0,J6=0,J8=0),\"\",J20)","v":""},null,{"$f":"IF(OR(L5=0,L6=0,L8=0),\"\",L20)","v":""}]
[null,"Diamètre"]
[null,"Calcul avec vitesse silencieuse:"]
[null,{"$f":"'Données-Résultats'!C31","v":"Diamètre tube circuit d'utilisation"},{"$f":"'Données-Résultats'!D31","v":"Øu"},{"$f":"'Données-Résultats'!E31","v":"mm"},{"$f":"'Données-Résultats'!F31","v":"="},{"$f":"IF(G8=\"Tru\",22.9*F12^0.4,22.9*F8^0.4)","v":0},null,{"$f":"IF(I8=\"Tru\",22.9*H12^0.4,22.9*H8^0.4)","v":0},null,{"$f":"IF(K8=\"Tru\",22.9*J12^0.4,22.9*J8^0.4)","v":0},null,{"$f":"IF(M8=\"Tru\",22.9*L12^0.4,22.9*L8^0.4)","v":0},{"$f":"'Données-Résultats'!Q31","v":0},{"$f":"'Données-Résultats'!R31","v":0},{"$f":"'Données-Résultats'!S31","v":0},{"$f":"'Données-Résultats'!T31","v":0}]
[null,"valeur proche",{"$f":"'Données-Résultats'!D32","v":0},{"$f":"'Données-Résultats'!E32","v":0},{"$f":"'Données-Résultats'!F32","v":0},{"$f":"VLOOKUP(F25,Base!$A$5:$A$31,1,TRUE)","v":0},null,{"$f":"VLOOKUP(H25,Base!$A$5:$A$31,1,TRUE)","v":0},null,{"$f":"VLOOKUP(J25,Base!$A$5:$A$31,1,TRUE)","v":0},null,{"$f":"VLOOKUP(L25,Base!$A$5:$A$31,1,TRUE)","v":0},{"$f":"'Données-Résultats'!Q32","v":0},{"$f":"'Données-Résultats'!R32","v":0},{"$f":"'Données-Résultats'!S32","v":0},{"$f":"'Données-Résultats'!T32","v":0}]
[null,"diam réel",null,null,null,{"$f":"VLOOKUP(F25,Base!$A$5:$B$30,2,TRUE)","v":13.2},null,{"$f":"VLOOKUP(H25,Base!$A$5:$B$30,2,TRUE)","v":13.2},null,{"$f":"VLOOKUP(J25,Base!$A$5:$B$30,2,TRUE)","v":13.2},null,{"$f":"VLOOKUP(L25,Base!$A$5:$B$30,2,TRUE)","v":13.2}]
[null,"diam réf",null,null,null,{"$f":"VLOOKUP(F27,Base!$B$5:$C$31,2,TRUE)","v":"AC - 17.2 * 2"},null,{"$f":"VLOOKUP(H27,Base!$B$5:$C$31,2,TRUE)","v":"AC - 17.2 * 2"},null,{"$f":"VLOOKUP(J27,Base!$B$5:$C$31,2,TRUE)","v":"AC - 17.2 * 2"},null,{"$f":"VLOOKUP(L27,Base!$B$5:$C$31,2,TRUE)","v":"AC - 17.2 * 2"}]
[null,"sans div0",null,null,null,{"$f":"IF(F25=0,\"\",F28)","v":""},null,{"$f":"IF(H25=0,\"\",H28)","v":""},null,{"$f":"IF(J25=0,\"\",J28)","v":""},null,{"$f":"IF(L25=0,\"\",L28)","v":""}]
[null,"Somme puissances utilisations",null,"kW",{"$f":"F5+H5+J5+L5","v":0}]
[null,"sans div0",null,null,{"$f":"IF(OR(F5=0,F6=0,F8=0),\"\",E30)","v":""}]
[]
[null,"Débit total de génération",null,"m3/h",null,{"$f":"F16+H16+J16+L16","v":0}]
[null,null,null,null,null,{"$f":"IF(OR(F5=0,F6=0,F8=0),0,F33)","v":0}]
[null,"Température de mélange",null,{"$f":"'Données-Résultats'!E42","v":"°C"},{"$f":"'Données-Résultats'!F42","v":"="},{"$f":"(F16*F18+H16*H18+J16*J18+L16*L18)/(F16+H16+J16+L16)","v":{"$error":"#DIV/0!"}}]
[null,"sans div0",null,"°C",null,{"$f":"IF(OR(F5=0,F6=0,F8=0),0,F35)","v":0}]
[null,"Débit transitant dans bouteille"]
[null,"Coefficient de bypass",null,null,null,145]
[null,"Coeff/100",null,null,null,{"$f":"IF(F5=0,0,F38/100)","v":0}]
[null,"Débit transitant",null,null,null,{"$f":"IF(F39=1,\"0\",F34*(F39-1))","v":0},"m3/h"]
{"$rows_left_out":50}
{"sheet":"Données-Résultats","index":1,"n_rows":66,"n_cols":18,"rows_kept":66,"cut":false,"hidden":false,"merged":[[5,3,5,17],[6,3,6,17],[7,3,7,17],[3,17,3,18],[28,6,28,7],[28,9,28,10],[22,12,23,13],[22,15,23,16],[15,12,15,13],[15,15,15,16],[18,12,18,13],[19,12,19,13],[20,12,20,13],[18,15,18,16],[19,15,19,16],[20,15,20,16],[31,9,31,10],[30,6,30,7],[30,9,30,10],[31,6,31,7],[22,9,23,10],[50,2,51,5],[15,6,15,7],[15,9,15,10],[19,6,19,7],[20,6,20,7],[19,9,19,10],[20,9,20,10],[18,9,18,10],[18,6,18,7],[37,6,37,7],[22,6,23,7],[33,6,33,7],[36,6,36,7],[45,6,45,7],[43,6,43,7],[34,6,34,7],[58,9,58,10],[46,6,46,7],[47,6,47,7],[48,6,48,7],[66,6,66,7],[58,6,58,7],[57,6,57,7],[59,6,59,7],[60,6,60,7],[63,6,63,7],[64,6,64,7],[65,6,65,7],[30,12,30,13],[30,15,30,16],[27,6,27,7],[27,9,27,10],[29,6,29,7],[29,9,29,10],[27,12,27,13],[28,12,28,13],[27,15,27,16],[29,12,29,13],[29,15,29,16],[28,15,28,16],[58,12,58,13],[58,15,58,16],[57,15,57,16],[31,15,31,16],[31,12,31,13],[42,6,42,7],[38,6,38,7],[40,6,40,7],[41,6,41,7],[57,12,57,13],[57,9,57,10],[55,6,55,7],[56,6,56,7]]}
[]
[]
[null,null,null,null,"Dimensionnement d'une bouteille de découplage"]
[null,null,null,null,null,null,null,null,null,null,null,null,null,null,null,null,null,"Version 04/2020"]
[]
[]
[null,null," Références du projet"]
[]
[]
[]
[]
[]
[]
["?",null,"Données"]
[]
["?",null,"Utilisation",null,null,null,"Circuit A",null,null,"Circuit B",null,null,"Circuit C",null,null,"Circuit D"]
[]
[null,null,"Désignation","Symbole","Unité"]
["?",null,"Référence","-","-",":"]
[null,null,"Puissance nominale d'utilisation","Pu","kW",":"]
["?",null,"Température de départ nominale","qdu","°C",":"]
["?",null,"Température de retour d'utilisation","qru",{"$f":"IF(C24=\"Débit\",\"m3/h\",\"°C\")","v":"°C"},":"]
[null,null,"ou Débit d'utilisation","qvu","m3/h",null,{"$f":"calculs2!F22","v":""},null,null,{"$f":"calculs2!H22","v":""},null,null,{"$f":"calculs2!J22","v":""},null,null,{"$f":"calculs2!L22","v":""}]
["?",null,"Présence ou non d'une vanne de mélange"]
[null,null,"Résultats"]
[]
[]
["?",null,"Débit d'utilisation","qvu","m3/h","=",{"$f":"calculs2!F12","v":0},null,null,{"$f":"calculs2!H12","v":0},null,null,{"$f":"calculs2!J12","v":0},null,null,{"$f":"calculs2!L12","v":0}]
["?",null,"Température de retour d'utilisation","qru",{"$f":"IF(C29=\"Débit\",\"m3/h\",\"°C\")","v":"°C"},"=",{"$f":"calculs2!F14","v":0},null,null,{"$f":"calculs2!H14","v":0},null,null,{"$f":"calculs2!J14","v":0},null,null,{"$f":"calculs2!L14","v":0}]
["?",null,"Débit secondaire","qvs","m3/h","=",{"$f":"calculs2!F16","v":0},null,null,{"$f":"calculs2!H16","v":0},null,null,{"$f":"calculs2!J16","v":0},null,null,{"$f":"calculs2!L16","v":0}]
["?",null,"Diamètre tube circuit d'utilisation","Øu","mm","=",{"$f":"calculs2!F25","v":0},null,null,{"$f":"calculs2!H25","v":0},null,null,{"$f":"calculs2!J25","v":0},null,null,{"$f":"calculs2!L25","v":0}]
[null,null,null,null,null,null,{"$f":"calculs2!F29","v":""},null,null,{"$f":"calculs2!H29","v":""},null,null,{"$f":"calculs2!J29","v":""},null,null,{"$f":"calculs2!L29","v":""}]
[]
["?",null,"Puissance totale d'utilisation","Pu","kW","=",{"$f":"calculs2!E31","v":""}]
["?",null,"Débit total secondaire","Qvs","m3/h","=",{"$f":"calculs2!F34","v":0}]
[]
["?",null,"Température de mélange bouteille","Tm","°C","=",{"$f":"calculs2!F36","v":0}]
["?",null,"Coefficient de bypass de bouteille","Cb","-",":",{"$f":"calculs2!F39","v":0}]
["?",null,"Débit transitant dans la bouteille","qvb","m3/h","=",{"$f":"calculs2!F40","v":0}]
[]
{"$rows_left_out":27}
{"sheet":"chaudDD","index":2,"n_rows":154,"n_cols":30,"rows_kept":154,"cut":false,"hidden":true,"merged":[]}
[]
[null,null,null,null,null,null,"base de données chaudières"]
[]
["Pu",{"$f":"'Données-Résultats'!G46","v":0}]
[]
["solution","Pmax","Modèle","combustible","Pmin","Pmax","qm fumées","qm fumées","diam sortie ch.","T fumées","% CO2","n°test",null,null,"solutions","Modèle","combustible","Pmin","Pmax","qm fumées","qm fumées","diam sortie ch.","T fumées","% CO2"]
[null,"kW","sans regu",null,"kW","kW","kg/h","kg/s","mm",null,null,null,null,null,null,null,null,"kW","kW","kg/h","kg/s","mm",null,null,null,null,"Modèle",null,"Pmin (kW)","Pmax (kW)"]
[{"$f":"L8","v":1},54,"DTG 230-7","gaz",27,54,119,{"$f":"G8/3600","v":3.3055555555555553E-2},180,null,null,{"$f":"IF($B$4<=F8,1,0)","v":1},null,null,1,{"$f":"VLOOKUP(O8,$A$8:$L$110,3,FALSE)","v":"DTG 230-7"},{"$f":"VLOOKUP(O8,$A$8:$L$110,4,FALSE)","v":"gaz"},{"$f":"VLOOKUP(O8,$A$8:$L$110,5,FALSE)","v":27},{"$f":"VLOOKUP(O8,$A$8:$L$110,6,FALSE)","v":54},{"$f":"VLOOKUP(O8,$A$8:$L$110,7,FALSE)","v":119},{"$f":"VLOOKUP(O8,$A$8:$L$110,8,FALSE)","v":3.3055555555555553E-2},{"$f":"VLOOKUP(O8,$A$8:$L$110,9,FALSE)","v":180},{"$f":"VLOOKUP(O8,$A$8:$L$110,10,FALSE)","v":0},{"$f":"VLOOKUP(O8,$A$8:$L$110,11,FALSE)","v":0},1,null,{"$f":"IF(ISNA(P8)=TRUE,\"hors gamme\",P8)","v":"DTG 230-7"},{"$f":"IF(ISNA(Q8)=TRUE,\"\",Q8)","v":"gaz"},{"$f":"IF(ISNA(R8)=TRUE,\"\",R8)","v":27},54]
[{"$f":"A8+L9","v":2},63,"DTG 230-8","gaz",36,63,138,{"$f":"G9/3600","v":3.833333333333333E-2},180,null,null,{"$f":"IF($B$4<=F9,1,0)","v":1},null,null,2,{"$f":"VLOOKUP(O9,$A$8:$K$110,3,FALSE)","v":"DTG 230-8"},{"$f":"VLOOKUP(O9,$A$8:$K$110,4,FALSE)","v":"gaz"},36,63,138,3.833333333333333E-2,180,0,0,2,null,{"$f":"IF(ISNA(P9)=TRUE,\"hors gamme\",P9)","v":"DTG 230-8"},{"$f":"IF(ISNA(Q9)=TRUE,\"\",Q9)","v":"gaz"},36,63]
[3,70,"DTG 230-9","gaz",36,72,160,4.4444444444444446E-2,180,null,null,1,null,null,3,"DTG 230-9","gaz",36,72,160,4.4444444444444446E-2,180,0,0,3,null,"DTG 230-9","gaz",36,72]
[4,81,"DTG 230-10","gaz",45,81,177,4.9166666666666664E-2,200,null,null,1,null,null,4,"DTG 230-10","gaz",45,81,177,4.9166666666666664E-2,200,0,0,4,null,"DTG 230-10","gaz",45,81]
[5,86,"C 230-85 Eco / C 210-85 Eco","gaz",8.9,86,137,3.8055555555555558E-2,150,null,null,1,null,null,6,"DTG 230-11","gaz",45,90,197,5.4722222222222221E-2,200,0,0,6,null,"DTG 230-11","gaz",45,90]
[6,90,"DTG 230-11","gaz",45,90,197,5.4722222222222221E-2,200,null,null,1,null,null,7,"GT 334","fioul",55,90,149,4.1388888888888892E-2,180,195,13,7,null,"GT 334","fioul",55,90]
[7,90,"GT 334","fioul",55,90,149,4.1388888888888892E-2,180,195,13,1,null,null,8,"GT 334","gaz",55,90,160,4.4444444444444446E-2,180,195,9.5,8,null,"GT 334","gaz",55,90]
[8,90,"GT 334","gaz",55,90,160,4.4444444444444446E-2,180,195,9.5,1,null,null,9,"DTG 230-12","gaz",54,99,216,0.06,200,0,0,9,null,"DTG 230-12","gaz",54,99]
[9,99,"DTG 230-12","gaz",54,99,216,0.06,200,null,null,1,null,null,10,"DTG 230-13","gaz",54,108,235,6.5277777777777782E-2,220,0,0,10,null,"DTG 230-13","gaz",54,108]
[10,108,"DTG 230-13","gaz",54,108,235,6.5277777777777782E-2,220,null,null,1,null,null,11,"GT 335","fioul",90,115,191,5.3055555555555557E-2,180,190,13,11,null,"GT 335","fioul",90,115]
[11,115,"GT 335","fioul",90,115,191,5.3055555555555557E-2,180,190,13,1,null,null,12,"GT 335","gaz",90,115,206,5.7222222222222223E-2,180,190,9.5,12,null,"GT 335","gaz",90,115]
[12,115,"GT 335","gaz",90,115,206,5.7222222222222223E-2,180,190,9.5,1,null,null,13,"DTG 230-14","gaz",54,117,255,7.0833333333333331E-2,220,0,0,13,null,"DTG 230-14","gaz",54,117]
[13,117,"DTG 230-14","gaz",54,117,255,7.0833333333333331E-2,220,null,null,1,null,null,14,"DTG 330-8 Eco","gaz",88,126,313.2,8.6999999999999994E-2,250,130,6.4,14,null,"DTG 330-8 Eco","gaz",88,126]
[14,126,"DTG 330-8 Eco","gaz",88,126,{"$f":"H21*3600","v":313.2},8.6999999999999994E-2,250,130,6.4,1,null,null,16,"DTG 330-8 S","gaz",83,140,352.8,9.8000000000000004E-2,250,140,6.4,16,null,"DTG 330-8 S","gaz",83,140]
[15,129,"C 230-130 Eco / C 210-130 Eco","gaz",13.5,129,205,{"$f":"G22/3600","v":5.6944444444444443E-2},150,null,null,1,null,null,17,"DTG 330-9 Eco","gaz",101,144,360,0.1,250,130,6.4,17,null,"DTG 330-9 Eco","gaz",101,144]
[16,140,"DTG 330-8 S","gaz",83,140,{"$f":"H23*3600","v":352.8},9.8000000000000004E-2,250,140,6.4,1,null,null,18,"GT 336","fioul",115,150,248,6.8888888888888888E-2,180,195,13,18,null,"GT 336","fioul",115,150]
[17,144,"DTG 330-9 Eco","gaz",101,144,{"$f":"H24*3600","v":360},0.1,250,130,6.4,1,null,null,19,"GT 336","gaz",115,150,270,7.4999999999999997E-2,180,195,9.5,19,null,"GT 336","gaz",115,150]
[18,150,"GT 336","fioul",115,150,248,{"$f":"G25/3600","v":6.8888888888888888E-2},180,195,13,1,null,null,20,"DTG 330-9 S","gaz",95,160,403.2,0.112,250,140,6.4,20,null,"DTG 330-9 S","gaz",95,160]
[19,150,"GT 336","gaz",115,150,270,{"$f":"G26/3600","v":7.4999999999999997E-2},180,195,9.5,1,null,null,21,"DTG 330-10 Eco","gaz",113,162,410.40000000000003,0.114,300,125,6.3,21,null,{"$f":"IF(ISNA(P26)=TRUE,\"hors gamme\",P26)","v":"DTG 330-10 Eco"},"gaz",113,162]
[20,160,"DTG 330-9 S","gaz",95,160,{"$f":"H27*3600","v":403.2},0.112,250,140,6.4,1,null,null,22,"C 230-170 Eco / C 210-170 Eco","gaz",18.100000000000001,171,274,7.6111111111111115E-2,150,0,0,22,null,"C 230-170 Eco / C 210-170 Eco","gaz",18.100000000000001,171]
[21,162,"DTG 330-10 Eco","gaz",113,162,{"$f":"H28*3600","v":410.40000000000003},0.114,300,125,6.3,1,null,null,23,"DTG 330-10 S","gaz",107,180,460.8,0.128,300,130,6.6,23,null,"DTG 330-10 S","gaz",107,180]
[22,171,"C 230-170 Eco / C 210-170 Eco","gaz",18.100000000000001,171,274,7.6111111111111115E-2,150,null,null,1,null,null,24,"DTG 330-11 Eco","gaz",126,180,446.4,0.124,300,125,6.4,24,null,"DTG 330-11 Eco","gaz",126,180]
[23,180,"DTG 330-10 S","gaz",107,180,{"$f":"H30*3600","v":460.8},0.128,300,130,6.6,1,null,null,25,"GT 337","fioul",150,185,306,8.5000000000000006E-2,200,195,13,25,null,"GT 337","fioul",150,185]
[24,180,"DTG 330-11 Eco","gaz",126,180,{"$f":"H31*3600","v":446.4},0.124,300,125,6.4,1,null,null,26,"GT 337","gaz",150,185,331,9.194444444444444E-2,200,195,9.5,26,null,"GT 337","gaz",150,185]
[25,185,"GT 337","fioul",150,185,306,{"$f":"G32/3600","v":8.5000000000000006E-2},200,195,13,1,null,null,27,"DTG 330-12 Eco","gaz",139,198,464.40000000000003,0.129,300,130,6.8,27,null,"DTG 330-12 Eco","gaz",139,198]
[26,185,"GT 337","gaz",150,185,331,{"$f":"G33/3600","v":9.194444444444444E-2},200,195,9.5,1,null,null,28,"DTG 330-11 S","gaz",119,200,507.59999999999997,0.14099999999999999,300,130,6.4,28,null,"DTG 330-11 S","gaz",119,200]
[27,198,"DTG 330-12 Eco","gaz",139,198,{"$f":"H34*3600","v":464.40000000000003},0.129,300,130,6.8,1,null,null,29,"C 230-210 Eco / C 210-210 Eco","gaz",22.7,214,343,9.5277777777777781E-2,150,0,0,29,null,"C 230-210 Eco / C 210-210 Eco","gaz",22.7,214]
[28,200,"DTG 330-11 S","gaz",119,200,{"$f":"H35*3600","v":507.59999999999997},0.14099999999999999,300,130,6.4,1,null,null,30,"DTG 330-12 S","gaz",131,220,558,0.155,300,135,6.4,30,null,"DTG 330-12 S","gaz",131,220]
[29,214,"C 230-210 Eco / C 210-210 Eco","gaz",22.7,214,343,{"$f":"G36/3600","v":9.5277777777777781E-2},150,null,null,1,null,null,31,"GT 338","fioul",185,230,381,0.10583333333333333,200,185,13,31,null,"GT 338",{"$f":"IF(ISNA(Q36)=TRUE,\"\",Q36)","v":"fioul"},185,230]
[30,220,"DTG 330-12 S","gaz",131,220,{"$f":"H37*3600","v":558},0.155,300,135,6.4,1,null,null,32,"GT 338","gaz",185,230,411,0.11416666666666667,200,185,9.5,32,null,"GT 338","gaz",185,230]
[31,230,"GT 338","fioul",185,230,381,{"$f":"G38/3600","v":0.10583333333333333},200,185,13,1,null,null,33,"DTG 330-14 Eco","gaz",164,234,572.4,0.159,350,125,6.5,33,null,"DTG 330-14 Eco","gaz",164,234]
[32,230,"GT 338","gaz",185,230,411,{"$f":"G39/3600","v":0.11416666666666667},200,185,9.5,1,null,null,34,"DTG 330-14 S","gaz",155,260,608.40000000000009,0.16900000000000001,350,130,7,34,null,"DTG 330-14 S","gaz",155,260]
[33,234,"DTG 330-14 Eco","gaz",164,234,{"$f":"H40*3600","v":572.4},0.159,350,125,6.5,1,null,null,35,"DTG 330-16 Eco","gaz",{"$f":"VLOOKUP(O40,$A$8:$L$110,5,FALSE)","v":189},{"$f":"VLOOKUP(O40,$A$8:$L$110,6,FALSE)","v":270},{"$f":"VLOOKUP(O40,$A$8:$L$110,7,FALSE)","v":615.6},{"$f":"VLOOKUP(O40,$A$8:$L$110,8,FALSE)","v":0.17100000000000001},{"$f":"VLOOKUP(O40,$A$8:$L$110,9,FALSE)","v":350},{"$f":"VLOOKUP(O40,$A$8:$L$110,10,FALSE)","v":130},{"$f":"VLOOKUP(O40,$A$8:$L$110,11,FALSE)","v":7},35,null,"DTG 330-16 Eco","gaz",189,270]
{"$rows_left_out":115}
{"sheet":"Base","index":3,"n_rows":31,"n_cols":4,"rows_kept":31,"cut":false,"hidden":true,"merged":[]}
[]
[]
["Base Tubes ACIER","(à masquer)","(à masquer)"]
["Diamètre réel int.","valeurs décaleés","Réf décalées","Référence"]
[0,13.2,"AC - 17.2 * 2"]
[13.2,16.7,"AC - 21.3 * 2.3","AC - 17.2 * 2"]
[16.7,22.3,"AC - 26.9 * 2.3","AC - 21.3 * 2.3"]
[22.3,27.9,"AC - 33.7 * 2.9","AC - 26.9 * 2.3"]
[27.9,36.6,"AC - 42.4 * 2.9","AC - 33.7 * 2.9"]
[36.6,42.5,"AC - 48.3 * 2.9","AC - 42.4 * 2.9"]
[42.5,53.9,"AC - 60.3 * 3.2","AC - 48.3 * 2.9"]
[53.9,63.6,"AC - 70.0 * 3.2","AC - 60.3 * 3.2"]
[63.6,69.7,"AC - 76.1 * 3.2","AC - 70.0 * 3.2"]
[69.7,82.5,"AC - 88.9 * 3.2","AC - 76.1 * 3.2"]
[82.5,94.4,"AC - 101.6 * 3.6","AC - 88.9 * 3.2"]
[94.4,100.8,"AC - 108 * 3.6","AC - 101.6 * 3.6"]
[100.8,107.1,"AC - 114.3 * 3.6","AC - 108 * 3.6"]
[107.1,125,"AC - 133 * 4.0","AC - 114.3 * 3.6"]
[125,131.69999999999999,"AC - 139.7 * 4.0","AC - 133 * 4.0"]
[131.69999999999999,150,"AC - 159 * 4.5","AC - 139.7 * 4.0"]
[150,159.30000000000001,"AC - 168.3 * 4.5","AC - 159 * 4.5"]
[159.30000000000001,183.1,"AC - 193.7 * 5.4","AC - 168.3 * 4.5"]
[183.1,207.3,"AC - 219.1 * 5.9","AC - 193.7 * 5.4"]
[207.3,231.9,"AC - 244.5 * 6.3","AC - 219.1 * 5.9"]
[231.9,260.39999999999998,"AC - 273 * 6.3","AC - 244.5 * 6.3"]
[260.39999999999998,309.7,"AC - 323.9 * 7.1","AC - 273 * 6.3"]
[309.7,339.6,"AC - 355.6 * 8.0","AC - 323.9 * 7.1"]
[339.6,352,"AC - 368 * 8.0","AC - 355.6 * 8.0"]
[352,388.8,"AC - 406.4 * 8.8","AC - 368 * 8.0"]
[388.8,399,"AC - 419 * 10.0 ","AC - 406.4 * 8.8"]
[399,null,null,"AC - 419 * 10.0 "]

{"sheet":"MAJ","index":4,"n_rows":2,"n_cols":3,"rows_kept":2,"cut":false,"hidden":true,"merged":[]}
["Date","Auteur","MAJ"]
["2018-04-05","Alexandre Diebold","Création outil à partir d'une ancienne version"]