{"text_format":"1","workbook":"xlsx","n_sheets":41,"sheets":["Master","Energiepreisberechnung","Spitzenlastkessel","Deckungsratenberechung","Diagramm","LW bival ÖL","LW2 bival ÖL","LW3 bival ÖL","LW bival PL","LW2 bival PL","LW3 bival PL","LW bival GAS","LW2 bival GAS","LW3 bival GAS","LW bival FLGAS","LW2 bival FLGAS","LW3 bival FLGAS","SW bival ÖL","SW2 bival ÖL","SW3 bival ÖL","SW bival PL","SW2 bival PL","SW3 bival PL","SW mono PL","SW2 mono PL","SW3 mono PL","SW bival GAS","SW2 bival GAS","SW3 bival GAS","SW bival FLGAS","SW2 bival FLGAS","SW3 bival FLGAS","SW mono ÖL","SW2 mono ÖL","SW3 mono ÖL","SW mono GAS","SW2 mono GAS","SW3 mono GAS","SW mono FLGAS","SW2 mono FLGAS","SW3 mono FLGAS"],"not_rendered":{"charts":1,"images":2,"macros":1,"external_links":0,"defined_names":1,"comments":0,"pivot_tables":0},"unopened":[],"bounds":{"document_bytes":16777216,"sheet_cells":100000,"rows_first":2000,"rows_last":500,"rows_between":2000,"halvings":0,"cell_chars":16384,"cell_head_chars":4096},"cells_cut":0,"cells_raw":0,"read":"whole","date_system":"1900"}

{"sheet":"Master","index":0,"n_rows":153,"n_cols":21,"rows_kept":153,"cut":false,"hidden":false,"merged":[[19,0,19,2],[7,0,7,2],[1,3,1,6]]}
[]
["Überschlägige Wirtschaftlichkeitsbetrachtung",null,null,"BV: medrow / 06.08.2012"]
[]
["Eingaben:"]
["Anlagenheizlast",null,null,40,"kW",null,"Einstellbereich  30 - 500 kW"]
["Jahresvollbenutzungsstunden",null,null,2000,"h",null,"Einstellbereich  1200 - 3000 h"]
["Energiepreissteigeungsrate in %",null,null,7,"%",null,"Einstellbereich  5 - 10 %"]
["Bitte hier die Investitionskosten für den neuen Gas-Brennwert-\nkessel eintragen (und danach nochmals \"Berechnen\" drücken):",null,null,5000,"€",{"$f":"IF(D8<3000,\"zu niedrig\",(IF(D8>40000,\"zu hoch\",\"\")))","v":""},"Einstellbereich 3000 - 40000 €",null,null,null,null,null,null,null,null,1,2,3,4]
[null,null,null,null,null,null,null,null,null,null,null,null,null,null,1,{"$f":"AND($K$14=1,$K$27=1)","v":false},{"$f":"AND($K$14=2,$K$27=1)","v":false},{"$f":"AND($K$14=3,$K$27=1)","v":false},{"$f":"AND($K$14=4,$K$27=1)","v":false},{"$f":"OR(P9,Q9,R9,S9,)","v":false},"1xSWmono"]
[null,null,null,null,null,null,null,null,null,1,"bestehender Ölkessel",null,null,null,2,{"$f":"AND($K$14=1,K$27=2)","v":false},{"$f":"AND($K$14=2,$K$27=2)","v":true},{"$f":"AND($K$14=3,$K$27=2)","v":false},{"$f":"AND($K$14=4,$K$27=2)","v":false},{"$f":"OR(P10,Q10,R10,S10)","v":true},"2xSWmono"]
[null,null,null,null,null,null,null,null,null,2,"neuer Gas-Brennwertkessel ",null,null,null,3,{"$f":"AND($K$14=1,K$27=3)","v":false},{"$f":"AND($K$14=2,$K$27=3)","v":false},{"$f":"AND($K$14=3,$K$27=3)","v":false},{"$f":"AND($K$14=4,$K$27=3)","v":false},{"$f":"OR(P11,Q11,R11,S11)","v":false},"3xSWmono"]
[null,null,null,null,null,null,null,null,null,3,"neuer Gas-Brennwertkessel (Flüssiggas)",null,null,null,4,{"$f":"AND($K$14=1,K$27=4)","v":false},{"$f":"AND($K$14=2,$K$27=4)","v":false},{"$f":"AND($K$14=3,$K$27=4)","v":false},{"$f":"AND($K$14=4,$K$27=4)","v":false},{"$f":"OR(P12,Q12,R12,S12,)","v":false},"1xSWbival"]
[null,null,null,null,null,null,null,null,null,4,"neuer Pelletkessel",null,null,null,5,{"$f":"AND($K$14=1,K$27=5)","v":false},{"$f":"AND($K$14=2,$K$27=5)","v":false},{"$f":"AND($K$14=3,$K$27=5)","v":false},{"$f":"AND($K$14=4,$K$27=5)","v":false},{"$f":"OR(P13,Q13,R13,S13)","v":false},"2xSWbival"]
[null,null,null,null,null,null,null,null,null,null,2,null,null,null,6,{"$f":"AND($K$14=1,K$27=6)","v":false},{"$f":"AND($K$14=2,$K$27=6)","v":false},{"$f":"AND($K$14=3,$K$27=6)","v":false},{"$f":"AND($K$14=4,$K$27=6)","v":false},{"$f":"OR(P14,Q14,R14,S14)","v":false},"3xSWbival"]
["Geben Sie bitte die gewünschte neue Anlagenkonfiguration sowie die Referenzanlagenkonfiguration ein:",null,null,null,null,null,null,null,null,null,null,null,null,null,7,{"$f":"AND($K$14=1,K$27=7)","v":false},{"$f":"AND($K$14=2,$K$27=7)","v":false},{"$f":"AND($K$14=3,$K$27=7)","v":false},{"$f":"AND($K$14=4,$K$27=7)","v":false},{"$f":"OR(P15,Q15,R15,S15,)","v":false},"1xLWbival"]
["neue Anlagenkonfiguration",null,null,"Referenzanlagenkonfiguration",null,null,null,null,null,1,"1 x GAWP SW monovalent",null,null,null,8,{"$f":"AND($K$14=1,K$27=8)","v":false},{"$f":"AND($K$14=2,$K$27=8)","v":false},{"$f":"AND($K$14=3,$K$27=8)","v":false},{"$f":"AND($K$14=4,$K$27=8)","v":false},{"$f":"OR(P16,Q16,R16,S16)","v":false},"2xLWbival"]
[null,null,null,null,null,null,null,null,null,2,"2 x GAWP SW monovalent",null,null,null,9,{"$f":"AND($K$14=1,K$27=9)","v":false},{"$f":"AND($K$14=2,$K$27=9)","v":false},{"$f":"AND($K$14=3,$K$27=9)","v":false},{"$f":"AND($K$14=4,$K$27=9)","v":false},{"$f":"OR(P17,Q17,R17,S17)","v":false},"3xLWbival"]
[null,null,null,null,null,null,null,null,null,3,"3 x GAWP SW monovalent",null,null,null,null,{"$f":"OR(P9,P10,P11,P12,P13,P14,P15,P16,P17)","v":false},{"$f":"OR(Q9,Q10,Q11,Q12,Q13,Q14,Q15,Q16,Q17)","v":true},{"$f":"OR(R9,R10,R11,R12,R13,R14,R15,R16,R17)","v":false},{"$f":"OR(S9,S10,S11,S12,S13,S14,S15,S16,S17)","v":false}]
[null,null,null,null,null,null,null,null,null,4,"1 x GAWP SW bivalent",null,null,null,null,"best. ÖL","n. Gas-BW","n. Fl Gas-BW","n. Pellet"]
[{"$f":"IF(T9=TRUE,(IF(D5<41,\"\",\"Anlagenheizlast zu groß\")),(IF(T10=TRUE,(IF(D5<81,\"\",\"Anlagenheizlast zu groß\")),(IF(T11=TRUE,(IF(D5<121,\"\",\"Anlagenheizlast zu groß\")),\"\")))))","v":""},null,null,null,null,null,null,null,null,5,"2 x GAWP SW bivalent"]
["Gegeben:",null,null,null,null,null,null,null,null,6,"3 x GAWP SW bivalent",null,null,null,null,null,"Überprüfung ob Invest zu niedrig oder zu hoch"]
["Aktueller Gaspreis",null,null,5.5E-2,"€/kWh",null,null,null,null,7,"1 x GAWP LW bivalent",null,null,null,null,null,{"$f":"IF(F8=\"zu niedrig\",FALSE,(IF(F8=\"zu hoch\",FALSE,(TRUE))))","v":true}]
["Aktueller Strompreis",null,null,0.2,"€/kWh",null,null,null,null,8,"2 x GAWP LW bivalent"]
["Gemittelter Wirkungsgrad Gasbrennwertgerät",null,null,1.06,null,null,null,null,null,9,"3 x GAWP LW bivalent"]
["Gemittelter Wirkungsgrad GAWP SW",null,null,1.55]
["Elektr. Leistung GAWP SW",null,null,0.47,"kW"]
["Elektr. Leistung Kesselkreispumpe",null,null,0.06,"kW",null,null,null,null,null,2]
["Elektr. Leistung Umwälzpumpe GAWP",null,null,0.05,"kW"]
[]
["Gesucht:","Investitions- und Betriebskosten während 20 Jahren"]
[null,null,null,null,null,null,null,null,null,null,{"$f":"('SW bival ÖL'!A52)","v":"Spitzenlastkessel GMR 3035 (35 kW)"}]
["1.",null,null,null,null,null,null,null,null,null,{"$f":"('SW bival ÖL'!D52)","v":3600}]
["Errechnung der mittleren Energiepreise binnen 20 Jahren"]
[]
["Gaspreis Anfangsjahr:",null,null,5.5E-2,"€/kWh"]
["Gaspreis im 20´sten Jahr:",null,null,0.19890901442685968,"€/kWh"]
["Mittlerer Gaspreis während 20 Jahren:",null,null,0.11273760388338561,"€/kWh"]
[]
["Strompreis Anfangsjahr:",null,null,0.2,"€/kWh"]
["Strompreis im 20´sten Jahr:",null,null,0.72330550700676266,"€/kWh"]
["Mittlerer Strompreis während 20 Jahren:",null,null,0.40995492321231131,"€/kWh"]
[]
["2."]
["Betrachtung für ein neues Gasbrennwertgerät",null,null,40,"kW"]
[]
["2a"]
["Investitionskosten",null,null,5000,"€"]
["Investitionskosten gesamt: ",null,null,5000,"€",null,null,null,"R_I_GAS"]
[]
["2b"]
["Betriebskosten Gas-Brennwertgerät"]
["Jahresarbeit Gas-Brennwertgerät",null,null,80000,"kWh/a","(Leistung x Jahresvollbenutzungsstunden)"]
["Energieverbrauch Gas-Brennwertgerät",null,null,75471.698113207545,"kWh/a","(Wirkungsgrad berücksichtigt)",null,null,"R_B_GAS"]
["Kosten Gas",null,null,8508.4984062932526,"€/a"]
["Wartungskosten Gas-Brennwertgerät",null,null,300,"€/a",null,null,null,"R_B_WART_GAS"]
["Stromverbrauch 1 Stück Kesselkreispumpe",null,null,120,"kWh/a",null,null,null,"R_B_STROM_GAS"]
["Stromkosten 1 Stück Kesselkreispumpe",null,null,49.194590785477359,"€/a","(Stromverbrauch x mittlerer Strompreis)"]
[]
["Betriebskosten pro Jahr gesamt:",null,null,8857.6929970787296,"€/a"]
[]
["3."]
["Betrachtung für zwei GAWP 40 SW (80 kW) monovalent"]
[]
["3a",null,null,null,null,null,null,null,null,null,null,null,null,{"$f":"(Diagramm!AG28)","v":8857.6929970787314}]
["Investitionskosten"]
["2 x GAWP + Zubehör",null,null,45000,"€"]
["Förderung BAFA",null,null,9400,"€"]
["Investitionskosten gesamt: ",null,null,35600,"€",null,null,null,"N_I_GAWP_u_BW"]
[]
["3b"]
["Betriebskosten"]
["Leistung 2 x GAWP",null,null,40,"kW"]
["Jahresarbeit 2 x GAWP",null,null,80000,"kWh/a","(ergibt sich aus Deckungsrate = 100%)"]
[]
["Vollbenutzungsstunden 2 x GAWP",null,null,2000,"h","(ergibt sich aus Jahresarbeit/Leistung)"]
[]
["Gasverbrauch 2 x GAWP",null,null,51612.903225806447,"kWh/a","(ergibt sich aus Jahresarbeit/Wirkungsgrad)",null,null,"N_B_GAS_GAWP"]
[]
["Kosten Gasverbrauch 2 x GAWP",null,null,5818.7150391424821,"€/a","(ergibt sich aus Gasverbrauch x mittlerer Gaspreis)"]
[]
["Wartungskosten 2 x GAWP",null,null,500,"€/a",null,null,null,"N_B_WART_GAWP"]
[]
["Stromverbrauch 2 x GAWP",null,null,1880,"kWh/a",null,null,null,"N_B_STROM_LÜ_GAWP"]
["Stromkosten 2 x GAWP",null,null,770.71525563914531,"€/a","(Stromverbrauch x mittlerer Strompreis)"]
["Stromverbrauch 4 x Umwälzpumpe GAWP",null,null,400,"kWh/a",null,null,null,"N_B_STROM_PU_GAWP"]
["Stromkosten 4 x Umwälzpumpe GAWP",null,null,163.98196928492453,"€/a","(Stromverbrauch x mittlerer Strompreis)"]
[]
["Betriebskosten pro Jahr gesamt:",null,null,7253.4122640665519,"€/a"]
[]
["FAZIT:"]
["Mittlere Energieeinsparung pro Jahr bei Einsatz"]
["von zwei monovalenten GAWP SW gegenüber"]
["den Betriebskosten eines Gas-Brennwertgerätes",null,null,1604.2807330121777,"€/a",null,null,null,null,null,null,null,null,{"$f":"(Diagramm!AH28)","v":7253.4122640665519}]
[]
["Differenz Investitionskosten:",null,null,30600,"€"]
[]
["Für einen auf 20 Jahre gemittelten Engergiepreis"]
["ergibt sich eine Amortisationszeit von: ",null,null,19.073968396133399,"Jahren",null,null,null,null,null,null,null,null,{"$f":"(Diagramm!AI28)","v":1604.2807330121784}]
[]
[null,null,null,null,null,null,null,null,null,null,null,null,null,{"$f":"(Diagramm!AJ6)","v":30600}]
[]
[]
[]
[]
[]
[]
[]
[]
[]
[]
[]
[]
[]
[]
[]
[]
[null,null,null,null,null,null,null,null,null,null,null,null,"Differenz"]
[null,null,null,null,null,null,null,null,null,null,null,null,"Invest"]
[null,null,null,null,null,null,null,null,null,null,"Betriebsk.","Betriebsk.","minus"]
[null,null,null,null,null,null,null,null,null,null,"Referenz-","neue","Differenz"]
[null,null,null,null,null,null,null,null,null,null,"Anlage","Anlage","Betriebsk."]
[null,null,null,null,null,null,null,null,null,"Jahr","€","€","€",null,2]
[null,null,null,null,null,null,null,null,null,0,{"$f":"(Diagramm!AG6)","v":4474.9433962264147},{"$f":"(Diagramm!AH6)","v":3794.7096774193546},{"$f":"(Diagramm!AK6)","v":29919.76628119294},null,{"$f":"IF(M123<0,1,2)","v":2},{"$f":"IF(AND(O123=1,O122=2),TRUE,FALSE)","v":false},{"$f":"IF(AND(O123=2,O122=2),TRUE,FALSE)","v":true},{"$f":"OR(P123,Q123)","v":true}]
[null,null,null,null,null,null,null,null,null,1,{"$f":"(Diagramm!AG7)","v":4767.189433962264},{"$f":"(Diagramm!AH7)","v":4025.3393548387094},{"$f":"(Diagramm!AK7)","v":29177.916202069384},null,{"$f":"IF(M124<0,1,2)","v":2},{"$f":"IF(AND(O124=1,O123=2),TRUE,FALSE)","v":false},{"$f":"IF(AND(O124=2,O123=2),TRUE,FALSE)","v":true},{"$f":"OR(P124,Q124)","v":true}]
[null,null,null,null,null,null,null,null,null,2,{"$f":"(Diagramm!AG8)","v":5079.8926943396227},{"$f":"(Diagramm!AH8)","v":4272.1131096774188},{"$f":"(Diagramm!AK8)","v":28370.136617407181},null,2,false,true,true]
[null,null,null,null,null,null,null,null,null,3,{"$f":"(Diagramm!AG9)","v":5414.4851829433956},{"$f":"(Diagramm!AH9)","v":4536.1610273548386},{"$f":"(Diagramm!AK9)","v":27491.812461818623},null,2,false,true,true]
[null,null,null,null,null,null,null,null,null,4,{"$f":"(Diagramm!AG10)","v":5772.4991457494334},{"$f":"(Diagramm!AH10)","v":4818.6922992696773},{"$f":"(Diagramm!AK10)","v":26538.005615338865},null,2,false,true,true]
[null,null,null,null,null,null,null,null,null,5,{"$f":"(Diagramm!AG11)","v":6155.5740859518946},{"$f":"(Diagramm!AH11)","v":5121.0007602185551},{"$f":"(Diagramm!AK11)","v":25503.432289605524},null,2,false,true,true]
[null,null,null,null,null,null,null,null,null,6,{"$f":"(Diagramm!AG12)","v":6565.4642719685271},{"$f":"(Diagramm!AH12)","v":5444.4708134338534},{"$f":"(Diagramm!AK12)","v":24382.438831070849},null,2,false,true,true]
[null,null,null,null,null,null,null,null,null,7,{"$f":"(Diagramm!AG13)","v":7004.0467710063231},{"$f":"(Diagramm!AH13)","v":5790.5837703742236},{"$f":"(Diagramm!AK13)","v":23168.975830438751},null,2,false,true,true]
[null,null,null,null,null,null,null,null,null,8,{"$f":"(Diagramm!AG14)","v":7473.3300449767667},{"$f":"(Diagramm!AH14)","v":6160.9246343004188},{"$f":"(Diagramm!AK14)","v":21856.570419762404},null,2,false,true,true]
[null,null,null,null,null,null,null,null,null,9,{"$f":"(Diagramm!AG15)","v":7975.4631481251399},{"$f":"(Diagramm!AH15)","v":6557.1893587014474},{"$f":"(Diagramm!AK15)","v":20438.296630338711},null,2,false,true,true]
[null,null,null,null,null,null,null,null,null,10,{"$f":"(Diagramm!AG16)","v":8512.7455684938996},{"$f":"(Diagramm!AH16)","v":6981.1926138105491},{"$f":"(Diagramm!AK16)","v":18906.743675655362},null,2,false,true,true]
[null,null,null,null,null,null,null,null,null,11,{"$f":"(Diagramm!AG17)","v":9087.6377582884725},{"$f":"(Diagramm!AH17)","v":7434.8760967772887},{"$f":"(Diagramm!AK17)","v":17253.982014144178},null,2,false,true,true]
[null,null,null,null,null,null,null,null,null,12,{"$f":"(Diagramm!AG18)","v":9702.7724013686657},{"$f":"(Diagramm!AH18)","v":7920.3174235516981},{"$f":"(Diagramm!AK18)","v":15471.52703632721},null,2,false,true,true]
[null,null,null,null,null,null,null,null,null,13,{"$f":"(Diagramm!AG19)","v":10360.966469464474},{"$f":"(Diagramm!AH19)","v":8439.739643200317},{"$f":"(Diagramm!AK19)","v":13550.300210063053},null,2,false,true,true]
[null,null,null,null,null,null,null,null,null,14,{"$f":"(Diagramm!AG20)","v":11065.234122326987},{"$f":"(Diagramm!AH20)","v":8995.5214182243399},{"$f":"(Diagramm!AK20)","v":11480.587505960406},null,2,false,true,true]
[null,null,null,null,null,null,null,null,null,15,{"$f":"(Diagramm!AG21)","v":11818.800510889876},{"$f":"(Diagramm!AH21)","v":9590.2079175000454},{"$f":"(Diagramm!AK21)","v":9251.9949125705753},null,2,false,true,true]
[null,null,null,null,null,null,null,null,null,16,{"$f":"(Diagramm!AG22)","v":12625.116546652167},{"$f":"(Diagramm!AH22)","v":10226.522471725046},{"$f":"(Diagramm!AK22)","v":6853.400837643454},null,2,false,true,true]
[null,null,null,null,null,null,null,null,null,17,{"$f":"(Diagramm!AG23)","v":13487.874704917818},{"$f":"(Diagramm!AH23)","v":10907.3790447458},{"$f":"(Diagramm!AK23)","v":4272.9051774714353},null,2,false,true,true]
[null,null,null,null,null,null,null,null,null,18,{"$f":"(Diagramm!AG24)","v":14411.025934262065},{"$f":"(Diagramm!AH24)","v":11635.895577878005},{"$f":"(Diagramm!AK24)","v":1497.774821087376},null,2,false,true,true]
[null,null,null,null,null,null,null,null,null,19,{"$f":"(Diagramm!AG25)","v":15398.797749660409},{"$f":"(Diagramm!AH25)","v":12415.408268329465},{"$f":"(Diagramm!AK25)","v":-1485.6146602435674},null,1,true,false,true]
[]
[]
[]
[]
[]
[]
[]
[]
["Obenstehende Berechnung versteht sich als überschlägig. Ein genaueres Ergebniss zur Amortisationszeit kann bei Erstellung eines auf das"]
["Bauvorhaben bezogenen Angebot gemacht werden. Für Rückfragen wenden Sie sich bitte an:"]
["Firma OERTLI Rohleder GmbH, Raiffeisenstrasse 3, 71696 Möglingen, Tel: +49 (0) 7141 - 2454-0, info@oertli.de, www.oertli.de"]

{"sheet":"Energiepreisberechnung","index":1,"n_rows":32,"n_cols":12,"rows_kept":32,"cut":false,"hidden":false,"merged":[]}
[]
[null,"Jahr","Gaspreis\n€","Flüssig-gaspreis\n€","Strompreis\n€","Ölpreis\n€","Pelletpreis\n€","Preisstei-\ngerungs-\nrate\nGas","Preisstei-\ngerungs-\nrate\nFl.Gas","Preisstei-\ngerungs-\nrate\nStrom","Preisstei-\ngerungs-\nrate\nÖl","Preisstei-\ngerungs-\nrate\nPellet"]
[null,1,{"$f":"(D28)","v":5.5E-2},{"$f":"(D29)","v":7.0000000000000007E-2},{"$f":"(D31)","v":0.2},{"$f":"(D30)","v":8.5000000000000006E-2},{"$f":"(D32)","v":0.05},{"$f":"(Master!D7/100)","v":7.0000000000000007E-2},{"$f":"(Master!D7/100)","v":7.0000000000000007E-2},{"$f":"(Master!D7/100)","v":7.0000000000000007E-2},{"$f":"(Master!D7/100)","v":7.0000000000000007E-2},{"$f":"(Master!D7/100)","v":7.0000000000000007E-2}]
[null,2,{"$f":"(C3+C3*$H$3)","v":5.885E-2},{"$f":"(D3+D3*$I$3)","v":7.4900000000000008E-2},{"$f":"(E3+E3*$J$3)","v":0.21400000000000002},{"$f":"(F3+F3*$K$3)","v":9.0950000000000003E-2},{"$f":"(G3+G3*$L$3)","v":5.3500000000000006E-2}]
[null,3,{"$f":"(C4+C4*$H$3)","v":6.2969499999999998E-2},{"$f":"(D4+D4*$I$3)","v":8.0143000000000006E-2},{"$f":"(E4+E4*$J$3)","v":0.22898000000000002},{"$f":"(F4+F4*$K$3)","v":9.73165E-2},{"$f":"(G4+G4*$L$3)","v":5.7245000000000004E-2}]
[null,4,6.7377364999999995E-2,8.5753010000000005E-2,0.24500860000000002,0.104128655,6.1252150000000005E-2]
[null,5,7.209378055E-2,9.1755720700000001E-2,0.26215920200000004,0.11141766085,6.5539800500000009E-2]
[null,6,7.7140345188500006E-2,9.8178621149E-2,0.28051034614000003,0.11921689710950001,7.0127586535000008E-2]
[null,7,8.2540169351695003E-2,0.10505112462943,0.30014607036980001,0.127562079907165,7.5036517592450003E-2]
[null,8,8.831798120631365E-2,0.11240470335349011,0.32115629529568601,0.13649142550066656,8.0289073823921503E-2]
[null,9,9.4500239890755608E-2,0.12027303258823441,0.34363723596638401,0.14604582528571322,8.5909308991596003E-2]
[null,10,0.1011152566831085,0.12869214486941083,0.36769184248403092,0.15626903305571316,9.1922960621007729E-2]
[null,11,0.1081933246509261,0.1377005950102696,0.39343027145791309,0.16720786536961307,9.8357567864478274E-2]
[null,12,0.11576685737649092,0.14733963666098848,0.42097039045996704,0.17891241594548599,0.10524259761499176]
[null,13,0.12387053739284529,0.15765341122725768,0.45043831779216476,0.19143628506167001,0.11260957944804119]
[null,14,0.13254147501034447,0.16868915001316573,0.48196900003761628,0.20483682501598691,0.12049225000940407]
[null,15,0.14181937826106858,0.18049739051408734,0.51570683004024942,0.21917540276710598,0.12892670751006235]
[null,16,0.15174673473934339,0.19313220785007346,0.55180630814306686,0.23451768096080339,0.13795157703576671]
[null,17,0.16236900617109742,0.2066514623995786,0.59043274971308157,0.25093391862805964,0.14760818742827039]
[null,18,0.17373483660307423,0.22111706476754911,0.63176304219299728,0.26849929293202379,0.15794076054824932]
[null,19,0.18589627516528942,0.23659525930127756,0.67598645514650713,0.28729424343726545,0.16899661378662678]
[null,20,0.19890901442685968,0.25315692745236701,0.72330550700676266,0.30740484047787403,0.18082637675169067]
[null,"Summe",{"$f":"SUM(C3:C22)","v":2.2547520776677121},{"$f":"SUM(D3:D22)","v":2.8696844624861804},{"$f":"SUM(E3:E22)","v":8.1990984642462266},{"$f":"SUM(F3:F22)","v":3.4846168473046464},{"$f":"SUM(G3:G22)","v":2.0497746160615566}]
[null,"Mittelwert",{"$f":"(C23/20)","v":0.11273760388338561},{"$f":"(D23/20)","v":0.14348422312430903},{"$f":"(E23/20)","v":0.40995492321231131},{"$f":"(F23/20)","v":0.17423084236523231},{"$f":"(G23/20)","v":0.10248873080307783}]
[]
[]
[]
["aktueller Gaspreis",null,null,5.5E-2,"€/kWh"]
["aktueller Flüssiggaspreis",null,null,7.0000000000000007E-2,"€/kWh"]
["aktueller Ölpreis",null,null,8.5000000000000006E-2,"€/kWh"]
["aktueller Strompreis",null,null,0.2,"€/kWh"]
["aktueller Pelletpreis",null,null,0.05,"€/kWh"]

{"sheet":"Spitzenlastkessel","index":2,"n_rows":16,"n_cols":5,"rows_kept":16,"cut":false,"hidden":false,"merged":[]}
["Spitzenlastkessel"]
[]
["Name","kW",null,"Invest\nSolo","Invest\nSpitzenl."]
["GMR 3035",35,"Spitzenlastkessel GMR 3035 (35 kW)",5100,3600]
["GMR 5045",45,"Spitzenlastkessel GMR 5045 (45 kW)",5300,3800]
["GMR 5065",65,"Spitzenlastkessel GMR 5065 (65 kW)",6100,4600]
["GMR 5090",90,"Spitzenlastkessel GMR 5090 (90 kW)",7100,5700]
["GMR 5115",115,"Spitzenlastkessel GMR 5115 (115 kW)",8000,6500]
["GSR 234",130,"Spitzenlastkessel GSR 234 (130 kW)",10800,8800]
["GSR 235",180,"Spitzenlastkessel GSR 235 (180 kW)",12100,10100]
["GSR 236",220,"Spitzenlastkessel GSR 236 (220 kW)",15000,13000]
["GSR 335",280,"Spitzenlastkessel GSR 335 (280 kW)",16000,13700]
["GSR 336",350,"Spitzenlastkessel GSR 336 (350 kW)",18000,15700]
["GSR 337",430,"Spitzenlastkessel GSR 337 (430 kW)",22000,19500]
["GSR 338",500,"Spitzenlastkessel GSR 338 (500 kW)",24000,21100]
["GSR 339",570,"Spitzenlastkessel GSR 339 (570 kW)",25500,23000]

{"sheet":"Deckungsratenberechung","index":3,"n_rows":24,"n_cols":8,"rows_kept":24,"cut":false,"hidden":false,"merged":[]}
[]
[]
["Prozentuale \nAnlagen-\nHeizlast \nder GAWP","Deckungsrate"]
[0,0,null,null,null,{"$f":"VLOOKUP(G4,A4:B24,1,B4:B24)","v":70},70,"gegebener Wert der proz. Anlagenheizlast"]
[5,8]
[10,15,null,null,null,{"$f":"VLOOKUP(G4,A4:B24,2)","v":92}]
[15,25]
[20,33]
[25,41]
[30,50]
[35,58]
[40,67]
[45,75]
[50,80]
[55,83]
[60,87]
[65,90]
[70,92]
[75,94]
[80,96]
[85,97]
[90,98]
[95,99]
[100,100]

{"sheet":"Diagramm","index":4,"n_rows":28,"n_cols":37,"rows_kept":28,"cut":false,"hidden":false,"merged":[[2,21,2,29],[2,7,2,9],[3,10,3,12],[3,15,3,16],[2,10,2,19],[3,17,3,19]]}
[]
[]
[null,null,null,null,null,null,null,"Refenzanlage Investition",null,null,"Referenzanlage Betrieb",null,null,null,null,null,null,null,null,null,"Neue Investition","Neue Betriebskosten mit GAWP",null,null,null,null,null,null,null,null,null,null,null,null,"B","A"]
[null,null,null,null,null,null,null,"ÖL","GAS-BW\n(Gas/Flüssiggas)","Pellet","ÖL",null,null,"GAS","FLGAS","GAS/FLGAS",null,"Pellet",null,null," mit GAWP\n","Betriebsk.\nGas-BW (Gas)","Betriebsk.\nGas-BW (FlGas)","Betriebsk.\nGAWP (Gas)","Betriebsk.\nGAWP (FlGas)","Wartung\nGas-BW","Wartung \nGAWP","Stromk.\nGAWP","Stromk.\nGAS-BW","Stromk.\nUmwälzp. GAWP",null,"Jahr","Referenz-\nBetriebsk.","Neue\nBetriebsk.","Diff.\nBetriebsk.","Diff.\nInvestition","A minus\nB"]
[null,{"$f":"(Energiepreisberechnung!B2)","v":"Jahr"},{"$f":"(Energiepreisberechnung!C2)","v":"Gaspreis\n€"},{"$f":"(Energiepreisberechnung!D2)","v":"Flüssig-gaspreis\n€"},{"$f":"(Energiepreisberechnung!E2)","v":"Strompreis\n€"},{"$f":"(Energiepreisberechnung!F2)","v":"Ölpreis\n€"},{"$f":"(Energiepreisberechnung!G2)","v":"Pelletpreis\n€"},"R_I_ÖL","R_I_GAS","R_I_PL","R_B_ÖL","R_B_WART_ÖL","R_B_STROM_ÖL","R_B_GAS","R_B_FLGAS","R_B_WART_GAS","R_B_STROM_GAS","R_B_PL","R_B_WART_PL","R_B_STROM_PL","N_I_GAWP_u_BW","N_B_GAS_BW","N_B_FLGAS_BW","N_B_GAS_GAWP","N_B_FLGAS_GAWP","N_B_WART_BW","N_B_WART_GAWP","N_B_STROM_LÜ_GAWP","N_B_STROM_BW","N_B_STROM_PU_GAWP"]
[null,1,{"$f":"(Energiepreisberechnung!C3)","v":5.5E-2},{"$f":"(Energiepreisberechnung!D3)","v":7.0000000000000007E-2},{"$f":"(Energiepreisberechnung!E3)","v":0.2},{"$f":"(Energiepreisberechnung!F3)","v":8.5000000000000006E-2},{"$f":"(Energiepreisberechnung!G3)","v":0.05},{"$f":"IF(ISNA(INDEX(Master!$D$40:$I$110,MATCH(H$5,Master!$I$40:$I$110,0),1)),0,(INDEX(Master!$D$40:$I$110,MATCH(H$5,Master!$I$40:$I$110,0),1)))","v":0},{"$f":"IF(ISNA(INDEX(Master!$D$40:$I$110,MATCH(I$5,Master!$I$40:$I$110,0),1)),0,(INDEX(Master!$D$40:$I$110,MATCH(I$5,Master!$I$40:$I$110,0),1)))","v":5000},{"$f":"IF(ISNA(INDEX(Master!$D$40:$I$110,MATCH(J$5,Master!$I$40:$I$110,0),1)),0,(INDEX(Master!$D$40:$I$110,MATCH(J$5,Master!$I$40:$I$110,0),1)))","v":0},{"$f":"IF(ISNA(INDEX(Master!$D$40:$I$110,MATCH(K$5,Master!$I$40:$I$110,0),1)),0,(INDEX(Master!$D$40:$I$110,MATCH(K$5,Master!$I$40:$I$110,0),1)))","v":0},{"$f":"IF(ISNA(INDEX(Master!$D$40:$I$110,MATCH(L$5,Master!$I$40:$I$110,0),1)),0,(INDEX(Master!$D$40:$I$110,MATCH(L$5,Master!$I$40:$I$110,0),1)))","v":0},{"$f":"IF(ISNA(INDEX(Master!$D$40:$I$110,MATCH(M$5,Master!$I$40:$I$110,0),1)),0,(INDEX(Master!$D$40:$I$110,MATCH(M$5,Master!$I$40:$I$110,0),1)))","v":0},{"$f":"IF(ISNA(INDEX(Master!$D$40:$I$110,MATCH(N$5,Master!$I$40:$I$110,0),1)),0,(INDEX(Master!$D$40:$I$110,MATCH(N$5,Master!$I$40:$I$110,0),1)))","v":75471.698113207545},{"$f":"IF(ISNA(INDEX(Master!$D$40:$I$110,MATCH(O$5,Master!$I$40:$I$110,0),1)),0,(INDEX(Master!$D$40:$I$110,MATCH(O$5,Master!$I$40:$I$110,0),1)))","v":0},{"$f":"IF(ISNA(INDEX(Master!$D$40:$I$110,MATCH(P$5,Master!$I$40:$I$110,0),1)),0,(INDEX(Master!$D$40:$I$110,MATCH(P$5,Master!$I$40:$I$110,0),1)))","v":300},{"$f":"IF(ISNA(INDEX(Master!$D$40:$I$110,MATCH(Q$5,Master!$I$40:$I$110,0),1)),0,(INDEX(Master!$D$40:$I$110,MATCH(Q$5,Master!$I$40:$I$110,0),1)))","v":120},{"$f":"IF(ISNA(INDEX(Master!$D$40:$I$110,MATCH(R$5,Master!$I$40:$I$110,0),1)),0,(INDEX(Master!$D$40:$I$110,MATCH(R$5,Master!$I$40:$I$110,0),1)))","v":0},{"$f":"IF(ISNA(INDEX(Master!$D$40:$I$110,MATCH(S$5,Master!$I$40:$I$110,0),1)),0,(INDEX(Master!$D$40:$I$110,MATCH(S$5,Master!$I$40:$I$110,0),1)))","v":0},{"$f":"IF(ISNA(INDEX(Master!$D$40:$I$110,MATCH(T$5,Master!$I$40:$I$110,0),1)),0,(INDEX(Master!$D$40:$I$110,MATCH(T$5,Master!$I$40:$I$110,0),1)))","v":0},{"$f":"IF(ISNA(INDEX(Master!$D$40:$I$110,MATCH(U$5,Master!$I$40:$I$110,0),1)),0,(INDEX(Master!$D$40:$I$110,MATCH(U$5,Master!$I$40:$I$110,0),1)))","v":35600},{"$f":"IF(ISNA(INDEX(Master!$D$40:$I$110,MATCH(V$5,Master!$I$40:$I$110,0),1)),0,(INDEX(Master!$D$40:$I$110,MATCH(V$5,Master!$I$40:$I$110,0),1)))","v":0},{"$f":"IF(ISNA(INDEX(Master!$D$40:$I$110,MATCH(W$5,Master!$I$40:$I$110,0),1)),0,(INDEX(Master!$D$40:$I$110,MATCH(W$5,Master!$I$40:$I$110,0),1)))","v":0},{"$f":"IF(ISNA(INDEX(Master!$D$40:$I$110,MATCH(X$5,Master!$I$40:$I$110,0),1)),0,(INDEX(Master!$D$40:$I$110,MATCH(X$5,Master!$I$40:$I$110,0),1)))","v":51612.903225806447},{"$f":"IF(ISNA(INDEX(Master!$D$40:$I$110,MATCH(Y$5,Master!$I$40:$I$110,0),1)),0,(INDEX(Master!$D$40:$I$110,MATCH(Y$5,Master!$I$40:$I$110,0),1)))","v":0},{"$f":"IF(ISNA(INDEX(Master!$D$40:$I$110,MATCH(Z$5,Master!$I$40:$I$110,0),1)),0,(INDEX(Master!$D$40:$I$110,MATCH(Z$5,Master!$I$40:$I$110,0),1)))","v":0},{"$f":"IF(ISNA(INDEX(Master!$D$40:$I$110,MATCH(AA$5,Master!$I$40:$I$110,0),1)),0,(INDEX(Master!$D$40:$I$110,MATCH(AA$5,Master!$I$40:$I$110,0),1)))","v":500},{"$f":"IF(ISNA(INDEX(Master!$D$40:$I$110,MATCH(AB$5,Master!$I$40:$I$110,0),1)),0,(INDEX(Master!$D$40:$I$110,MATCH(AB$5,Master!$I$40:$I$110,0),1)))","v":1880},{"$f":"IF(ISNA(INDEX(Master!$D$40:$I$110,MATCH(AC$5,Master!$I$40:$I$110,0),1)),0,(INDEX(Master!$D$40:$I$110,MATCH(AC$5,Master!$I$40:$I$110,0),1)))","v":0},{"$f":"IF(ISNA(INDEX(Master!$D$40:$I$110,MATCH(AD$5,Master!$I$40:$I$110,0),1)),0,(INDEX(Master!$D$40:$I$110,MATCH(AD$5,Master!$I$40:$I$110,0),1)))","v":400},null,1,{"$f":"((K6*F6)+L6+(M6*E6)+(N6*C6)+(O6*D6)+P6+(Q6*E6)+(R6*G6)+S6+(T6*E6))","v":4474.9433962264147},{"$f":"(V6*C6)+W6*D6+X6*C6+Y6*D6+Z6+AA6+AB6*E6+AC6*E6+AD6*E6","v":3794.7096774193546},{"$f":"(AG6-AH6)","v":680.23371880706009},{"$f":"(U6-H6-I6-J6)","v":30600},{"$f":"(AJ6-AI6)","v":29919.76628119294}]
[null,2,{"$f":"(Energiepreisberechnung!C4)","v":5.885E-2},{"$f":"(Energiepreisberechnung!D4)","v":7.4900000000000008E-2},{"$f":"(Energiepreisberechnung!E4)","v":0.21400000000000002},{"$f":"(Energiepreisberechnung!F4)","v":9.0950000000000003E-2},{"$f":"(Energiepreisberechnung!G4)","v":5.3500000000000006E-2},null,null,null,{"$f":"IF(ISNA(INDEX(Master!$D$40:$I$110,MATCH(K$5,Master!$I$40:$I$110,0),1)),0,(INDEX(Master!$D$40:$I$110,MATCH(K$5,Master!$I$40:$I$110,0),1)))","v":0},{"$f":"IF(ISNA(INDEX(Master!$D$40:$I$110,MATCH(L$5,Master!$I$40:$I$110,0),1)),0,(INDEX(Master!$D$40:$I$110,MATCH(L$5,Master!$I$40:$I$110,0),1)))","v":0},{"$f":"IF(ISNA(INDEX(Master!$D$40:$I$110,MATCH(M$5,Master!$I$40:$I$110,0),1)),0,(INDEX(Master!$D$40:$I$110,MATCH(M$5,Master!$I$40:$I$110,0),1)))","v":0},{"$f":"IF(ISNA(INDEX(Master!$D$40:$I$110,MATCH(N$5,Master!$I$40:$I$110,0),1)),0,(INDEX(Master!$D$40:$I$110,MATCH(N$5,Master!$I$40:$I$110,0),1)))","v":75471.698113207545},{"$f":"IF(ISNA(INDEX(Master!$D$40:$I$110,MATCH(O$5,Master!$I$40:$I$110,0),1)),0,(INDEX(Master!$D$40:$I$110,MATCH(O$5,Master!$I$40:$I$110,0),1)))","v":0},{"$f":"IF(ISNA(INDEX(Master!$D$40:$I$110,MATCH(P$5,Master!$I$40:$I$110,0),1)),0,(INDEX(Master!$D$40:$I$110,MATCH(P$5,Master!$I$40:$I$110,0),1)))","v":300},{"$f":"IF(ISNA(INDEX(Master!$D$40:$I$110,MATCH(Q$5,Master!$I$40:$I$110,0),1)),0,(INDEX(Master!$D$40:$I$110,MATCH(Q$5,Master!$I$40:$I$110,0),1)))","v":120},{"$f":"IF(ISNA(INDEX(Master!$D$40:$I$110,MATCH(R$5,Master!$I$40:$I$110,0),1)),0,(INDEX(Master!$D$40:$I$110,MATCH(R$5,Master!$I$40:$I$110,0),1)))","v":0},{"$f":"IF(ISNA(INDEX(Master!$D$40:$I$110,MATCH(S$5,Master!$I$40:$I$110,0),1)),0,(INDEX(Master!$D$40:$I$110,MATCH(S$5,Master!$I$40:$I$110,0),1)))","v":0},{"$f":"IF(ISNA(INDEX(Master!$D$40:$I$110,MATCH(T$5,Master!$I$40:$I$110,0),1)),0,(INDEX(Master!$D$40:$I$110,MATCH(T$5,Master!$I$40:$I$110,0),1)))","v":0},null,{"$f":"IF(ISNA(INDEX(Master!$D$40:$I$110,MATCH(V$5,Master!$I$40:$I$110,0),1)),0,(INDEX(Master!$D$40:$I$110,MATCH(V$5,Master!$I$40:$I$110,0),1)))","v":0},{"$f":"IF(ISNA(INDEX(Master!$D$40:$I$110,MATCH(W$5,Master!$I$40:$I$110,0),1)),0,(INDEX(Master!$D$40:$I$110,MATCH(W$5,Master!$I$40:$I$110,0),1)))","v":0},{"$f":"IF(ISNA(INDEX(Master!$D$40:$I$110,MATCH(X$5,Master!$I$40:$I$110,0),1)),0,(INDEX(Master!$D$40:$I$110,MATCH(X$5,Master!$I$40:$I$110,0),1)))","v":51612.903225806447},{"$f":"IF(ISNA(INDEX(Master!$D$40:$I$110,MATCH(Y$5,Master!$I$40:$I$110,0),1)),0,(INDEX(Master!$D$40:$I$110,MATCH(Y$5,Master!$I$40:$I$110,0),1)))","v":0},{"$f":"IF(ISNA(INDEX(Master!$D$40:$I$110,MATCH(Z$5,Master!$I$40:$I$110,0),1)),0,(INDEX(Master!$D$40:$I$110,MATCH(Z$5,Master!$I$40:$I$110,0),1)))","v":0},{"$f":"IF(ISNA(INDEX(Master!$D$40:$I$110,MATCH(AA$5,Master!$I$40:$I$110,0),1)),0,(INDEX(Master!$D$40:$I$110,MATCH(AA$5,Master!$I$40:$I$110,0),1)))","v":500},{"$f":"IF(ISNA(INDEX(Master!$D$40:$I$110,MATCH(AB$5,Master!$I$40:$I$110,0),1)),0,(INDEX(Master!$D$40:$I$110,MATCH(AB$5,Master!$I$40:$I$110,0),1)))","v":1880},{"$f":"IF(ISNA(INDEX(Master!$D$40:$I$110,MATCH(AC$5,Master!$I$40:$I$110,0),1)),0,(INDEX(Master!$D$40:$I$110,MATCH(AC$5,Master!$I$40:$I$110,0),1)))","v":0},{"$f":"IF(ISNA(INDEX(Master!$D$40:$I$110,MATCH(AD$5,Master!$I$40:$I$110,0),1)),0,(INDEX(Master!$D$40:$I$110,MATCH(AD$5,Master!$I$40:$I$110,0),1)))","v":400},null,2,{"$f":"((K7*F7)+L7+(M7*E7)+(N7*C7)+(O7*D7)+P7+(Q7*E7)+(R7*G7)+S7+(T7*E7))","v":4767.189433962264},{"$f":"(V7*C7)+W7*D7+X7*C7+Y7*D7+Z7+AA7+AB7*E7+AC7*E7+AD7*E7","v":4025.3393548387094},{"$f":"(AG7-AH7)","v":741.85007912355468},{"$f":"(AK6)","v":29919.76628119294},{"$f":"(AJ7-AI7)","v":29177.916202069384}]
[null,3,{"$f":"(Energiepreisberechnung!C5)","v":6.2969499999999998E-2},{"$f":"(Energiepreisberechnung!D5)","v":8.0143000000000006E-2},{"$f":"(Energiepreisberechnung!E5)","v":0.22898000000000002},{"$f":"(Energiepreisberechnung!F5)","v":9.73165E-2},{"$f":"(Energiepreisberechnung!G5)","v":5.7245000000000004E-2},null,null,null,{"$f":"IF(ISNA(INDEX(Master!$D$40:$I$110,MATCH(K$5,Master!$I$40:$I$110,0),1)),0,(INDEX(Master!$D$40:$I$110,MATCH(K$5,Master!$I$40:$I$110,0),1)))","v":0},{"$f":"IF(ISNA(INDEX(Master!$D$40:$I$110,MATCH(L$5,Master!$I$40:$I$110,0),1)),0,(INDEX(Master!$D$40:$I$110,MATCH(L$5,Master!$I$40:$I$110,0),1)))","v":0},{"$f":"IF(ISNA(INDEX(Master!$D$40:$I$110,MATCH(M$5,Master!$I$40:$I$110,0),1)),0,(INDEX(Master!$D$40:$I$110,MATCH(M$5,Master!$I$40:$I$110,0),1)))","v":0},{"$f":"IF(ISNA(INDEX(Master!$D$40:$I$110,MATCH(N$5,Master!$I$40:$I$110,0),1)),0,(INDEX(Master!$D$40:$I$110,MATCH(N$5,Master!$I$40:$I$110,0),1)))","v":75471.698113207545},{"$f":"IF(ISNA(INDEX(Master!$D$40:$I$110,MATCH(O$5,Master!$I$40:$I$110,0),1)),0,(INDEX(Master!$D$40:$I$110,MATCH(O$5,Master!$I$40:$I$110,0),1)))","v":0},{"$f":"IF(ISNA(INDEX(Master!$D$40:$I$110,MATCH(P$5,Master!$I$40:$I$110,0),1)),0,(INDEX(Master!$D$40:$I$110,MATCH(P$5,Master!$I$40:$I$110,0),1)))","v":300},{"$f":"IF(ISNA(INDEX(Master!$D$40:$I$110,MATCH(Q$5,Master!$I$40:$I$110,0),1)),0,(INDEX(Master!$D$40:$I$110,MATCH(Q$5,Master!$I$40:$I$110,0),1)))","v":120},{"$f":"IF(ISNA(INDEX(Master!$D$40:$I$110,MATCH(R$5,Master!$I$40:$I$110,0),1)),0,(INDEX(Master!$D$40:$I$110,MATCH(R$5,Master!$I$40:$I$110,0),1)))","v":0},{"$f":"IF(ISNA(INDEX(Master!$D$40:$I$110,MATCH(S$5,Master!$I$40:$I$110,0),1)),0,(INDEX(Master!$D$40:$I$110,MATCH(S$5,Master!$I$40:$I$110,0),1)))","v":0},{"$f":"IF(ISNA(INDEX(Master!$D$40:$I$110,MATCH(T$5,Master!$I$40:$I$110,0),1)),0,(INDEX(Master!$D$40:$I$110,MATCH(T$5,Master!$I$40:$I$110,0),1)))","v":0},null,{"$f":"IF(ISNA(INDEX(Master!$D$40:$I$110,MATCH(V$5,Master!$I$40:$I$110,0),1)),0,(INDEX(Master!$D$40:$I$110,MATCH(V$5,Master!$I$40:$I$110,0),1)))","v":0},{"$f":"IF(ISNA(INDEX(Master!$D$40:$I$110,MATCH(W$5,Master!$I$40:$I$110,0),1)),0,(INDEX(Master!$D$40:$I$110,MATCH(W$5,Master!$I$40:$I$110,0),1)))","v":0},{"$f":"IF(ISNA(INDEX(Master!$D$40:$I$110,MATCH(X$5,Master!$I$40:$I$110,0),1)),0,(INDEX(Master!$D$40:$I$110,MATCH(X$5,Master!$I$40:$I$110,0),1)))","v":51612.903225806447},{"$f":"IF(ISNA(INDEX(Master!$D$40:$I$110,MATCH(Y$5,Master!$I$40:$I$110,0),1)),0,(INDEX(Master!$D$40:$I$110,MATCH(Y$5,Master!$I$40:$I$110,0),1)))","v":0},{"$f":"IF(ISNA(INDEX(Master!$D$40:$I$110,MATCH(Z$5,Master!$I$40:$I$110,0),1)),0,(INDEX(Master!$D$40:$I$110,MATCH(Z$5,Master!$I$40:$I$110,0),1)))","v":0},{"$f":"IF(ISNA(INDEX(Master!$D$40:$I$110,MATCH(AA$5,Master!$I$40:$I$110,0),1)),0,(INDEX(Master!$D$40:$I$110,MATCH(AA$5,Master!$I$40:$I$110,0),1)))","v":500},{"$f":"IF(ISNA(INDEX(Master!$D$40:$I$110,MATCH(AB$5,Master!$I$40:$I$110,0),1)),0,(INDEX(Master!$D$40:$I$110,MATCH(AB$5,Master!$I$40:$I$110,0),1)))","v":1880},{"$f":"IF(ISNA(INDEX(Master!$D$40:$I$110,MATCH(AC$5,Master!$I$40:$I$110,0),1)),0,(INDEX(Master!$D$40:$I$110,MATCH(AC$5,Master!$I$40:$I$110,0),1)))","v":0},{"$f":"IF(ISNA(INDEX(Master!$D$40:$I$110,MATCH(AD$5,Master!$I$40:$I$110,0),1)),0,(INDEX(Master!$D$40:$I$110,MATCH(AD$5,Master!$I$40:$I$110,0),1)))","v":400},null,3,5079.8926943396227,4272.1131096774188,807.77958466220389,{"$f":"(AK7)","v":29177.916202069384},28370.136617407181]
[null,4,{"$f":"(Energiepreisberechnung!C6)","v":6.7377364999999995E-2},{"$f":"(Energiepreisberechnung!D6)","v":8.5753010000000005E-2},{"$f":"(Energiepreisberechnung!E6)","v":0.24500860000000002},{"$f":"(Energiepreisberechnung!F6)","v":0.104128655},{"$f":"(Energiepreisberechnung!G6)","v":6.1252150000000005E-2},null,null,null,{"$f":"IF(ISNA(INDEX(Master!$D$40:$I$110,MATCH(K$5,Master!$I$40:$I$110,0),1)),0,(INDEX(Master!$D$40:$I$110,MATCH(K$5,Master!$I$40:$I$110,0),1)))","v":0},{"$f":"IF(ISNA(INDEX(Master!$D$40:$I$110,MATCH(L$5,Master!$I$40:$I$110,0),1)),0,(INDEX(Master!$D$40:$I$110,MATCH(L$5,Master!$I$40:$I$110,0),1)))","v":0},{"$f":"IF(ISNA(INDEX(Master!$D$40:$I$110,MATCH(M$5,Master!$I$40:$I$110,0),1)),0,(INDEX(Master!$D$40:$I$110,MATCH(M$5,Master!$I$40:$I$110,0),1)))","v":0},{"$f":"IF(ISNA(INDEX(Master!$D$40:$I$110,MATCH(N$5,Master!$I$40:$I$110,0),1)),0,(INDEX(Master!$D$40:$I$110,MATCH(N$5,Master!$I$40:$I$110,0),1)))","v":75471.698113207545},{"$f":"IF(ISNA(INDEX(Master!$D$40:$I$110,MATCH(O$5,Master!$I$40:$I$110,0),1)),0,(INDEX(Master!$D$40:$I$110,MATCH(O$5,Master!$I$40:$I$110,0),1)))","v":0},{"$f":"IF(ISNA(INDEX(Master!$D$40:$I$110,MATCH(P$5,Master!$I$40:$I$110,0),1)),0,(INDEX(Master!$D$40:$I$110,MATCH(P$5,Master!$I$40:$I$110,0),1)))","v":300},{"$f":"IF(ISNA(INDEX(Master!$D$40:$I$110,MATCH(Q$5,Master!$I$40:$I$110,0),1)),0,(INDEX(Master!$D$40:$I$110,MATCH(Q$5,Master!$I$40:$I$110,0),1)))","v":120},{"$f":"IF(ISNA(INDEX(Master!$D$40:$I$110,MATCH(R$5,Master!$I$40:$I$110,0),1)),0,(INDEX(Master!$D$40:$I$110,MATCH(R$5,Master!$I$40:$I$110,0),1)))","v":0},{"$f":"IF(ISNA(INDEX(Master!$D$40:$I$110,MATCH(S$5,Master!$I$40:$I$110,0),1)),0,(INDEX(Master!$D$40:$I$110,MATCH(S$5,Master!$I$40:$I$110,0),1)))","v":0},{"$f":"IF(ISNA(INDEX(Master!$D$40:$I$110,MATCH(T$5,Master!$I$40:$I$110,0),1)),0,(INDEX(Master!$D$40:$I$110,MATCH(T$5,Master!$I$40:$I$110,0),1)))","v":0},null,{"$f":"IF(ISNA(INDEX(Master!$D$40:$I$110,MATCH(V$5,Master!$I$40:$I$110,0),1)),0,(INDEX(Master!$D$40:$I$110,MATCH(V$5,Master!$I$40:$I$110,0),1)))","v":0},{"$f":"IF(ISNA(INDEX(Master!$D$40:$I$110,MATCH(W$5,Master!$I$40:$I$110,0),1)),0,(INDEX(Master!$D$40:$I$110,MATCH(W$5,Master!$I$40:$I$110,0),1)))","v":0},{"$f":"IF(ISNA(INDEX(Master!$D$40:$I$110,MATCH(X$5,Master!$I$40:$I$110,0),1)),0,(INDEX(Master!$D$40:$I$110,MATCH(X$5,Master!$I$40:$I$110,0),1)))","v":51612.903225806447},{"$f":"IF(ISNA(INDEX(Master!$D$40:$I$110,MATCH(Y$5,Master!$I$40:$I$110,0),1)),0,(INDEX(Master!$D$40:$I$110,MATCH(Y$5,Master!$I$40:$I$110,0),1)))","v":0},{"$f":"IF(ISNA(INDEX(Master!$D$40:$I$110,MATCH(Z$5,Master!$I$40:$I$110,0),1)),0,(INDEX(Master!$D$40:$I$110,MATCH(Z$5,Master!$I$40:$I$110,0),1)))","v":0},{"$f":"IF(ISNA(INDEX(Master!$D$40:$I$110,MATCH(AA$5,Master!$I$40:$I$110,0),1)),0,(INDEX(Master!$D$40:$I$110,MATCH(AA$5,Master!$I$40:$I$110,0),1)))","v":500},{"$f":"IF(ISNA(INDEX(Master!$D$40:$I$110,MATCH(AB$5,Master!$I$40:$I$110,0),1)),0,(INDEX(Master!$D$40:$I$110,MATCH(AB$5,Master!$I$40:$I$110,0),1)))","v":1880},{"$f":"IF(ISNA(INDEX(Master!$D$40:$I$110,MATCH(AC$5,Master!$I$40:$I$110,0),1)),0,(INDEX(Master!$D$40:$I$110,MATCH(AC$5,Master!$I$40:$I$110,0),1)))","v":0},{"$f":"IF(ISNA(INDEX(Master!$D$40:$I$110,MATCH(AD$5,Master!$I$40:$I$110,0),1)),0,(INDEX(Master!$D$40:$I$110,MATCH(AD$5,Master!$I$40:$I$110,0),1)))","v":400},null,4,5414.4851829433956,4536.1610273548386,878.32415558855701,28370.136617407181,27491.812461818623]
[null,5,{"$f":"(Energiepreisberechnung!C7)","v":7.209378055E-2},{"$f":"(Energiepreisberechnung!D7)","v":9.1755720700000001E-2},{"$f":"(Energiepreisberechnung!E7)","v":0.26215920200000004},{"$f":"(Energiepreisberechnung!F7)","v":0.11141766085},{"$f":"(Energiepreisberechnung!G7)","v":6.5539800500000009E-2},null,null,null,{"$f":"IF(ISNA(INDEX(Master!$D$40:$I$110,MATCH(K$5,Master!$I$40:$I$110,0),1)),0,(INDEX(Master!$D$40:$I$110,MATCH(K$5,Master!$I$40:$I$110,0),1)))","v":0},{"$f":"IF(ISNA(INDEX(Master!$D$40:$I$110,MATCH(L$5,Master!$I$40:$I$110,0),1)),0,(INDEX(Master!$D$40:$I$110,MATCH(L$5,Master!$I$40:$I$110,0),1)))","v":0},{"$f":"IF(ISNA(INDEX(Master!$D$40:$I$110,MATCH(M$5,Master!$I$40:$I$110,0),1)),0,(INDEX(Master!$D$40:$I$110,MATCH(M$5,Master!$I$40:$I$110,0),1)))","v":0},{"$f":"IF(ISNA(INDEX(Master!$D$40:$I$110,MATCH(N$5,Master!$I$40:$I$110,0),1)),0,(INDEX(Master!$D$40:$I$110,MATCH(N$5,Master!$I$40:$I$110,0),1)))","v":75471.698113207545},{"$f":"IF(ISNA(INDEX(Master!$D$40:$I$110,MATCH(O$5,Master!$I$40:$I$110,0),1)),0,(INDEX(Master!$D$40:$I$110,MATCH(O$5,Master!$I$40:$I$110,0),1)))","v":0},{"$f":"IF(ISNA(INDEX(Master!$D$40:$I$110,MATCH(P$5,Master!$I$40:$I$110,0),1)),0,(INDEX(Master!$D$40:$I$110,MATCH(P$5,Master!$I$40:$I$110,0),1)))","v":300},{"$f":"IF(ISNA(INDEX(Master!$D$40:$I$110,MATCH(Q$5,Master!$I$40:$I$110,0),1)),0,(INDEX(Master!$D$40:$I$110,MATCH(Q$5,Master!$I$40:$I$110,0),1)))","v":120},{"$f":"IF(ISNA(INDEX(Master!$D$40:$I$110,MATCH(R$5,Master!$I$40:$I$110,0),1)),0,(INDEX(Master!$D$40:$I$110,MATCH(R$5,Master!$I$40:$I$110,0),1)))","v":0},{"$f":"IF(ISNA(INDEX(Master!$D$40:$I$110,MATCH(S$5,Master!$I$40:$I$110,0),1)),0,(INDEX(Master!$D$40:$I$110,MATCH(S$5,Master!$I$40:$I$110,0),1)))","v":0},{"$f":"IF(ISNA(INDEX(Master!$D$40:$I$110,MATCH(T$5,Master!$I$40:$I$110,0),1)),0,(INDEX(Master!$D$40:$I$110,MATCH(T$5,Master!$I$40:$I$110,0),1)))","v":0},null,{"$f":"IF(ISNA(INDEX(Master!$D$40:$I$110,MATCH(V$5,Master!$I$40:$I$110,0),1)),0,(INDEX(Master!$D$40:$I$110,MATCH(V$5,Master!$I$40:$I$110,0),1)))","v":0},{"$f":"IF(ISNA(INDEX(Master!$D$40:$I$110,MATCH(W$5,Master!$I$40:$I$110,0),1)),0,(INDEX(Master!$D$40:$I$110,MATCH(W$5,Master!$I$40:$I$110,0),1)))","v":0},{"$f":"IF(ISNA(INDEX(Master!$D$40:$I$110,MATCH(X$5,Master!$I$40:$I$110,0),1)),0,(INDEX(Master!$D$40:$I$110,MATCH(X$5,Master!$I$40:$I$110,0),1)))","v":51612.903225806447},{"$f":"IF(ISNA(INDEX(Master!$D$40:$I$110,MATCH(Y$5,Master!$I$40:$I$110,0),1)),0,(INDEX(Master!$D$40:$I$110,MATCH(Y$5,Master!$I$40:$I$110,0),1)))","v":0},{"$f":"IF(ISNA(INDEX(Master!$D$40:$I$110,MATCH(Z$5,Master!$I$40:$I$110,0),1)),0,(INDEX(Master!$D$40:$I$110,MATCH(Z$5,Master!$I$40:$I$110,0),1)))","v":0},{"$f":"IF(ISNA(INDEX(Master!$D$40:$I$110,MATCH(AA$5,Master!$I$40:$I$110,0),1)),0,(INDEX(Master!$D$40:$I$110,MATCH(AA$5,Master!$I$40:$I$110,0),1)))","v":500},{"$f":"IF(ISNA(INDEX(Master!$D$40:$I$110,MATCH(AB$5,Master!$I$40:$I$110,0),1)),0,(INDEX(Master!$D$40:$I$110,MATCH(AB$5,Master!$I$40:$I$110,0),1)))","v":1880},{"$f":"IF(ISNA(INDEX(Master!$D$40:$I$110,MATCH(AC$5,Master!$I$40:$I$110,0),1)),0,(INDEX(Master!$D$40:$I$110,MATCH(AC$5,Master!$I$40:$I$110,0),1)))","v":0},{"$f":"IF(ISNA(INDEX(Master!$D$40:$I$110,MATCH(AD$5,Master!$I$40:$I$110,0),1)),0,(INDEX(Master!$D$40:$I$110,MATCH(AD$5,Master!$I$40:$I$110,0),1)))","v":400},null,5,5772.4991457494334,4818.6922992696773,953.80684647975613,27491.812461818623,26538.005615338865]
[null,6,{"$f":"(Energiepreisberechnung!C8)","v":7.7140345188500006E-2},{"$f":"(Energiepreisberechnung!D8)","v":9.8178621149E-2},{"$f":"(Energiepreisberechnung!E8)","v":0.28051034614000003},{"$f":"(Energiepreisberechnung!F8)","v":0.11921689710950001},{"$f":"(Energiepreisberechnung!G8)","v":7.0127586535000008E-2},null,null,null,{"$f":"IF(ISNA(INDEX(Master!$D$40:$I$110,MATCH(K$5,Master!$I$40:$I$110,0),1)),0,(INDEX(Master!$D$40:$I$110,MATCH(K$5,Master!$I$40:$I$110,0),1)))","v":0},{"$f":"IF(ISNA(INDEX(Master!$D$40:$I$110,MATCH(L$5,Master!$I$40:$I$110,0),1)),0,(INDEX(Master!$D$40:$I$110,MATCH(L$5,Master!$I$40:$I$110,0),1)))","v":0},{"$f":"IF(ISNA(INDEX(Master!$D$40:$I$110,MATCH(M$5,Master!$I$40:$I$110,0),1)),0,(INDEX(Master!$D$40:$I$110,MATCH(M$5,Master!$I$40:$I$110,0),1)))","v":0},{"$f":"IF(ISNA(INDEX(Master!$D$40:$I$110,MATCH(N$5,Master!$I$40:$I$110,0),1)),0,(INDEX(Master!$D$40:$I$110,MATCH(N$5,Master!$I$40:$I$110,0),1)))","v":75471.698113207545},{"$f":"IF(ISNA(INDEX(Master!$D$40:$I$110,MATCH(O$5,Master!$I$40:$I$110,0),1)),0,(INDEX(Master!$D$40:$I$110,MATCH(O$5,Master!$I$40:$I$110,0),1)))","v":0},{"$f":"IF(ISNA(INDEX(Master!$D$40:$I$110,MATCH(P$5,Master!$I$40:$I$110,0),1)),0,(INDEX(Master!$D$40:$I$110,MATCH(P$5,Master!$I$40:$I$110,0),1)))","v":300},{"$f":"IF(ISNA(INDEX(Master!$D$40:$I$110,MATCH(Q$5,Master!$I$40:$I$110,0),1)),0,(INDEX(Master!$D$40:$I$110,MATCH(Q$5,Master!$I$40:$I$110,0),1)))","v":120},{"$f":"IF(ISNA(INDEX(Master!$D$40:$I$110,MATCH(R$5,Master!$I$40:$I$110,0),1)),0,(INDEX(Master!$D$40:$I$110,MATCH(R$5,Master!$I$40:$I$110,0),1)))","v":0},{"$f":"IF(ISNA(INDEX(Master!$D$40:$I$110,MATCH(S$5,Master!$I$40:$I$110,0),1)),0,(INDEX(Master!$D$40:$I$110,MATCH(S$5,Master!$I$40:$I$110,0),1)))","v":0},{"$f":"IF(ISNA(INDEX(Master!$D$40:$I$110,MATCH(T$5,Master!$I$40:$I$110,0),1)),0,(INDEX(Master!$D$40:$I$110,MATCH(T$5,Master!$I$40:$I$110,0),1)))","v":0},null,{"$f":"IF(ISNA(INDEX(Master!$D$40:$I$110,MATCH(V$5,Master!$I$40:$I$110,0),1)),0,(INDEX(Master!$D$40:$I$110,MATCH(V$5,Master!$I$40:$I$110,0),1)))","v":0},{"$f":"IF(ISNA(INDEX(Master!$D$40:$I$110,MATCH(W$5,Master!$I$40:$I$110,0),1)),0,(INDEX(Master!$D$40:$I$110,MATCH(W$5,Master!$I$40:$I$110,0),1)))","v":0},{"$f":"IF(ISNA(INDEX(Master!$D$40:$I$110,MATCH(X$5,Master!$I$40:$I$110,0),1)),0,(INDEX(Master!$D$40:$I$110,MATCH(X$5,Master!$I$40:$I$110,0),1)))","v":51612.903225806447},{"$f":"IF(ISNA(INDEX(Master!$D$40:$I$110,MATCH(Y$5,Master!$I$40:$I$110,0),1)),0,(INDEX(Master!$D$40:$I$110,MATCH(Y$5,Master!$I$40:$I$110,0),1)))","v":0},{"$f":"IF(ISNA(INDEX(Master!$D$40:$I$110,MATCH(Z$5,Master!$I$40:$I$110,0),1)),0,(INDEX(Master!$D$40:$I$110,MATCH(Z$5,Master!$I$40:$I$110,0),1)))","v":0},{"$f":"IF(ISNA(INDEX(Master!$D$40:$I$110,MATCH(AA$5,Master!$I$40:$I$110,0),1)),0,(INDEX(Master!$D$40:$I$110,MATCH(AA$5,Master!$I$40:$I$110,0),1)))","v":500},{"$f":"IF(ISNA(INDEX(Master!$D$40:$I$110,MATCH(AB$5,Master!$I$40:$I$110,0),1)),0,(INDEX(Master!$D$40:$I$110,MATCH(AB$5,Master!$I$40:$I$110,0),1)))","v":1880},{"$f":"IF(ISNA(INDEX(Master!$D$40:$I$110,MATCH(AC$5,Master!$I$40:$I$110,0),1)),0,(INDEX(Master!$D$40:$I$110,MATCH(AC$5,Master!$I$40:$I$110,0),1)))","v":0},{"$f":"IF(ISNA(INDEX(Master!$D$40:$I$110,MATCH(AD$5,Master!$I$40:$I$110,0),1)),0,(INDEX(Master!$D$40:$I$110,MATCH(AD$5,Master!$I$40:$I$110,0),1)))","v":400},null,6,6155.5740859518946,5121.0007602185551,1034.5733257333395,26538.005615338865,25503.432289605524]
[null,7,{"$f":"(Energiepreisberechnung!C9)","v":8.2540169351695003E-2},{"$f":"(Energiepreisberechnung!D9)","v":0.10505112462943},{"$f":"(Energiepreisberechnung!E9)","v":0.30014607036980001},{"$f":"(Energiepreisberechnung!F9)","v":0.127562079907165},{"$f":"(Energiepreisberechnung!G9)","v":7.5036517592450003E-2},null,null,null,{"$f":"IF(ISNA(INDEX(Master!$D$40:$I$110,MATCH(K$5,Master!$I$40:$I$110,0),1)),0,(INDEX(Master!$D$40:$I$110,MATCH(K$5,Master!$I$40:$I$110,0),1)))","v":0},{"$f":"IF(ISNA(INDEX(Master!$D$40:$I$110,MATCH(L$5,Master!$I$40:$I$110,0),1)),0,(INDEX(Master!$D$40:$I$110,MATCH(L$5,Master!$I$40:$I$110,0),1)))","v":0},{"$f":"IF(ISNA(INDEX(Master!$D$40:$I$110,MATCH(M$5,Master!$I$40:$I$110,0),1)),0,(INDEX(Master!$D$40:$I$110,MATCH(M$5,Master!$I$40:$I$110,0),1)))","v":0},{"$f":"IF(ISNA(INDEX(Master!$D$40:$I$110,MATCH(N$5,Master!$I$40:$I$110,0),1)),0,(INDEX(Master!$D$40:$I$110,MATCH(N$5,Master!$I$40:$I$110,0),1)))","v":75471.698113207545},{"$f":"IF(ISNA(INDEX(Master!$D$40:$I$110,MATCH(O$5,Master!$I$40:$I$110,0),1)),0,(INDEX(Master!$D$40:$I$110,MATCH(O$5,Master!$I$40:$I$110,0),1)))","v":0},{"$f":"IF(ISNA(INDEX(Master!$D$40:$I$110,MATCH(P$5,Master!$I$40:$I$110,0),1)),0,(INDEX(Master!$D$40:$I$110,MATCH(P$5,Master!$I$40:$I$110,0),1)))","v":300},{"$f":"IF(ISNA(INDEX(Master!$D$40:$I$110,MATCH(Q$5,Master!$I$40:$I$110,0),1)),0,(INDEX(Master!$D$40:$I$110,MATCH(Q$5,Master!$I$40:$I$110,0),1)))","v":120},{"$f":"IF(ISNA(INDEX(Master!$D$40:$I$110,MATCH(R$5,Master!$I$40:$I$110,0),1)),0,(INDEX(Master!$D$40:$I$110,MATCH(R$5,Master!$I$40:$I$110,0),1)))","v":0},{"$f":"IF(ISNA(INDEX(Master!$D$40:$I$110,MATCH(S$5,Master!$I$40:$I$110,0),1)),0,(INDEX(Master!$D$40:$I$110,MATCH(S$5,Master!$I$40:$I$110,0),1)))","v":0},{"$f":"IF(ISNA(INDEX(Master!$D$40:$I$110,MATCH(T$5,Master!$I$40:$I$110,0),1)),0,(INDEX(Master!$D$40:$I$110,MATCH(T$5,Master!$I$40:$I$110,0),1)))","v":0},null,{"$f":"IF(ISNA(INDEX(Master!$D$40:$I$110,MATCH(V$5,Master!$I$40:$I$110,0),1)),0,(INDEX(Master!$D$40:$I$110,MATCH(V$5,Master!$I$40:$I$110,0),1)))","v":0},{"$f":"IF(ISNA(INDEX(Master!$D$40:$I$110,MATCH(W$5,Master!$I$40:$I$110,0),1)),0,(INDEX(Master!$D$40:$I$110,MATCH(W$5,Master!$I$40:$I$110,0),1)))","v":0},{"$f":"IF(ISNA(INDEX(Master!$D$40:$I$110,MATCH(X$5,Master!$I$40:$I$110,0),1)),0,(INDEX(Master!$D$40:$I$110,MATCH(X$5,Master!$I$40:$I$110,0),1)))","v":51612.903225806447},{"$f":"IF(ISNA(INDEX(Master!$D$40:$I$110,MATCH(Y$5,Master!$I$40:$I$110,0),1)),0,(INDEX(Master!$D$40:$I$110,MATCH(Y$5,Master!$I$40:$I$110,0),1)))","v":0},{"$f":"IF(ISNA(INDEX(Master!$D$40:$I$110,MATCH(Z$5,Master!$I$40:$I$110,0),1)),0,(INDEX(Master!$D$40:$I$110,MATCH(Z$5,Master!$I$40:$I$110,0),1)))","v":0},{"$f":"IF(ISNA(INDEX(Master!$D$40:$I$110,MATCH(AA$5,Master!$I$40:$I$110,0),1)),0,(INDEX(Master!$D$40:$I$110,MATCH(AA$5,Master!$I$40:$I$110,0),1)))","v":500},{"$f":"IF(ISNA(INDEX(Master!$D$40:$I$110,MATCH(AB$5,Master!$I$40:$I$110,0),1)),0,(INDEX(Master!$D$40:$I$110,MATCH(AB$5,Master!$I$40:$I$110,0),1)))","v":1880},{"$f":"IF(ISNA(INDEX(Master!$D$40:$I$110,MATCH(AC$5,Master!$I$40:$I$110,0),1)),0,(INDEX(Master!$D$40:$I$110,MATCH(AC$5,Master!$I$40:$I$110,0),1)))","v":0},{"$f":"IF(ISNA(INDEX(Master!$D$40:$I$110,MATCH(AD$5,Master!$I$40:$I$110,0),1)),0,(INDEX(Master!$D$40:$I$110,MATCH(AD$5,Master!$I$40:$I$110,0),1)))","v":400},null,7,6565.4642719685271,5444.4708134338534,1120.9934585346737,25503.432289605524,24382.438831070849]
[null,8,{"$f":"(Energiepreisberechnung!C10)","v":8.831798120631365E-2},{"$f":"(Energiepreisberechnung!D10)","v":0.11240470335349011},{"$f":"(Energiepreisberechnung!E10)","v":0.32115629529568601},{"$f":"(Energiepreisberechnung!F10)","v":0.13649142550066656},{"$f":"(Energiepreisberechnung!G10)","v":8.0289073823921503E-2},null,null,null,{"$f":"IF(ISNA(INDEX(Master!$D$40:$I$110,MATCH(K$5,Master!$I$40:$I$110,0),1)),0,(INDEX(Master!$D$40:$I$110,MATCH(K$5,Master!$I$40:$I$110,0),1)))","v":0},{"$f":"IF(ISNA(INDEX(Master!$D$40:$I$110,MATCH(L$5,Master!$I$40:$I$110,0),1)),0,(INDEX(Master!$D$40:$I$110,MATCH(L$5,Master!$I$40:$I$110,0),1)))","v":0},{"$f":"IF(ISNA(INDEX(Master!$D$40:$I$110,MATCH(M$5,Master!$I$40:$I$110,0),1)),0,(INDEX(Master!$D$40:$I$110,MATCH(M$5,Master!$I$40:$I$110,0),1)))","v":0},{"$f":"IF(ISNA(INDEX(Master!$D$40:$I$110,MATCH(N$5,Master!$I$40:$I$110,0),1)),0,(INDEX(Master!$D$40:$I$110,MATCH(N$5,Master!$I$40:$I$110,0),1)))","v":75471.698113207545},{"$f":"IF(ISNA(INDEX(Master!$D$40:$I$110,MATCH(O$5,Master!$I$40:$I$110,0),1)),0,(INDEX(Master!$D$40:$I$110,MATCH(O$5,Master!$I$40:$I$110,0),1)))","v":0},{"$f":"IF(ISNA(INDEX(Master!$D$40:$I$110,MATCH(P$5,Master!$I$40:$I$110,0),1)),0,(INDEX(Master!$D$40:$I$110,MATCH(P$5,Master!$I$40:$I$110,0),1)))","v":300},{"$f":"IF(ISNA(INDEX(Master!$D$40:$I$110,MATCH(Q$5,Master!$I$40:$I$110,0),1)),0,(INDEX(Master!$D$40:$I$110,MATCH(Q$5,Master!$I$40:$I$110,0),1)))","v":120},{"$f":"IF(ISNA(INDEX(Master!$D$40:$I$110,MATCH(R$5,Master!$I$40:$I$110,0),1)),0,(INDEX(Master!$D$40:$I$110,MATCH(R$5,Master!$I$40:$I$110,0),1)))","v":0},{"$f":"IF(ISNA(INDEX(Master!$D$40:$I$110,MATCH(S$5,Master!$I$40:$I$110,0),1)),0,(INDEX(Master!$D$40:$I$110,MATCH(S$5,Master!$I$40:$I$110,0),1)))","v":0},{"$f":"IF(ISNA(INDEX(Master!$D$40:$I$110,MATCH(T$5,Master!$I$40:$I$110,0),1)),0,(INDEX(Master!$D$40:$I$110,MATCH(T$5,Master!$I$40:$I$110,0),1)))","v":0},null,{"$f":"IF(ISNA(INDEX(Master!$D$40:$I$110,MATCH(V$5,Master!$I$40:$I$110,0),1)),0,(INDEX(Master!$D$40:$I$110,MATCH(V$5,Master!$I$40:$I$110,0),1)))","v":0},{"$f":"IF(ISNA(INDEX(Master!$D$40:$I$110,MATCH(W$5,Master!$I$40:$I$110,0),1)),0,(INDEX(Master!$D$40:$I$110,MATCH(W$5,Master!$I$40:$I$110,0),1)))","v":0},{"$f":"IF(ISNA(INDEX(Master!$D$40:$I$110,MATCH(X$5,Master!$I$40:$I$110,0),1)),0,(INDEX(Master!$D$40:$I$110,MATCH(X$5,Master!$I$40:$I$110,0),1)))","v":51612.903225806447},{"$f":"IF(ISNA(INDEX(Master!$D$40:$I$110,MATCH(Y$5,Master!$I$40:$I$110,0),1)),0,(INDEX(Master!$D$40:$I$110,MATCH(Y$5,Master!$I$40:$I$110,0),1)))","v":0},{"$f":"IF(ISNA(INDEX(Master!$D$40:$I$110,MATCH(Z$5,Master!$I$40:$I$110,0),1)),0,(INDEX(Master!$D$40:$I$110,MATCH(Z$5,Master!$I$40:$I$110,0),1)))","v":0},{"$f":"IF(ISNA(INDEX(Master!$D$40:$I$110,MATCH(AA$5,Master!$I$40:$I$110,0),1)),0,(INDEX(Master!$D$40:$I$110,MATCH(AA$5,Master!$I$40:$I$110,0),1)))","v":500},{"$f":"IF(ISNA(INDEX(Master!$D$40:$I$110,MATCH(AB$5,Master!$I$40:$I$110,0),1)),0,(INDEX(Master!$D$40:$I$110,MATCH(AB$5,Master!$I$40:$I$110,0),1)))","v":1880},{"$f":"IF(ISNA(INDEX(Master!$D$40:$I$110,MATCH(AC$5,Master!$I$40:$I$110,0),1)),0,(INDEX(Master!$D$40:$I$110,MATCH(AC$5,Master!$I$40:$I$110,0),1)))","v":0},{"$f":"IF(ISNA(INDEX(Master!$D$40:$I$110,MATCH(AD$5,Master!$I$40:$I$110,0),1)),0,(INDEX(Master!$D$40:$I$110,MATCH(AD$5,Master!$I$40:$I$110,0),1)))","v":400},null,8,7004.0467710063231,5790.5837703742236,1213.4630006320995,24382.438831070849,23168.975830438751]
[null,9,{"$f":"(Energiepreisberechnung!C11)","v":9.4500239890755608E-2},{"$f":"(Energiepreisberechnung!D11)","v":0.12027303258823441},{"$f":"(Energiepreisberechnung!E11)","v":0.34363723596638401},{"$f":"(Energiepreisberechnung!F11)","v":0.14604582528571322},{"$f":"(Energiepreisberechnung!G11)","v":8.5909308991596003E-2},null,null,null,{"$f":"IF(ISNA(INDEX(Master!$D$40:$I$110,MATCH(K$5,Master!$I$40:$I$110,0),1)),0,(INDEX(Master!$D$40:$I$110,MATCH(K$5,Master!$I$40:$I$110,0),1)))","v":0},{"$f":"IF(ISNA(INDEX(Master!$D$40:$I$110,MATCH(L$5,Master!$I$40:$I$110,0),1)),0,(INDEX(Master!$D$40:$I$110,MATCH(L$5,Master!$I$40:$I$110,0),1)))","v":0},{"$f":"IF(ISNA(INDEX(Master!$D$40:$I$110,MATCH(M$5,Master!$I$40:$I$110,0),1)),0,(INDEX(Master!$D$40:$I$110,MATCH(M$5,Master!$I$40:$I$110,0),1)))","v":0},{"$f":"IF(ISNA(INDEX(Master!$D$40:$I$110,MATCH(N$5,Master!$I$40:$I$110,0),1)),0,(INDEX(Master!$D$40:$I$110,MATCH(N$5,Master!$I$40:$I$110,0),1)))","v":75471.698113207545},{"$f":"IF(ISNA(INDEX(Master!$D$40:$I$110,MATCH(O$5,Master!$I$40:$I$110,0),1)),0,(INDEX(Master!$D$40:$I$110,MATCH(O$5,Master!$I$40:$I$110,0),1)))","v":0},{"$f":"IF(ISNA(INDEX(Master!$D$40:$I$110,MATCH(P$5,Master!$I$40:$I$110,0),1)),0,(INDEX(Master!$D$40:$I$110,MATCH(P$5,Master!$I$40:$I$110,0),1)))","v":300},{"$f":"IF(ISNA(INDEX(Master!$D$40:$I$110,MATCH(Q$5,Master!$I$40:$I$110,0),1)),0,(INDEX(Master!$D$40:$I$110,MATCH(Q$5,Master!$I$40:$I$110,0),1)))","v":120},{"$f":"IF(ISNA(INDEX(Master!$D$40:$I$110,MATCH(R$5,Master!$I$40:$I$110,0),1)),0,(INDEX(Master!$D$40:$I$110,MATCH(R$5,Master!$I$40:$I$110,0),1)))","v":0},{"$f":"IF(ISNA(INDEX(Master!$D$40:$I$110,MATCH(S$5,Master!$I$40:$I$110,0),1)),0,(INDEX(Master!$D$40:$I$110,MATCH(S$5,Master!$I$40:$I$110,0),1)))","v":0},{"$f":"IF(ISNA(INDEX(Master!$D$40:$I$110,MATCH(T$5,Master!$I$40:$I$110,0),1)),0,(INDEX(Master!$D$40:$I$110,MATCH(T$5,Master!$I$40:$I$110,0),1)))","v":0},null,{"$f":"IF(ISNA(INDEX(Master!$D$40:$I$110,MATCH(V$5,Master!$I$40:$I$110,0),1)),0,(INDEX(Master!$D$40:$I$110,MATCH(V$5,Master!$I$40:$I$110,0),1)))","v":0},{"$f":"IF(ISNA(INDEX(Master!$D$40:$I$110,MATCH(W$5,Master!$I$40:$I$110,0),1)),0,(INDEX(Master!$D$40:$I$110,MATCH(W$5,Master!$I$40:$I$110,0),1)))","v":0},{"$f":"IF(ISNA(INDEX(Master!$D$40:$I$110,MATCH(X$5,Master!$I$40:$I$110,0),1)),0,(INDEX(Master!$D$40:$I$110,MATCH(X$5,Master!$I$40:$I$110,0),1)))","v":51612.903225806447},{"$f":"IF(ISNA(INDEX(Master!$D$40:$I$110,MATCH(Y$5,Master!$I$40:$I$110,0),1)),0,(INDEX(Master!$D$40:$I$110,MATCH(Y$5,Master!$I$40:$I$110,0),1)))","v":0},{"$f":"IF(ISNA(INDEX(Master!$D$40:$I$110,MATCH(Z$5,Master!$I$40:$I$110,0),1)),0,(INDEX(Master!$D$40:$I$110,MATCH(Z$5,Master!$I$40:$I$110,0),1)))","v":0},{"$f":"IF(ISNA(INDEX(Master!$D$40:$I$110,MATCH(AA$5,Master!$I$40:$I$110,0),1)),0,(INDEX(Master!$D$40:$I$110,MATCH(AA$5,Master!$I$40:$I$110,0),1)))","v":500},{"$f":"IF(ISNA(INDEX(Master!$D$40:$I$110,MATCH(AB$5,Master!$I$40:$I$110,0),1)),0,(INDEX(Master!$D$40:$I$110,MATCH(AB$5,Master!$I$40:$I$110,0),1)))","v":1880},{"$f":"IF(ISNA(INDEX(Master!$D$40:$I$110,MATCH(AC$5,Master!$I$40:$I$110,0),1)),0,(INDEX(Master!$D$40:$I$110,MATCH(AC$5,Master!$I$40:$I$110,0),1)))","v":0},{"$f":"IF(ISNA(INDEX(Master!$D$40:$I$110,MATCH(AD$5,Master!$I$40:$I$110,0),1)),0,(INDEX(Master!$D$40:$I$110,MATCH(AD$5,Master!$I$40:$I$110,0),1)))","v":400},null,9,7473.3300449767667,6160.9246343004188,1312.4054106763479,23168.975830438751,21856.570419762404]
[null,10,{"$f":"(Energiepreisberechnung!C12)","v":0.1011152566831085},{"$f":"(Energiepreisberechnung!D12)","v":0.12869214486941083},{"$f":"(Energiepreisberechnung!E12)","v":0.36769184248403092},{"$f":"(Energiepreisberechnung!F12)","v":0.15626903305571316},{"$f":"(Energiepreisberechnung!G12)","v":9.1922960621007729E-2},null,null,null,{"$f":"IF(ISNA(INDEX(Master!$D$40:$I$110,MATCH(K$5,Master!$I$40:$I$110,0),1)),0,(INDEX(Master!$D$40:$I$110,MATCH(K$5,Master!$I$40:$I$110,0),1)))","v":0},{"$f":"IF(ISNA(INDEX(Master!$D$40:$I$110,MATCH(L$5,Master!$I$40:$I$110,0),1)),0,(INDEX(Master!$D$40:$I$110,MATCH(L$5,Master!$I$40:$I$110,0),1)))","v":0},{"$f":"IF(ISNA(INDEX(Master!$D$40:$I$110,MATCH(M$5,Master!$I$40:$I$110,0),1)),0,(INDEX(Master!$D$40:$I$110,MATCH(M$5,Master!$I$40:$I$110,0),1)))","v":0},{"$f":"IF(ISNA(INDEX(Master!$D$40:$I$110,MATCH(N$5,Master!$I$40:$I$110,0),1)),0,(INDEX(Master!$D$40:$I$110,MATCH(N$5,Master!$I$40:$I$110,0),1)))","v":75471.698113207545},{"$f":"IF(ISNA(INDEX(Master!$D$40:$I$110,MATCH(O$5,Master!$I$40:$I$110,0),1)),0,(INDEX(Master!$D$40:$I$110,MATCH(O$5,Master!$I$40:$I$110,0),1)))","v":0},{"$f":"IF(ISNA(INDEX(Master!$D$40:$I$110,MATCH(P$5,Master!$I$40:$I$110,0),1)),0,(INDEX(Master!$D$40:$I$110,MATCH(P$5,Master!$I$40:$I$110,0),1)))","v":300},{"$f":"IF(ISNA(INDEX(Master!$D$40:$I$110,MATCH(Q$5,Master!$I$40:$I$110,0),1)),0,(INDEX(Master!$D$40:$I$110,MATCH(Q$5,Master!$I$40:$I$110,0),1)))","v":120},{"$f":"IF(ISNA(INDEX(Master!$D$40:$I$110,MATCH(R$5,Master!$I$40:$I$110,0),1)),0,(INDEX(Master!$D$40:$I$110,MATCH(R$5,Master!$I$40:$I$110,0),1)))","v":0},{"$f":"IF(ISNA(INDEX(Master!$D$40:$I$110,MATCH(S$5,Master!$I$40:$I$110,0),1)),0,(INDEX(Master!$D$40:$I$110,MATCH(S$5,Master!$I$40:$I$110,0),1)))","v":0},{"$f":"IF(ISNA(INDEX(Master!$D$40:$I$110,MATCH(T$5,Master!$I$40:$I$110,0),1)),0,(INDEX(Master!$D$40:$I$110,MATCH(T$5,Master!$I$40:$I$110,0),1)))","v":0},null,{"$f":"IF(ISNA(INDEX(Master!$D$40:$I$110,MATCH(V$5,Master!$I$40:$I$110,0),1)),0,(INDEX(Master!$D$40:$I$110,MATCH(V$5,Master!$I$40:$I$110,0),1)))","v":0},{"$f":"IF(ISNA(INDEX(Master!$D$40:$I$110,MATCH(W$5,Master!$I$40:$I$110,0),1)),0,(INDEX(Master!$D$40:$I$110,MATCH(W$5,Master!$I$40:$I$110,0),1)))","v":0},{"$f":"IF(ISNA(INDEX(Master!$D$40:$I$110,MATCH(X$5,Master!$I$40:$I$110,0),1)),0,(INDEX(Master!$D$40:$I$110,MATCH(X$5,Master!$I$40:$I$110,0),1)))","v":51612.903225806447},{"$f":"IF(ISNA(INDEX(Master!$D$40:$I$110,MATCH(Y$5,Master!$I$40:$I$110,0),1)),0,(INDEX(Master!$D$40:$I$110,MATCH(Y$5,Master!$I$40:$I$110,0),1)))","v":0},{"$f":"IF(ISNA(INDEX(Master!$D$40:$I$110,MATCH(Z$5,Master!$I$40:$I$110,0),1)),0,(INDEX(Master!$D$40:$I$110,MATCH(Z$5,Master!$I$40:$I$110,0),1)))","v":0},{"$f":"IF(ISNA(INDEX(Master!$D$40:$I$110,MATCH(AA$5,Master!$I$40:$I$110,0),1)),0,(INDEX(Master!$D$40:$I$110,MATCH(AA$5,Master!$I$40:$I$110,0),1)))","v":500},{"$f":"IF(ISNA(INDEX(Master!$D$40:$I$110,MATCH(AB$5,Master!$I$40:$I$110,0),1)),0,(INDEX(Master!$D$40:$I$110,MATCH(AB$5,Master!$I$40:$I$110,0),1)))","v":1880},{"$f":"IF(ISNA(INDEX(Master!$D$40:$I$110,MATCH(AC$5,Master!$I$40:$I$110,0),1)),0,(INDEX(Master!$D$40:$I$110,MATCH(AC$5,Master!$I$40:$I$110,0),1)))","v":0},{"$f":"IF(ISNA(INDEX(Master!$D$40:$I$110,MATCH(AD$5,Master!$I$40:$I$110,0),1)),0,(INDEX(Master!$D$40:$I$110,MATCH(AD$5,Master!$I$40:$I$110,0),1)))","v":400},null,10,7975.4631481251399,6557.1893587014474,1418.2737894236925,21856.570419762404,20438.296630338711]
[null,11,{"$f":"(Energiepreisberechnung!C13)","v":0.1081933246509261},{"$f":"(Energiepreisberechnung!D13)","v":0.1377005950102696},{"$f":"(Energiepreisberechnung!E13)","v":0.39343027145791309},{"$f":"(Energiepreisberechnung!F13)","v":0.16720786536961307},{"$f":"(Energiepreisberechnung!G13)","v":9.8357567864478274E-2},null,null,null,{"$f":"IF(ISNA(INDEX(Master!$D$40:$I$110,MATCH(K$5,Master!$I$40:$I$110,0),1)),0,(INDEX(Master!$D$40:$I$110,MATCH(K$5,Master!$I$40:$I$110,0),1)))","v":0},{"$f":"IF(ISNA(INDEX(Master!$D$40:$I$110,MATCH(L$5,Master!$I$40:$I$110,0),1)),0,(INDEX(Master!$D$40:$I$110,MATCH(L$5,Master!$I$40:$I$110,0),1)))","v":0},{"$f":"IF(ISNA(INDEX(Master!$D$40:$I$110,MATCH(M$5,Master!$I$40:$I$110,0),1)),0,(INDEX(Master!$D$40:$I$110,MATCH(M$5,Master!$I$40:$I$110,0),1)))","v":0},{"$f":"IF(ISNA(INDEX(Master!$D$40:$I$110,MATCH(N$5,Master!$I$40:$I$110,0),1)),0,(INDEX(Master!$D$40:$I$110,MATCH(N$5,Master!$I$40:$I$110,0),1)))","v":75471.698113207545},{"$f":"IF(ISNA(INDEX(Master!$D$40:$I$110,MATCH(O$5,Master!$I$40:$I$110,0),1)),0,(INDEX(Master!$D$40:$I$110,MATCH(O$5,Master!$I$40:$I$110,0),1)))","v":0},{"$f":"IF(ISNA(INDEX(Master!$D$40:$I$110,MATCH(P$5,Master!$I$40:$I$110,0),1)),0,(INDEX(Master!$D$40:$I$110,MATCH(P$5,Master!$I$40:$I$110,0),1)))","v":300},{"$f":"IF(ISNA(INDEX(Master!$D$40:$I$110,MATCH(Q$5,Master!$I$40:$I$110,0),1)),0,(INDEX(Master!$D$40:$I$110,MATCH(Q$5,Master!$I$40:$I$110,0),1)))","v":120},{"$f":"IF(ISNA(INDEX(Master!$D$40:$I$110,MATCH(R$5,Master!$I$40:$I$110,0),1)),0,(INDEX(Master!$D$40:$I$110,MATCH(R$5,Master!$I$40:$I$110,0),1)))","v":0},{"$f":"IF(ISNA(INDEX(Master!$D$40:$I$110,MATCH(S$5,Master!$I$40:$I$110,0),1)),0,(INDEX(Master!$D$40:$I$110,MATCH(S$5,Master!$I$40:$I$110,0),1)))","v":0},{"$f":"IF(ISNA(INDEX(Master!$D$40:$I$110,MATCH(T$5,Master!$I$40:$I$110,0),1)),0,(INDEX(Master!$D$40:$I$110,MATCH(T$5,Master!$I$40:$I$110,0),1)))","v":0},null,{"$f":"IF(ISNA(INDEX(Master!$D$40:$I$110,MATCH(V$5,Master!$I$40:$I$110,0),1)),0,(INDEX(Master!$D$40:$I$110,MATCH(V$5,Master!$I$40:$I$110,0),1)))","v":0},{"$f":"IF(ISNA(INDEX(Master!$D$40:$I$110,MATCH(W$5,Master!$I$40:$I$110,0),1)),0,(INDEX(Master!$D$40:$I$110,MATCH(W$5,Master!$I$40:$I$110,0),1)))","v":0},{"$f":"IF(ISNA(INDEX(Master!$D$40:$I$110,MATCH(X$5,Master!$I$40:$I$110,0),1)),0,(INDEX(Master!$D$40:$I$110,MATCH(X$5,Master!$I$40:$I$110,0),1)))","v":51612.903225806447},{"$f":"IF(ISNA(INDEX(Master!$D$40:$I$110,MATCH(Y$5,Master!$I$40:$I$110,0),1)),0,(INDEX(Master!$D$40:$I$110,MATCH(Y$5,Master!$I$40:$I$110,0),1)))","v":0},{"$f":"IF(ISNA(INDEX(Master!$D$40:$I$110,MATCH(Z$5,Master!$I$40:$I$110,0),1)),0,(INDEX(Master!$D$40:$I$110,MATCH(Z$5,Master!$I$40:$I$110,0),1)))","v":0},{"$f":"IF(ISNA(INDEX(Master!$D$40:$I$110,MATCH(AA$5,Master!$I$40:$I$110,0),1)),0,(INDEX(Master!$D$40:$I$110,MATCH(AA$5,Master!$I$40:$I$110,0),1)))","v":500},{"$f":"IF(ISNA(INDEX(Master!$D$40:$I$110,MATCH(AB$5,Master!$I$40:$I$110,0),1)),0,(INDEX(Master!$D$40:$I$110,MATCH(AB$5,Master!$I$40:$I$110,0),1)))","v":1880},{"$f":"IF(ISNA(INDEX(Master!$D$40:$I$110,MATCH(AC$5,Master!$I$40:$I$110,0),1)),0,(INDEX(Master!$D$40:$I$110,MATCH(AC$5,Master!$I$40:$I$110,0),1)))","v":0},{"$f":"IF(ISNA(INDEX(Master!$D$40:$I$110,MATCH(AD$5,Master!$I$40:$I$110,0),1)),0,(INDEX(Master!$D$40:$I$110,MATCH(AD$5,Master!$I$40:$I$110,0),1)))","v":400},null,11,8512.7455684938996,6981.1926138105491,1531.5529546833504,20438.296630338711,18906.743675655362]
[null,12,{"$f":"(Energiepreisberechnung!C14)","v":0.11576685737649092},{"$f":"(Energiepreisberechnung!D14)","v":0.14733963666098848},{"$f":"(Energiepreisberechnung!E14)","v":0.42097039045996704},{"$f":"(Energiepreisberechnung!F14)","v":0.17891241594548599},{"$f":"(Energiepreisberechnung!G14)","v":0.10524259761499176},null,null,null,{"$f":"IF(ISNA(INDEX(Master!$D$40:$I$110,MATCH(K$5,Master!$I$40:$I$110,0),1)),0,(INDEX(Master!$D$40:$I$110,MATCH(K$5,Master!$I$40:$I$110,0),1)))","v":0},{"$f":"IF(ISNA(INDEX(Master!$D$40:$I$110,MATCH(L$5,Master!$I$40:$I$110,0),1)),0,(INDEX(Master!$D$40:$I$110,MATCH(L$5,Master!$I$40:$I$110,0),1)))","v":0},{"$f":"IF(ISNA(INDEX(Master!$D$40:$I$110,MATCH(M$5,Master!$I$40:$I$110,0),1)),0,(INDEX(Master!$D$40:$I$110,MATCH(M$5,Master!$I$40:$I$110,0),1)))","v":0},{"$f":"IF(ISNA(INDEX(Master!$D$40:$I$110,MATCH(N$5,Master!$I$40:$I$110,0),1)),0,(INDEX(Master!$D$40:$I$110,MATCH(N$5,Master!$I$40:$I$110,0),1)))","v":75471.698113207545},{"$f":"IF(ISNA(INDEX(Master!$D$40:$I$110,MATCH(O$5,Master!$I$40:$I$110,0),1)),0,(INDEX(Master!$D$40:$I$110,MATCH(O$5,Master!$I$40:$I$110,0),1)))","v":0},{"$f":"IF(ISNA(INDEX(Master!$D$40:$I$110,MATCH(P$5,Master!$I$40:$I$110,0),1)),0,(INDEX(Master!$D$40:$I$110,MATCH(P$5,Master!$I$40:$I$110,0),1)))","v":300},{"$f":"IF(ISNA(INDEX(Master!$D$40:$I$110,MATCH(Q$5,Master!$I$40:$I$110,0),1)),0,(INDEX(Master!$D$40:$I$110,MATCH(Q$5,Master!$I$40:$I$110,0),1)))","v":120},{"$f":"IF(ISNA(INDEX(Master!$D$40:$I$110,MATCH(R$5,Master!$I$40:$I$110,0),1)),0,(INDEX(Master!$D$40:$I$110,MATCH(R$5,Master!$I$40:$I$110,0),1)))","v":0},{"$f":"IF(ISNA(INDEX(Master!$D$40:$I$110,MATCH(S$5,Master!$I$40:$I$110,0),1)),0,(INDEX(Master!$D$40:$I$110,MATCH(S$5,Master!$I$40:$I$110,0),1)))","v":0},{"$f":"IF(ISNA(INDEX(Master!$D$40:$I$110,MATCH(T$5,Master!$I$40:$I$110,0),1)),0,(INDEX(Master!$D$40:$I$110,MATCH(T$5,Master!$I$40:$I$110,0),1)))","v":0},null,{"$f":"IF(ISNA(INDEX(Master!$D$40:$I$110,MATCH(V$5,Master!$I$40:$I$110,0),1)),0,(INDEX(Master!$D$40:$I$110,MATCH(V$5,Master!$I$40:$I$110,0),1)))","v":0},{"$f":"IF(ISNA(INDEX(Master!$D$40:$I$110,MATCH(W$5,Master!$I$40:$I$110,0),1)),0,(INDEX(Master!$D$40:$I$110,MATCH(W$5,Master!$I$40:$I$110,0),1)))","v":0},{"$f":"IF(ISNA(INDEX(Master!$D$40:$I$110,MATCH(X$5,Master!$I$40:$I$110,0),1)),0,(INDEX(Master!$D$40:$I$110,MATCH(X$5,Master!$I$40:$I$110,0),1)))","v":51612.903225806447},{"$f":"IF(ISNA(INDEX(Master!$D$40:$I$110,MATCH(Y$5,Master!$I$40:$I$110,0),1)),0,(INDEX(Master!$D$40:$I$110,MATCH(Y$5,Master!$I$40:$I$110,0),1)))","v":0},{"$f":"IF(ISNA(INDEX(Master!$D$40:$I$110,MATCH(Z$5,Master!$I$40:$I$110,0),1)),0,(INDEX(Master!$D$40:$I$110,MATCH(Z$5,Master!$I$40:$I$110,0),1)))","v":0},{"$f":"IF(ISNA(INDEX(Master!$D$40:$I$110,MATCH(AA$5,Master!$I$40:$I$110,0),1)),0,(INDEX(Master!$D$40:$I$110,MATCH(AA$5,Master!$I$40:$I$110,0),1)))","v":500},{"$f":"IF(ISNA(INDEX(Master!$D$40:$I$110,MATCH(AB$5,Master!$I$40:$I$110,0),1)),0,(INDEX(Master!$D$40:$I$110,MATCH(AB$5,Master!$I$40:$I$110,0),1)))","v":1880},{"$f":"IF(ISNA(INDEX(Master!$D$40:$I$110,MATCH(AC$5,Master!$I$40:$I$110,0),1)),0,(INDEX(Master!$D$40:$I$110,MATCH(AC$5,Master!$I$40:$I$110,0),1)))","v":0},{"$f":"IF(ISNA(INDEX(Master!$D$40:$I$110,MATCH(AD$5,Master!$I$40:$I$110,0),1)),0,(INDEX(Master!$D$40:$I$110,MATCH(AD$5,Master!$I$40:$I$110,0),1)))","v":400},null,12,9087.6377582884725,7434.8760967772887,1652.7616615111838,18906.743675655362,17253.982014144178]
[null,13,{"$f":"(Energiepreisberechnung!C15)","v":0.12387053739284529},{"$f":"(Energiepreisberechnung!D15)","v":0.15765341122725768},{"$f":"(Energiepreisberechnung!E15)","v":0.45043831779216476},{"$f":"(Energiepreisberechnung!F15)","v":0.19143628506167001},{"$f":"(Energiepreisberechnung!G15)","v":0.11260957944804119},null,null,null,{"$f":"IF(ISNA(INDEX(Master!$D$40:$I$110,MATCH(K$5,Master!$I$40:$I$110,0),1)),0,(INDEX(Master!$D$40:$I$110,MATCH(K$5,Master!$I$40:$I$110,0),1)))","v":0},{"$f":"IF(ISNA(INDEX(Master!$D$40:$I$110,MATCH(L$5,Master!$I$40:$I$110,0),1)),0,(INDEX(Master!$D$40:$I$110,MATCH(L$5,Master!$I$40:$I$110,0),1)))","v":0},{"$f":"IF(ISNA(INDEX(Master!$D$40:$I$110,MATCH(M$5,Master!$I$40:$I$110,0),1)),0,(INDEX(Master!$D$40:$I$110,MATCH(M$5,Master!$I$40:$I$110,0),1)))","v":0},{"$f":"IF(ISNA(INDEX(Master!$D$40:$I$110,MATCH(N$5,Master!$I$40:$I$110,0),1)),0,(INDEX(Master!$D$40:$I$110,MATCH(N$5,Master!$I$40:$I$110,0),1)))","v":75471.698113207545},{"$f":"IF(ISNA(INDEX(Master!$D$40:$I$110,MATCH(O$5,Master!$I$40:$I$110,0),1)),0,(INDEX(Master!$D$40:$I$110,MATCH(O$5,Master!$I$40:$I$110,0),1)))","v":0},{"$f":"IF(ISNA(INDEX(Master!$D$40:$I$110,MATCH(P$5,Master!$I$40:$I$110,0),1)),0,(INDEX(Master!$D$40:$I$110,MATCH(P$5,Master!$I$40:$I$110,0),1)))","v":300},{"$f":"IF(ISNA(INDEX(Master!$D$40:$I$110,MATCH(Q$5,Master!$I$40:$I$110,0),1)),0,(INDEX(Master!$D$40:$I$110,MATCH(Q$5,Master!$I$40:$I$110,0),1)))","v":120},{"$f":"IF(ISNA(INDEX(Master!$D$40:$I$110,MATCH(R$5,Master!$I$40:$I$110,0),1)),0,(INDEX(Master!$D$40:$I$110,MATCH(R$5,Master!$I$40:$I$110,0),1)))","v":0},{"$f":"IF(ISNA(INDEX(Master!$D$40:$I$110,MATCH(S$5,Master!$I$40:$I$110,0),1)),0,(INDEX(Master!$D$40:$I$110,MATCH(S$5,Master!$I$40:$I$110,0),1)))","v":0},{"$f":"IF(ISNA(INDEX(Master!$D$40:$I$110,MATCH(T$5,Master!$I$40:$I$110,0),1)),0,(INDEX(Master!$D$40:$I$110,MATCH(T$5,Master!$I$40:$I$110,0),1)))","v":0},null,{"$f":"IF(ISNA(INDEX(Master!$D$40:$I$110,MATCH(V$5,Master!$I$40:$I$110,0),1)),0,(INDEX(Master!$D$40:$I$110,MATCH(V$5,Master!$I$40:$I$110,0),1)))","v":0},{"$f":"IF(ISNA(INDEX(Master!$D$40:$I$110,MATCH(W$5,Master!$I$40:$I$110,0),1)),0,(INDEX(Master!$D$40:$I$110,MATCH(W$5,Master!$I$40:$I$110,0),1)))","v":0},{"$f":"IF(ISNA(INDEX(Master!$D$40:$I$110,MATCH(X$5,Master!$I$40:$I$110,0),1)),0,(INDEX(Master!$D$40:$I$110,MATCH(X$5,Master!$I$40:$I$110,0),1)))","v":51612.903225806447},{"$f":"IF(ISNA(INDEX(Master!$D$40:$I$110,MATCH(Y$5,Master!$I$40:$I$110,0),1)),0,(INDEX(Master!$D$40:$I$110,MATCH(Y$5,Master!$I$40:$I$110,0),1)))","v":0},{"$f":"IF(ISNA(INDEX(Master!$D$40:$I$110,MATCH(Z$5,Master!$I$40:$I$110,0),1)),0,(INDEX(Master!$D$40:$I$110,MATCH(Z$5,Master!$I$40:$I$110,0),1)))","v":0},{"$f":"IF(ISNA(INDEX(Master!$D$40:$I$110,MATCH(AA$5,Master!$I$40:$I$110,0),1)),0,(INDEX(Master!$D$40:$I$110,MATCH(AA$5,Master!$I$40:$I$110,0),1)))","v":500},{"$f":"IF(ISNA(INDEX(Master!$D$40:$I$110,MATCH(AB$5,Master!$I$40:$I$110,0),1)),0,(INDEX(Master!$D$40:$I$110,MATCH(AB$5,Master!$I$40:$I$110,0),1)))","v":1880},{"$f":"IF(ISNA(INDEX(Master!$D$40:$I$110,MATCH(AC$5,Master!$I$40:$I$110,0),1)),0,(INDEX(Master!$D$40:$I$110,MATCH(AC$5,Master!$I$40:$I$110,0),1)))","v":0},{"$f":"IF(ISNA(INDEX(Master!$D$40:$I$110,MATCH(AD$5,Master!$I$40:$I$110,0),1)),0,(INDEX(Master!$D$40:$I$110,MATCH(AD$5,Master!$I$40:$I$110,0),1)))","v":400},null,13,9702.7724013686657,7920.3174235516981,1782.4549778169676,17253.982014144178,15471.52703632721]
[null,14,{"$f":"(Energiepreisberechnung!C16)","v":0.13254147501034447},{"$f":"(Energiepreisberechnung!D16)","v":0.16868915001316573},{"$f":"(Energiepreisberechnung!E16)","v":0.48196900003761628},{"$f":"(Energiepreisberechnung!F16)","v":0.20483682501598691},{"$f":"(Energiepreisberechnung!G16)","v":0.12049225000940407},null,null,null,{"$f":"IF(ISNA(INDEX(Master!$D$40:$I$110,MATCH(K$5,Master!$I$40:$I$110,0),1)),0,(INDEX(Master!$D$40:$I$110,MATCH(K$5,Master!$I$40:$I$110,0),1)))","v":0},{"$f":"IF(ISNA(INDEX(Master!$D$40:$I$110,MATCH(L$5,Master!$I$40:$I$110,0),1)),0,(INDEX(Master!$D$40:$I$110,MATCH(L$5,Master!$I$40:$I$110,0),1)))","v":0},{"$f":"IF(ISNA(INDEX(Master!$D$40:$I$110,MATCH(M$5,Master!$I$40:$I$110,0),1)),0,(INDEX(Master!$D$40:$I$110,MATCH(M$5,Master!$I$40:$I$110,0),1)))","v":0},{"$f":"IF(ISNA(INDEX(Master!$D$40:$I$110,MATCH(N$5,Master!$I$40:$I$110,0),1)),0,(INDEX(Master!$D$40:$I$110,MATCH(N$5,Master!$I$40:$I$110,0),1)))","v":75471.698113207545},{"$f":"IF(ISNA(INDEX(Master!$D$40:$I$110,MATCH(O$5,Master!$I$40:$I$110,0),1)),0,(INDEX(Master!$D$40:$I$110,MATCH(O$5,Master!$I$40:$I$110,0),1)))","v":0},{"$f":"IF(ISNA(INDEX(Master!$D$40:$I$110,MATCH(P$5,Master!$I$40:$I$110,0),1)),0,(INDEX(Master!$D$40:$I$110,MATCH(P$5,Master!$I$40:$I$110,0),1)))","v":300},{"$f":"IF(ISNA(INDEX(Master!$D$40:$I$110,MATCH(Q$5,Master!$I$40:$I$110,0),1)),0,(INDEX(Master!$D$40:$I$110,MATCH(Q$5,Master!$I$40:$I$110,0),1)))","v":120},{"$f":"IF(ISNA(INDEX(Master!$D$40:$I$110,MATCH(R$5,Master!$I$40:$I$110,0),1)),0,(INDEX(Master!$D$40:$I$110,MATCH(R$5,Master!$I$40:$I$110,0),1)))","v":0},{"$f":"IF(ISNA(INDEX(Master!$D$40:$I$110,MATCH(S$5,Master!$I$40:$I$110,0),1)),0,(INDEX(Master!$D$40:$I$110,MATCH(S$5,Master!$I$40:$I$110,0),1)))","v":0},{"$f":"IF(ISNA(INDEX(Master!$D$40:$I$110,MATCH(T$5,Master!$I$40:$I$110,0),1)),0,(INDEX(Master!$D$40:$I$110,MATCH(T$5,Master!$I$40:$I$110,0),1)))","v":0},null,{"$f":"IF(ISNA(INDEX(Master!$D$40:$I$110,MATCH(V$5,Master!$I$40:$I$110,0),1)),0,(INDEX(Master!$D$40:$I$110,MATCH(V$5,Master!$I$40:$I$110,0),1)))","v":0},{"$f":"IF(ISNA(INDEX(Master!$D$40:$I$110,MATCH(W$5,Master!$I$40:$I$110,0),1)),0,(INDEX(Master!$D$40:$I$110,MATCH(W$5,Master!$I$40:$I$110,0),1)))","v":0},{"$f":"IF(ISNA(INDEX(Master!$D$40:$I$110,MATCH(X$5,Master!$I$40:$I$110,0),1)),0,(INDEX(Master!$D$40:$I$110,MATCH(X$5,Master!$I$40:$I$110,0),1)))","v":51612.903225806447},{"$f":"IF(ISNA(INDEX(Master!$D$40:$I$110,MATCH(Y$5,Master!$I$40:$I$110,0),1)),0,(INDEX(Master!$D$40:$I$110,MATCH(Y$5,Master!$I$40:$I$110,0),1)))","v":0},{"$f":"IF(ISNA(INDEX(Master!$D$40:$I$110,MATCH(Z$5,Master!$I$40:$I$110,0),1)),0,(INDEX(Master!$D$40:$I$110,MATCH(Z$5,Master!$I$40:$I$110,0),1)))","v":0},{"$f":"IF(ISNA(INDEX(Master!$D$40:$I$110,MATCH(AA$5,Master!$I$40:$I$110,0),1)),0,(INDEX(Master!$D$40:$I$110,MATCH(AA$5,Master!$I$40:$I$110,0),1)))","v":500},{"$f":"IF(ISNA(INDEX(Master!$D$40:$I$110,MATCH(AB$5,Master!$I$40:$I$110,0),1)),0,(INDEX(Master!$D$40:$I$110,MATCH(AB$5,Master!$I$40:$I$110,0),1)))","v":1880},{"$f":"IF(ISNA(INDEX(Master!$D$40:$I$110,MATCH(AC$5,Master!$I$40:$I$110,0),1)),0,(INDEX(Master!$D$40:$I$110,MATCH(AC$5,Master!$I$40:$I$110,0),1)))","v":0},{"$f":"IF(ISNA(INDEX(Master!$D$40:$I$110,MATCH(AD$5,Master!$I$40:$I$110,0),1)),0,(INDEX(Master!$D$40:$I$110,MATCH(AD$5,Master!$I$40:$I$110,0),1)))","v":400},null,14,10360.966469464474,8439.739643200317,1921.2268262641574,15471.52703632721,13550.300210063053]
[null,15,{"$f":"(Energiepreisberechnung!C17)","v":0.14181937826106858},{"$f":"(Energiepreisberechnung!D17)","v":0.18049739051408734},{"$f":"(Energiepreisberechnung!E17)","v":0.51570683004024942},{"$f":"(Energiepreisberechnung!F17)","v":0.21917540276710598},{"$f":"(Energiepreisberechnung!G17)","v":0.12892670751006235},null,null,null,{"$f":"IF(ISNA(INDEX(Master!$D$40:$I$110,MATCH(K$5,Master!$I$40:$I$110,0),1)),0,(INDEX(Master!$D$40:$I$110,MATCH(K$5,Master!$I$40:$I$110,0),1)))","v":0},{"$f":"IF(ISNA(INDEX(Master!$D$40:$I$110,MATCH(L$5,Master!$I$40:$I$110,0),1)),0,(INDEX(Master!$D$40:$I$110,MATCH(L$5,Master!$I$40:$I$110,0),1)))","v":0},{"$f":"IF(ISNA(INDEX(Master!$D$40:$I$110,MATCH(M$5,Master!$I$40:$I$110,0),1)),0,(INDEX(Master!$D$40:$I$110,MATCH(M$5,Master!$I$40:$I$110,0),1)))","v":0},{"$f":"IF(ISNA(INDEX(Master!$D$40:$I$110,MATCH(N$5,Master!$I$40:$I$110,0),1)),0,(INDEX(Master!$D$40:$I$110,MATCH(N$5,Master!$I$40:$I$110,0),1)))","v":75471.698113207545},{"$f":"IF(ISNA(INDEX(Master!$D$40:$I$110,MATCH(O$5,Master!$I$40:$I$110,0),1)),0,(INDEX(Master!$D$40:$I$110,MATCH(O$5,Master!$I$40:$I$110,0),1)))","v":0},{"$f":"IF(ISNA(INDEX(Master!$D$40:$I$110,MATCH(P$5,Master!$I$40:$I$110,0),1)),0,(INDEX(Master!$D$40:$I$110,MATCH(P$5,Master!$I$40:$I$110,0),1)))","v":300},{"$f":"IF(ISNA(INDEX(Master!$D$40:$I$110,MATCH(Q$5,Master!$I$40:$I$110,0),1)),0,(INDEX(Master!$D$40:$I$110,MATCH(Q$5,Master!$I$40:$I$110,0),1)))","v":120},{"$f":"IF(ISNA(INDEX(Master!$D$40:$I$110,MATCH(R$5,Master!$I$40:$I$110,0),1)),0,(INDEX(Master!$D$40:$I$110,MATCH(R$5,Master!$I$40:$I$110,0),1)))","v":0},{"$f":"IF(ISNA(INDEX(Master!$D$40:$I$110,MATCH(S$5,Master!$I$40:$I$110,0),1)),0,(INDEX(Master!$D$40:$I$110,MATCH(S$5,Master!$I$40:$I$110,0),1)))","v":0},{"$f":"IF(ISNA(INDEX(Master!$D$40:$I$110,MATCH(T$5,Master!$I$40:$I$110,0),1)),0,(INDEX(Master!$D$40:$I$110,MATCH(T$5,Master!$I$40:$I$110,0),1)))","v":0},null,{"$f":"IF(ISNA(INDEX(Master!$D$40:$I$110,MATCH(V$5,Master!$I$40:$I$110,0),1)),0,(INDEX(Master!$D$40:$I$110,MATCH(V$5,Master!$I$40:$I$110,0),1)))","v":0},{"$f":"IF(ISNA(INDEX(Master!$D$40:$I$110,MATCH(W$5,Master!$I$40:$I$110,0),1)),0,(INDEX(Master!$D$40:$I$110,MATCH(W$5,Master!$I$40:$I$110,0),1)))","v":0},{"$f":"IF(ISNA(INDEX(Master!$D$40:$I$110,MATCH(X$5,Master!$I$40:$I$110,0),1)),0,(INDEX(Master!$D$40:$I$110,MATCH(X$5,Master!$I$40:$I$110,0),1)))","v":51612.903225806447},{"$f":"IF(ISNA(INDEX(Master!$D$40:$I$110,MATCH(Y$5,Master!$I$40:$I$110,0),1)),0,(INDEX(Master!$D$40:$I$110,MATCH(Y$5,Master!$I$40:$I$110,0),1)))","v":0},{"$f":"IF(ISNA(INDEX(Master!$D$40:$I$110,MATCH(Z$5,Master!$I$40:$I$110,0),1)),0,(INDEX(Master!$D$40:$I$110,MATCH(Z$5,Master!$I$40:$I$110,0),1)))","v":0},{"$f":"IF(ISNA(INDEX(Master!$D$40:$I$110,MATCH(AA$5,Master!$I$40:$I$110,0),1)),0,(INDEX(Master!$D$40:$I$110,MATCH(AA$5,Master!$I$40:$I$110,0),1)))","v":500},{"$f":"IF(ISNA(INDEX(Master!$D$40:$I$110,MATCH(AB$5,Master!$I$40:$I$110,0),1)),0,(INDEX(Master!$D$40:$I$110,MATCH(AB$5,Master!$I$40:$I$110,0),1)))","v":1880},{"$f":"IF(ISNA(INDEX(Master!$D$40:$I$110,MATCH(AC$5,Master!$I$40:$I$110,0),1)),0,(INDEX(Master!$D$40:$I$110,MATCH(AC$5,Master!$I$40:$I$110,0),1)))","v":0},{"$f":"IF(ISNA(INDEX(Master!$D$40:$I$110,MATCH(AD$5,Master!$I$40:$I$110,0),1)),0,(INDEX(Master!$D$40:$I$110,MATCH(AD$5,Master!$I$40:$I$110,0),1)))","v":400},null,15,11065.234122326987,8995.5214182243399,2069.712704102647,13550.300210063053,11480.587505960406]
[null,16,{"$f":"(Energiepreisberechnung!C18)","v":0.15174673473934339},{"$f":"(Energiepreisberechnung!D18)","v":0.19313220785007346},{"$f":"(Energiepreisberechnung!E18)","v":0.55180630814306686},{"$f":"(Energiepreisberechnung!F18)","v":0.23451768096080339},{"$f":"(Energiepreisberechnung!G18)","v":0.13795157703576671},null,null,null,{"$f":"IF(ISNA(INDEX(Master!$D$40:$I$110,MATCH(K$5,Master!$I$40:$I$110,0),1)),0,(INDEX(Master!$D$40:$I$110,MATCH(K$5,Master!$I$40:$I$110,0),1)))","v":0},{"$f":"IF(ISNA(INDEX(Master!$D$40:$I$110,MATCH(L$5,Master!$I$40:$I$110,0),1)),0,(INDEX(Master!$D$40:$I$110,MATCH(L$5,Master!$I$40:$I$110,0),1)))","v":0},{"$f":"IF(ISNA(INDEX(Master!$D$40:$I$110,MATCH(M$5,Master!$I$40:$I$110,0),1)),0,(INDEX(Master!$D$40:$I$110,MATCH(M$5,Master!$I$40:$I$110,0),1)))","v":0},{"$f":"IF(ISNA(INDEX(Master!$D$40:$I$110,MATCH(N$5,Master!$I$40:$I$110,0),1)),0,(INDEX(Master!$D$40:$I$110,MATCH(N$5,Master!$I$40:$I$110,0),1)))","v":75471.698113207545},{"$f":"IF(ISNA(INDEX(Master!$D$40:$I$110,MATCH(O$5,Master!$I$40:$I$110,0),1)),0,(INDEX(Master!$D$40:$I$110,MATCH(O$5,Master!$I$40:$I$110,0),1)))","v":0},{"$f":"IF(ISNA(INDEX(Master!$D$40:$I$110,MATCH(P$5,Master!$I$40:$I$110,0),1)),0,(INDEX(Master!$D$40:$I$110,MATCH(P$5,Master!$I$40:$I$110,0),1)))","v":300},{"$f":"IF(ISNA(INDEX(Master!$D$40:$I$110,MATCH(Q$5,Master!$I$40:$I$110,0),1)),0,(INDEX(Master!$D$40:$I$110,MATCH(Q$5,Master!$I$40:$I$110,0),1)))","v":120},{"$f":"IF(ISNA(INDEX(Master!$D$40:$I$110,MATCH(R$5,Master!$I$40:$I$110,0),1)),0,(INDEX(Master!$D$40:$I$110,MATCH(R$5,Master!$I$40:$I$110,0),1)))","v":0},{"$f":"IF(ISNA(INDEX(Master!$D$40:$I$110,MATCH(S$5,Master!$I$40:$I$110,0),1)),0,(INDEX(Master!$D$40:$I$110,MATCH(S$5,Master!$I$40:$I$110,0),1)))","v":0},{"$f":"IF(ISNA(INDEX(Master!$D$40:$I$110,MATCH(T$5,Master!$I$40:$I$110,0),1)),0,(INDEX(Master!$D$40:$I$110,MATCH(T$5,Master!$I$40:$I$110,0),1)))","v":0},null,{"$f":"IF(ISNA(INDEX(Master!$D$40:$I$110,MATCH(V$5,Master!$I$40:$I$110,0),1)),0,(INDEX(Master!$D$40:$I$110,MATCH(V$5,Master!$I$40:$I$110,0),1)))","v":0},{"$f":"IF(ISNA(INDEX(Master!$D$40:$I$110,MATCH(W$5,Master!$I$40:$I$110,0),1)),0,(INDEX(Master!$D$40:$I$110,MATCH(W$5,Master!$I$40:$I$110,0),1)))","v":0},{"$f":"IF(ISNA(INDEX(Master!$D$40:$I$110,MATCH(X$5,Master!$I$40:$I$110,0),1)),0,(INDEX(Master!$D$40:$I$110,MATCH(X$5,Master!$I$40:$I$110,0),1)))","v":51612.903225806447},{"$f":"IF(ISNA(INDEX(Master!$D$40:$I$110,MATCH(Y$5,Master!$I$40:$I$110,0),1)),0,(INDEX(Master!$D$40:$I$110,MATCH(Y$5,Master!$I$40:$I$110,0),1)))","v":0},{"$f":"IF(ISNA(INDEX(Master!$D$40:$I$110,MATCH(Z$5,Master!$I$40:$I$110,0),1)),0,(INDEX(Master!$D$40:$I$110,MATCH(Z$5,Master!$I$40:$I$110,0),1)))","v":0},{"$f":"IF(ISNA(INDEX(Master!$D$40:$I$110,MATCH(AA$5,Master!$I$40:$I$110,0),1)),0,(INDEX(Master!$D$40:$I$110,MATCH(AA$5,Master!$I$40:$I$110,0),1)))","v":500},{"$f":"IF(ISNA(INDEX(Master!$D$40:$I$110,MATCH(AB$5,Master!$I$40:$I$110,0),1)),0,(INDEX(Master!$D$40:$I$110,MATCH(AB$5,Master!$I$40:$I$110,0),1)))","v":1880},{"$f":"IF(ISNA(INDEX(Master!$D$40:$I$110,MATCH(AC$5,Master!$I$40:$I$110,0),1)),0,(INDEX(Master!$D$40:$I$110,MATCH(AC$5,Master!$I$40:$I$110,0),1)))","v":0},{"$f":"IF(ISNA(INDEX(Master!$D$40:$I$110,MATCH(AD$5,Master!$I$40:$I$110,0),1)),0,(INDEX(Master!$D$40:$I$110,MATCH(AD$5,Master!$I$40:$I$110,0),1)))","v":400},null,16,11818.800510889876,9590.2079175000454,2228.5925933898307,11480.587505960406,9251.9949125705753]
[null,17,{"$f":"(Energiepreisberechnung!C19)","v":0.16236900617109742},{"$f":"(Energiepreisberechnung!D19)","v":0.2066514623995786},{"$f":"(Energiepreisberechnung!E19)","v":0.59043274971308157},{"$f":"(Energiepreisberechnung!F19)","v":0.25093391862805964},{"$f":"(Energiepreisberechnung!G19)","v":0.14760818742827039},null,null,null,{"$f":"IF(ISNA(INDEX(Master!$D$40:$I$110,MATCH(K$5,Master!$I$40:$I$110,0),1)),0,(INDEX(Master!$D$40:$I$110,MATCH(K$5,Master!$I$40:$I$110,0),1)))","v":0},{"$f":"IF(ISNA(INDEX(Master!$D$40:$I$110,MATCH(L$5,Master!$I$40:$I$110,0),1)),0,(INDEX(Master!$D$40:$I$110,MATCH(L$5,Master!$I$40:$I$110,0),1)))","v":0},{"$f":"IF(ISNA(INDEX(Master!$D$40:$I$110,MATCH(M$5,Master!$I$40:$I$110,0),1)),0,(INDEX(Master!$D$40:$I$110,MATCH(M$5,Master!$I$40:$I$110,0),1)))","v":0},{"$f":"IF(ISNA(INDEX(Master!$D$40:$I$110,MATCH(N$5,Master!$I$40:$I$110,0),1)),0,(INDEX(Master!$D$40:$I$110,MATCH(N$5,Master!$I$40:$I$110,0),1)))","v":75471.698113207545},{"$f":"IF(ISNA(INDEX(Master!$D$40:$I$110,MATCH(O$5,Master!$I$40:$I$110,0),1)),0,(INDEX(Master!$D$40:$I$110,MATCH(O$5,Master!$I$40:$I$110,0),1)))","v":0},{"$f":"IF(ISNA(INDEX(Master!$D$40:$I$110,MATCH(P$5,Master!$I$40:$I$110,0),1)),0,(INDEX(Master!$D$40:$I$110,MATCH(P$5,Master!$I$40:$I$110,0),1)))","v":300},{"$f":"IF(ISNA(INDEX(Master!$D$40:$I$110,MATCH(Q$5,Master!$I$40:$I$110,0),1)),0,(INDEX(Master!$D$40:$I$110,MATCH(Q$5,Master!$I$40:$I$110,0),1)))","v":120},{"$f":"IF(ISNA(INDEX(Master!$D$40:$I$110,MATCH(R$5,Master!$I$40:$I$110,0),1)),0,(INDEX(Master!$D$40:$I$110,MATCH(R$5,Master!$I$40:$I$110,0),1)))","v":0},{"$f":"IF(ISNA(INDEX(Master!$D$40:$I$110,MATCH(S$5,Master!$I$40:$I$110,0),1)),0,(INDEX(Master!$D$40:$I$110,MATCH(S$5,Master!$I$40:$I$110,0),1)))","v":0},{"$f":"IF(ISNA(INDEX(Master!$D$40:$I$110,MATCH(T$5,Master!$I$40:$I$110,0),1)),0,(INDEX(Master!$D$40:$I$110,MATCH(T$5,Master!$I$40:$I$110,0),1)))","v":0},null,{"$f":"IF(ISNA(INDEX(Master!$D$40:$I$110,MATCH(V$5,Master!$I$40:$I$110,0),1)),0,(INDEX(Master!$D$40:$I$110,MATCH(V$5,Master!$I$40:$I$110,0),1)))","v":0},{"$f":"IF(ISNA(INDEX(Master!$D$40:$I$110,MATCH(W$5,Master!$I$40:$I$110,0),1)),0,(INDEX(Master!$D$40:$I$110,MATCH(W$5,Master!$I$40:$I$110,0),1)))","v":0},{"$f":"IF(ISNA(INDEX(Master!$D$40:$I$110,MATCH(X$5,Master!$I$40:$I$110,0),1)),0,(INDEX(Master!$D$40:$I$110,MATCH(X$5,Master!$I$40:$I$110,0),1)))","v":51612.903225806447},{"$f":"IF(ISNA(INDEX(Master!$D$40:$I$110,MATCH(Y$5,Master!$I$40:$I$110,0),1)),0,(INDEX(Master!$D$40:$I$110,MATCH(Y$5,Master!$I$40:$I$110,0),1)))","v":0},{"$f":"IF(ISNA(INDEX(Master!$D$40:$I$110,MATCH(Z$5,Master!$I$40:$I$110,0),1)),0,(INDEX(Master!$D$40:$I$110,MATCH(Z$5,Master!$I$40:$I$110,0),1)))","v":0},{"$f":"IF(ISNA(INDEX(Master!$D$40:$I$110,MATCH(AA$5,Master!$I$40:$I$110,0),1)),0,(INDEX(Master!$D$40:$I$110,MATCH(AA$5,Master!$I$40:$I$110,0),1)))","v":500},{"$f":"IF(ISNA(INDEX(Master!$D$40:$I$110,MATCH(AB$5,Master!$I$40:$I$110,0),1)),0,(INDEX(Master!$D$40:$I$110,MATCH(AB$5,Master!$I$40:$I$110,0),1)))","v":1880},{"$f":"IF(ISNA(INDEX(Master!$D$40:$I$110,MATCH(AC$5,Master!$I$40:$I$110,0),1)),0,(INDEX(Master!$D$40:$I$110,MATCH(AC$5,Master!$I$40:$I$110,0),1)))","v":0},{"$f":"IF(ISNA(INDEX(Master!$D$40:$I$110,MATCH(AD$5,Master!$I$40:$I$110,0),1)),0,(INDEX(Master!$D$40:$I$110,MATCH(AD$5,Master!$I$40:$I$110,0),1)))","v":400},null,17,12625.116546652167,10226.522471725046,2398.5940749271213,9251.9949125705753,6853.400837643454]
[null,18,{"$f":"(Energiepreisberechnung!C20)","v":0.17373483660307423},{"$f":"(Energiepreisberechnung!D20)","v":0.22111706476754911},{"$f":"(Energiepreisberechnung!E20)","v":0.63176304219299728},{"$f":"(Energiepreisberechnung!F20)","v":0.26849929293202379},{"$f":"(Energiepreisberechnung!G20)","v":0.15794076054824932},null,null,null,{"$f":"IF(ISNA(INDEX(Master!$D$40:$I$110,MATCH(K$5,Master!$I$40:$I$110,0),1)),0,(INDEX(Master!$D$40:$I$110,MATCH(K$5,Master!$I$40:$I$110,0),1)))","v":0},{"$f":"IF(ISNA(INDEX(Master!$D$40:$I$110,MATCH(L$5,Master!$I$40:$I$110,0),1)),0,(INDEX(Master!$D$40:$I$110,MATCH(L$5,Master!$I$40:$I$110,0),1)))","v":0},{"$f":"IF(ISNA(INDEX(Master!$D$40:$I$110,MATCH(M$5,Master!$I$40:$I$110,0),1)),0,(INDEX(Master!$D$40:$I$110,MATCH(M$5,Master!$I$40:$I$110,0),1)))","v":0},{"$f":"IF(ISNA(INDEX(Master!$D$40:$I$110,MATCH(N$5,Master!$I$40:$I$110,0),1)),0,(INDEX(Master!$D$40:$I$110,MATCH(N$5,Master!$I$40:$I$110,0),1)))","v":75471.698113207545},{"$f":"IF(ISNA(INDEX(Master!$D$40:$I$110,MATCH(O$5,Master!$I$40:$I$110,0),1)),0,(INDEX(Master!$D$40:$I$110,MATCH(O$5,Master!$I$40:$I$110,0),1)))","v":0},{"$f":"IF(ISNA(INDEX(Master!$D$40:$I$110,MATCH(P$5,Master!$I$40:$I$110,0),1)),0,(INDEX(Master!$D$40:$I$110,MATCH(P$5,Master!$I$40:$I$110,0),1)))","v":300},{"$f":"IF(ISNA(INDEX(Master!$D$40:$I$110,MATCH(Q$5,Master!$I$40:$I$110,0),1)),0,(INDEX(Master!$D$40:$I$110,MATCH(Q$5,Master!$I$40:$I$110,0),1)))","v":120},{"$f":"IF(ISNA(INDEX(Master!$D$40:$I$110,MATCH(R$5,Master!$I$40:$I$110,0),1)),0,(INDEX(Master!$D$40:$I$110,MATCH(R$5,Master!$I$40:$I$110,0),1)))","v":0},{"$f":"IF(ISNA(INDEX(Master!$D$40:$I$110,MATCH(S$5,Master!$I$40:$I$110,0),1)),0,(INDEX(Master!$D$40:$I$110,MATCH(S$5,Master!$I$40:$I$110,0),1)))","v":0},{"$f":"IF(ISNA(INDEX(Master!$D$40:$I$110,MATCH(T$5,Master!$I$40:$I$110,0),1)),0,(INDEX(Master!$D$40:$I$110,MATCH(T$5,Master!$I$40:$I$110,0),1)))","v":0},null,{"$f":"IF(ISNA(INDEX(Master!$D$40:$I$110,MATCH(V$5,Master!$I$40:$I$110,0),1)),0,(INDEX(Master!$D$40:$I$110,MATCH(V$5,Master!$I$40:$I$110,0),1)))","v":0},{"$f":"IF(ISNA(INDEX(Master!$D$40:$I$110,MATCH(W$5,Master!$I$40:$I$110,0),1)),0,(INDEX(Master!$D$40:$I$110,MATCH(W$5,Master!$I$40:$I$110,0),1)))","v":0},{"$f":"IF(ISNA(INDEX(Master!$D$40:$I$110,MATCH(X$5,Master!$I$40:$I$110,0),1)),0,(INDEX(Master!$D$40:$I$110,MATCH(X$5,Master!$I$40:$I$110,0),1)))","v":51612.903225806447},{"$f":"IF(ISNA(INDEX(Master!$D$40:$I$110,MATCH(Y$5,Master!$I$40:$I$110,0),1)),0,(INDEX(Master!$D$40:$I$110,MATCH(Y$5,Master!$I$40:$I$110,0),1)))","v":0},{"$f":"IF(ISNA(INDEX(Master!$D$40:$I$110,MATCH(Z$5,Master!$I$40:$I$110,0),1)),0,(INDEX(Master!$D$40:$I$110,MATCH(Z$5,Master!$I$40:$I$110,0),1)))","v":0},{"$f":"IF(ISNA(INDEX(Master!$D$40:$I$110,MATCH(AA$5,Master!$I$40:$I$110,0),1)),0,(INDEX(Master!$D$40:$I$110,MATCH(AA$5,Master!$I$40:$I$110,0),1)))","v":500},{"$f":"IF(ISNA(INDEX(Master!$D$40:$I$110,MATCH(AB$5,Master!$I$40:$I$110,0),1)),0,(INDEX(Master!$D$40:$I$110,MATCH(AB$5,Master!$I$40:$I$110,0),1)))","v":1880},{"$f":"IF(ISNA(INDEX(Master!$D$40:$I$110,MATCH(AC$5,Master!$I$40:$I$110,0),1)),0,(INDEX(Master!$D$40:$I$110,MATCH(AC$5,Master!$I$40:$I$110,0),1)))","v":0},{"$f":"IF(ISNA(INDEX(Master!$D$40:$I$110,MATCH(AD$5,Master!$I$40:$I$110,0),1)),0,(INDEX(Master!$D$40:$I$110,MATCH(AD$5,Master!$I$40:$I$110,0),1)))","v":400},null,18,13487.874704917818,10907.3790447458,2580.4956601720187,6853.400837643454,4272.9051774714353]
[null,19,{"$f":"(Energiepreisberechnung!C21)","v":0.18589627516528942},{"$f":"(Energiepreisberechnung!D21)","v":0.23659525930127756},{"$f":"(Energiepreisberechnung!E21)","v":0.67598645514650713},{"$f":"(Energiepreisberechnung!F21)","v":0.28729424343726545},{"$f":"(Energiepreisberechnung!G21)","v":0.16899661378662678},null,null,null,{"$f":"IF(ISNA(INDEX(Master!$D$40:$I$110,MATCH(K$5,Master!$I$40:$I$110,0),1)),0,(INDEX(Master!$D$40:$I$110,MATCH(K$5,Master!$I$40:$I$110,0),1)))","v":0},{"$f":"IF(ISNA(INDEX(Master!$D$40:$I$110,MATCH(L$5,Master!$I$40:$I$110,0),1)),0,(INDEX(Master!$D$40:$I$110,MATCH(L$5,Master!$I$40:$I$110,0),1)))","v":0},{"$f":"IF(ISNA(INDEX(Master!$D$40:$I$110,MATCH(M$5,Master!$I$40:$I$110,0),1)),0,(INDEX(Master!$D$40:$I$110,MATCH(M$5,Master!$I$40:$I$110,0),1)))","v":0},{"$f":"IF(ISNA(INDEX(Master!$D$40:$I$110,MATCH(N$5,Master!$I$40:$I$110,0),1)),0,(INDEX(Master!$D$40:$I$110,MATCH(N$5,Master!$I$40:$I$110,0),1)))","v":75471.698113207545},{"$f":"IF(ISNA(INDEX(Master!$D$40:$I$110,MATCH(O$5,Master!$I$40:$I$110,0),1)),0,(INDEX(Master!$D$40:$I$110,MATCH(O$5,Master!$I$40:$I$110,0),1)))","v":0},{"$f":"IF(ISNA(INDEX(Master!$D$40:$I$110,MATCH(P$5,Master!$I$40:$I$110,0),1)),0,(INDEX(Master!$D$40:$I$110,MATCH(P$5,Master!$I$40:$I$110,0),1)))","v":300},{"$f":"IF(ISNA(INDEX(Master!$D$40:$I$110,MATCH(Q$5,Master!$I$40:$I$110,0),1)),0,(INDEX(Master!$D$40:$I$110,MATCH(Q$5,Master!$I$40:$I$110,0),1)))","v":120},{"$f":"IF(ISNA(INDEX(Master!$D$40:$I$110,MATCH(R$5,Master!$I$40:$I$110,0),1)),0,(INDEX(Master!$D$40:$I$110,MATCH(R$5,Master!$I$40:$I$110,0),1)))","v":0},{"$f":"IF(ISNA(INDEX(Master!$D$40:$I$110,MATCH(S$5,Master!$I$40:$I$110,0),1)),0,(INDEX(Master!$D$40:$I$110,MATCH(S$5,Master!$I$40:$I$110,0),1)))","v":0},{"$f":"IF(ISNA(INDEX(Master!$D$40:$I$110,MATCH(T$5,Master!$I$40:$I$110,0),1)),0,(INDEX(Master!$D$40:$I$110,MATCH(T$5,Master!$I$40:$I$110,0),1)))","v":0},null,{"$f":"IF(ISNA(INDEX(Master!$D$40:$I$110,MATCH(V$5,Master!$I$40:$I$110,0),1)),0,(INDEX(Master!$D$40:$I$110,MATCH(V$5,Master!$I$40:$I$110,0),1)))","v":0},{"$f":"IF(ISNA(INDEX(Master!$D$40:$I$110,MATCH(W$5,Master!$I$40:$I$110,0),1)),0,(INDEX(Master!$D$40:$I$110,MATCH(W$5,Master!$I$40:$I$110,0),1)))","v":0},{"$f":"IF(ISNA(INDEX(Master!$D$40:$I$110,MATCH(X$5,Master!$I$40:$I$110,0),1)),0,(INDEX(Master!$D$40:$I$110,MATCH(X$5,Master!$I$40:$I$110,0),1)))","v":51612.903225806447},{"$f":"IF(ISNA(INDEX(Master!$D$40:$I$110,MATCH(Y$5,Master!$I$40:$I$110,0),1)),0,(INDEX(Master!$D$40:$I$110,MATCH(Y$5,Master!$I$40:$I$110,0),1)))","v":0},{"$f":"IF(ISNA(INDEX(Master!$D$40:$I$110,MATCH(Z$5,Master!$I$40:$I$110,0),1)),0,(INDEX(Master!$D$40:$I$110,MATCH(Z$5,Master!$I$40:$I$110,0),1)))","v":0},{"$f":"IF(ISNA(INDEX(Master!$D$40:$I$110,MATCH(AA$5,Master!$I$40:$I$110,0),1)),0,(INDEX(Master!$D$40:$I$110,MATCH(AA$5,Master!$I$40:$I$110,0),1)))","v":500},{"$f":"IF(ISNA(INDEX(Master!$D$40:$I$110,MATCH(AB$5,Master!$I$40:$I$110,0),1)),0,(INDEX(Master!$D$40:$I$110,MATCH(AB$5,Master!$I$40:$I$110,0),1)))","v":1880},{"$f":"IF(ISNA(INDEX(Master!$D$40:$I$110,MATCH(AC$5,Master!$I$40:$I$110,0),1)),0,(INDEX(Master!$D$40:$I$110,MATCH(AC$5,Master!$I$40:$I$110,0),1)))","v":0},{"$f":"IF(ISNA(INDEX(Master!$D$40:$I$110,MATCH(AD$5,Master!$I$40:$I$110,0),1)),0,(INDEX(Master!$D$40:$I$110,MATCH(AD$5,Master!$I$40:$I$110,0),1)))","v":400},null,19,14411.025934262065,11635.895577878005,2775.1303563840593,4272.9051774714353,1497.774821087376]
[null,20,{"$f":"(Energiepreisberechnung!C22)","v":0.19890901442685968},{"$f":"(Energiepreisberechnung!D22)","v":0.25315692745236701},{"$f":"(Energiepreisberechnung!E22)","v":0.72330550700676266},{"$f":"(Energiepreisberechnung!F22)","v":0.30740484047787403},{"$f":"(Energiepreisberechnung!G22)","v":0.18082637675169067},null,null,null,{"$f":"IF(ISNA(INDEX(Master!$D$40:$I$110,MATCH(K$5,Master!$I$40:$I$110,0),1)),0,(INDEX(Master!$D$40:$I$110,MATCH(K$5,Master!$I$40:$I$110,0),1)))","v":0},{"$f":"IF(ISNA(INDEX(Master!$D$40:$I$110,MATCH(L$5,Master!$I$40:$I$110,0),1)),0,(INDEX(Master!$D$40:$I$110,MATCH(L$5,Master!$I$40:$I$110,0),1)))","v":0},{"$f":"IF(ISNA(INDEX(Master!$D$40:$I$110,MATCH(M$5,Master!$I$40:$I$110,0),1)),0,(INDEX(Master!$D$40:$I$110,MATCH(M$5,Master!$I$40:$I$110,0),1)))","v":0},{"$f":"IF(ISNA(INDEX(Master!$D$40:$I$110,MATCH(N$5,Master!$I$40:$I$110,0),1)),0,(INDEX(Master!$D$40:$I$110,MATCH(N$5,Master!$I$40:$I$110,0),1)))","v":75471.698113207545},{"$f":"IF(ISNA(INDEX(Master!$D$40:$I$110,MATCH(O$5,Master!$I$40:$I$110,0),1)),0,(INDEX(Master!$D$40:$I$110,MATCH(O$5,Master!$I$40:$I$110,0),1)))","v":0},{"$f":"IF(ISNA(INDEX(Master!$D$40:$I$110,MATCH(P$5,Master!$I$40:$I$110,0),1)),0,(INDEX(Master!$D$40:$I$110,MATCH(P$5,Master!$I$40:$I$110,0),1)))","v":300},{"$f":"IF(ISNA(INDEX(Master!$D$40:$I$110,MATCH(Q$5,Master!$I$40:$I$110,0),1)),0,(INDEX(Master!$D$40:$I$110,MATCH(Q$5,Master!$I$40:$I$110,0),1)))","v":120},{"$f":"IF(ISNA(INDEX(Master!$D$40:$I$110,MATCH(R$5,Master!$I$40:$I$110,0),1)),0,(INDEX(Master!$D$40:$I$110,MATCH(R$5,Master!$I$40:$I$110,0),1)))","v":0},{"$f":"IF(ISNA(INDEX(Master!$D$40:$I$110,MATCH(S$5,Master!$I$40:$I$110,0),1)),0,(INDEX(Master!$D$40:$I$110,MATCH(S$5,Master!$I$40:$I$110,0),1)))","v":0},{"$f":"IF(ISNA(INDEX(Master!$D$40:$I$110,MATCH(T$5,Master!$I$40:$I$110,0),1)),0,(INDEX(Master!$D$40:$I$110,MATCH(T$5,Master!$I$40:$I$110,0),1)))","v":0},null,{"$f":"IF(ISNA(INDEX(Master!$D$40:$I$110,MATCH(V$5,Master!$I$40:$I$110,0),1)),0,(INDEX(Master!$D$40:$I$110,MATCH(V$5,Master!$I$40:$I$110,0),1)))","v":0},{"$f":"IF(ISNA(INDEX(Master!$D$40:$I$110,MATCH(W$5,Master!$I$40:$I$110,0),1)),0,(INDEX(Master!$D$40:$I$110,MATCH(W$5,Master!$I$40:$I$110,0),1)))","v":0},{"$f":"IF(ISNA(INDEX(Master!$D$40:$I$110,MATCH(X$5,Master!$I$40:$I$110,0),1)),0,(INDEX(Master!$D$40:$I$110,MATCH(X$5,Master!$I$40:$I$110,0),1)))","v":51612.903225806447},{"$f":"IF(ISNA(INDEX(Master!$D$40:$I$110,MATCH(Y$5,Master!$I$40:$I$110,0),1)),0,(INDEX(Master!$D$40:$I$110,MATCH(Y$5,Master!$I$40:$I$110,0),1)))","v":0},{"$f":"IF(ISNA(INDEX(Master!$D$40:$I$110,MATCH(Z$5,Master!$I$40:$I$110,0),1)),0,(INDEX(Master!$D$40:$I$110,MATCH(Z$5,Master!$I$40:$I$110,0),1)))","v":0},{"$f":"IF(ISNA(INDEX(Master!$D$40:$I$110,MATCH(AA$5,Master!$I$40:$I$110,0),1)),0,(INDEX(Master!$D$40:$I$110,MATCH(AA$5,Master!$I$40:$I$110,0),1)))","v":500},{"$f":"IF(ISNA(INDEX(Master!$D$40:$I$110,MATCH(AB$5,Master!$I$40:$I$110,0),1)),0,(INDEX(Master!$D$40:$I$110,MATCH(AB$5,Master!$I$40:$I$110,0),1)))","v":1880},{"$f":"IF(ISNA(INDEX(Master!$D$40:$I$110,MATCH(AC$5,Master!$I$40:$I$110,0),1)),0,(INDEX(Master!$D$40:$I$110,MATCH(AC$5,Master!$I$40:$I$110,0),1)))","v":0},{"$f":"IF(ISNA(INDEX(Master!$D$40:$I$110,MATCH(AD$5,Master!$I$40:$I$110,0),1)),0,(INDEX(Master!$D$40:$I$110,MATCH(AD$5,Master!$I$40:$I$110,0),1)))","v":400},null,20,15398.797749660409,12415.408268329465,2983.3894813309435,1497.774821087376,-1485.6146602435674]
[]
[null,null,{"$f":"SUM(C6:C26)","v":2.2547520776677121},{"$f":"SUM(D6:D26)","v":2.8696844624861804},8.1990984642462266,3.4846168473046464,2.0497746160615566,null,null,null,null,null,null,null,null,null,null,null,null,null,null,null,null,null,null,null,null,null,null,null,null,null,{"$f":"SUM(AG6:AG26)","v":177153.85994157463},{"$f":"SUM(AH6:AH26)","v":145068.24528133104},{"$f":"SUM(AI6:AI25)","v":32085.614660243569}]
[null,null,{"$f":"(C27/20)","v":0.11273760388338561},{"$f":"(D27/20)","v":0.14348422312430903},0.40995492321231131,0.17423084236523231,0.10248873080307783,null,null,null,null,null,null,null,null,null,null,null,null,null,null,null,null,null,null,null,null,null,null,null,null,null,{"$f":"(AG27/20)","v":8857.6929970787314},{"$f":"(AH27/20)","v":7253.4122640665519},{"$f":"(AI27/20)","v":1604.2807330121784}]

{"sheet":"LW bival ÖL","index":5,"n_rows":95,"n_cols":18,"rows_kept":95,"cut":false,"hidden":false,"merged":[[53,16,56,16],[54,17,56,17]]}
["Aktueller Gaspreis",null,null,{"$f":"(Energiepreisberechnung!D28)","v":5.5E-2},"€/kWh"]
["Aktueller Ölpreis",null,null,{"$f":"(Energiepreisberechnung!D30)","v":8.5000000000000006E-2},"€/kWh"]
["Aktueller Strompreis",null,null,{"$f":"(Energiepreisberechnung!D31)","v":0.2},"€/kWh"]
["Gemittelter Wirkungsgrad Ölkessel ",null,null,0.93]
["Gemittelter Wirkungsgrad Gasbrennwertgerät",null,null,1.06]
["Gemittelter Wirkungsgrad GAWP LW",null,null,1.5]
["Elektr. Leistung GAWP LW",null,null,1.0900000000000001,"kW"]
["Elektr. Leistung Kesselkreispumpe",null,null,0.05,"kW"]
[]
["Gesucht:","Investitions- und Betriebskosten während 20 Jahren"]
[]
["1."]
["Errechnung der mittleren Energiepreise binnen 20 Jahren"]
[]
["Gaspreis Anfangsjahr:",null,null,{"$f":"(D1)","v":5.5E-2},"€/kWh"]
["Gaspreis im 20´sten Jahr:",null,null,{"$f":"(Energiepreisberechnung!C22)","v":0.19890901442685968},"€/kWh"]
["Mittlerer Gaspreis während 20 Jahren:",null,null,{"$f":"(Energiepreisberechnung!C24)","v":0.11273760388338561},"€/kWh"]
[]
["Ölpreis Anfangsjahr:",null,null,{"$f":"(D2)","v":8.5000000000000006E-2},"€/kWh"]
["Ölpreis im 20´sten Jahr:",null,null,{"$f":"(Energiepreisberechnung!F22)","v":0.30740484047787403},"€/kWh"]
["Mittlerer Ölpreis während 20 Jahren:",null,null,{"$f":"(Energiepreisberechnung!F24)","v":0.17423084236523231},"€/kWh"]
[]
["Strompreis Anfangsjahr:",null,null,{"$f":"(D3)","v":0.2},"€/kWh"]
["Strompreis im 20´sten Jahr:",null,null,{"$f":"(Energiepreisberechnung!E22)","v":0.72330550700676266},"€/kWh"]
["Mittlerer Strompreis während 20 Jahren:",null,null,{"$f":"(Energiepreisberechnung!E24)","v":0.40995492321231131},"€/kWh"]
[]
["2."]
["Betrachtung ohne Investition (bestehende Kessel bleiben)"]
[]
["2a"]
["Investitionskosten"]
["Investitionskosten gesamt: ",null,null,0,"€",null,null,null,"R_I_ÖL"]
[]
["2b"]
["Betriebskosten Öl"]
["Jahresarbeit Ölkessel",null,null,{"$f":"(Master!D5*Master!D6)","v":80000},"kWh/a","(Leistung x Jahresvollbenutzungsstunden)"]
["Energieverbrauch Ölkessel",null,null,{"$f":"(D36/D4)","v":86021.505376344081},"kWh/a","(Wirkungsgrad berücksichtigt)",null,null,"R_B_ÖL"]
["Kosten Öl ",null,null,{"$f":"(D37*D21)","v":14987.599343245789},"€/a"]
["Wartungskosten Ölkessel",null,null,300,"€/a",null,null,null,"R_B_WART_ÖL"]
["Stromverbrauch 1 Stück Kesselkreispumpe",null,null,{"$f":"(Master!D6*D8)","v":100},"kWh/a",null,null,null,"R_B_STROM_ÖL"]
["Stromkosten 1 Stück Kesselkreispumpe",null,null,{"$f":"(D40*D25)","v":40.995492321231133},"€/a","(Stromverbrauch x mittlerer Strompreis)"]
[]
["Betriebskosten pro Jahr gesamt:",null,null,{"$f":"SUM(D38:D39)+D41","v":15328.594835567021},"€/a"]
[null,null,null,null,null,null,null,null,null,null,null,"Negative Werte sollen gleich Null gesetzt werden"]
["3.",null,null,null,null,null,null,null,null,null,null,{"$f":"(Master!D5-D58)","v":5}]
["Betrachtung für eine GAWP 35 LW (35 kW) sowie Spitzenlastkessel"]
[null,null,null,null,null,null,null,null,null,null,null,"Wärmepumpe soll nur die Anlagenheizlast erbringen, welche erforderlich ist"]
["3a",null,null,null,null,null,null,null,null,null,null,{"$f":"IF(Master!D5<35,Master!D5,35)","v":35}]
["Investitionskosten"]
["GAWP + Zubehör",null,null,{"$f":"IF(Master!T15=TRUE,25000, (IF(Master!T16=TRUE,45000, (IF(Master!T17=TRUE,65000,\"\")))))","v":""},"€",null,null,null,null,null,null,"Deckungsrate GAWP"]
["Förderung BAFA",null,null,{"$f":"IF(Master!$T$15=TRUE,(2400+100*25), (IF(Master!$T$16=TRUE,(2400+100*60), (IF(Master!$T$17=TRUE,(2400+100*95),\"\")))))","v":""},"€",null,null,null,null,null,null,{"$f":"(D57/D58)","v":0.14285714285714285},"Quotient BW zu GAWP"]
[{"$f":"IF(AND(Master!D5>29,Master!D5<55),Spitzenlastkessel!C4,(IF(AND(Master!D5>54,Master!D5<65),Spitzenlastkessel!C5,(IF(AND(Master!D5>64,Master!D5<85),Spitzenlastkessel!C6,(IF(AND(Master!D5>84,Master!D5<110),Spitzenlastkessel!C7,(IF(AND(Master!D5>109,Master!D5<135),Spitzenlastkessel!C8,(IF(AND(Master!D5>134,Master!D5<150),Spitzenlastkessel!C9,(IF(AND(Master!D5>149,Master!D5<200),Spitzenlastkessel!C10,(IF(AND(Master!D5>199,Master!D5<240),Spitzenlastkessel!C11,(IF(AND(Master!D5>239,Master!D5<300),Spitzenlastkessel!C12,(IF(AND(Master!D5>299,Master!D5<370),Spitzenlastkessel!C13,(IF(AND(Master!D5>369,Master!D5<450),Spitzenlastkessel!C14,(IF(AND(Master!D5>449,Master!D5<520),Spitzenlastkessel!C15,\"Anlagenheizlast zu groß\")))))))))))))))))))))))","v":"Spitzenlastkessel GMR 3035 (35 kW)"},null,null,{"$f":"IF(AND(Master!D5>29,Master!D5<55),Spitzenlastkessel!E4,(IF(AND(Master!D5>54,Master!D5<65),Spitzenlastkessel!E5,(IF(AND(Master!D5>64,Master!D5<85),Spitzenlastkessel!E6,(IF(AND(Master!D5>84,Master!D5<110),Spitzenlastkessel!E7,(IF(AND(Master!D5>109,Master!D5<135),Spitzenlastkessel!E8,(IF(AND(Master!D5>134,Master!D5<150),Spitzenlastkessel!E9,(IF(AND(Master!D5>149,Master!D5<200),Spitzenlastkessel!E10,(IF(AND(Master!D5>199,Master!D5<240),Spitzenlastkessel!E11,(IF(AND(Master!D5>239,Master!D5<300),Spitzenlastkessel!E12,(IF(AND(Master!D5>299,Master!D5<370),Spitzenlastkessel!E13,(IF(AND(Master!D5>369,Master!D5<450),Spitzenlastkessel!E14,(IF(AND(Master!D5>449,Master!D5<520),Spitzenlastkessel!E15,\"Anlagenheizlast zu groß\")))))))))))))))))))))))","v":3600},"€","(gewählt)",null,null,null,null,null,{"$f":"(D57+D58)","v":40},"Max Leistung BW plus Leistung GAWP"]
["Investitionskosten gesamt: ",null,null,{"$f":"(D50+D52-D51)","v":{"$error":"#VALUE!"}},"€",null,null,null,"N_I_GAWP_u_BW",null,null,{"$f":"(100/L52)*D58","v":87.5},"Prozentuale Anlagenheizlast von GAWP"]
[null,null,null,null,null,null,null,null,null,null,null,{"$f":"MROUND(L53,5)","v":90},"Gerundet",null,null,null,"Prozentuale \nAnlagen-\nheizlast \nder GAWP"]
["3b",null,null,null,null,null,null,null,null,null,null,{"$f":"VLOOKUP(L54,Q58:R85,2)","v":98},"Deckungsrate GAWP",null,null,null,null,"Deckungs-\nrate"]
["Betriebskosten"]
["Max. Leistung Brennwertgerät",null,null,{"$f":"IF(L45<0,0,(Master!D5-D58))","v":5},"kW"]
["Leistung GAWP",null,null,{"$f":"(L48)","v":35},"kW",null,null,null,null,null,null,null,null,null,null,null,0,0]
[null,null,null,null,null,null,null,null,null,null,null,null,null,null,null,null,5,8]
["Deckungsrate Brennwertgerät",null,null,{"$f":"(100-D61)","v":2},"%","(Ergibt sich aus Leistungsverhältnis Brennwertgerät/GAWP)",null,null,null,null,null,null,null,null,null,null,10,15]
["Deckungsrate GAWP",null,null,{"$f":"VLOOKUP(L54,Q58:R85,2)","v":98},"%","(Ergibt sich aus Leistungsverhältnis Brennwertgerät/GAWP)",null,null,null,null,null,null,null,null,null,null,15,25]
[null,null,null,null,null,null,null,null,null,null,null,null,null,null,null,null,20,33]
["Jahresarbeit Gas-Brennwertgerät",null,null,{"$f":"(D36*(D60/100))","v":1600},"kWh/a","(Deckungsrate berücksichtigt)"]
["Jahresarbeit GAWP",null,null,{"$f":"(D36*(D61/100))","v":78400},"kWh/a","(Deckungsrate berücksichtigt)",null,null,null,null,null,null,null,null,null,null,25,41]
[null,null,null,null,null,null,null,null,null,null,null,null,null,null,null,null,30,50]
["Vollbenutzungsstunden Gas-Brennwertgerät",null,null,{"$f":"IF(D57=0,0,(D63/D57))","v":320},"h","(ergibt sich aus Jahresarbeit/Leistung)"]
["Vollbenutzungsstunden GAWP",null,null,{"$f":"(D64/D58)","v":2240},"h","(ergibt sich aus Jahresarbeit/Leistung)",null,null,null,null,null,null,null,null,null,null,35,58]
[null,null,null,null,null,null,null,null,null,null,null,null,null,null,null,null,40,67]
["Gasverbrauch Gas-Brennwertgerät",null,null,{"$f":"(D63/D5)","v":1509.433962264151},"kWh/a","(ergibt sich aus Jahresarbeit/Wirkungsgrad)",null,null,"N_B_GAS_BW"]
["Gasverbrauch GAWP",null,null,{"$f":"(D64/D6)","v":52266.666666666664},"kWh/a","(ergibt sich aus Jahresarbeit/Wirkungsgrad)",null,null,"N_B_GAS_GAWP",null,null,null,null,null,null,null,45,75]
[null,null,null,null,null,null,null,null,null,null,null,null,null,null,null,null,50,80]
["Kosten Gasverbrauch Gas-Brennwertgerät",null,null,{"$f":"(D69*D17)","v":170.16996812586507},"€/a","(ergibt sich aus Gasverbrauch x mittlerer Gaspreis)"]
["Kosten Gasverbrauch GAWP",null,null,{"$f":"(D70*D17)","v":5892.4187629716207},"€/a","(ergibt sich aus Gasverbrauch x mittlerer Gaspreis)",null,null,null,null,null,null,null,null,null,null,55,83]
[null,null,null,null,null,null,null,null,null,null,null,null,null,null,null,null,60,87]
["Wartungskosten Gas-Brennwertgerät",null,null,300,"€/a",null,null,null,"N_B_WART_BW"]
["Wartungskosten GAWP",null,null,300,"€/a",null,null,null,"N_B_WART_GAWP",null,null,null,null,null,null,null,65,90]
[null,null,null,null,null,null,null,null,null,null,null,null,null,null,null,null,70,92]
["Stromverbrauch GAWP",null,null,{"$f":"(D67*D7)","v":2441.6000000000004},"kWh/a",null,null,null,"N_B_STROM_LÜ_GAWP",null,null,null,null,null,null,null,75,94]
["Stromkosten GAWP",null,null,{"$f":"(D78*D25)","v":1000.9459405151795},"€/a","(Stromverbrauch x mittlerer Strompreis)",null,null,null,null,null,null,null,null,null,null,80,96]
["Stromverbrauch Gas-Brennwertgerät",null,null,{"$f":"(D66*D8)","v":16},"kWh/a",null,null,null,"N_B_STROM_BW"]
["Stromkosten Gas-Brennwertgerät",null,null,{"$f":"(D80*D25)","v":6.5592787713969809},"€/a","(Stromverbrauch x mittlerer Strompreis)"]
["Stromverbrauch Umwälzpumpe GAWP",null,null,{"$f":"((D67)*D8)","v":112},"kWh/a",null,null,null,"N_B_STROM_PU_GAWP",null,null,null,null,null,null,null,85,97]
["Stromkosten Umwälzpumpe GAWP",null,null,{"$f":"(D82*D25)","v":45.914951399778865},"€/a","(Stromverbrauch x mittlerer Strompreis)",null,null,null,null,null,null,null,null,null,null,90,98]
[null,null,null,null,null,null,null,null,null,null,null,null,null,null,null,null,95,99]
["Betriebskosten pro Jahr gesamt:",null,null,{"$f":"SUM(D72:D76)+D83+D79+D81","v":7716.0089017838409},"€/a",null,null,null,null,null,null,null,null,null,null,null,100,100]
[]
["FAZIT:"]
["Mittlere Energieeinsparung pro Jahr bei Einsatz"]
["von einer GAWP LW und Gas-Brennwertgerät"]
["gegenüber bestehenden Betriebskosten",null,null,{"$f":"(D43-D85)","v":7612.5859337831798},"€/a"]
[]
["Differenz Investitionskosten:",null,null,{"$f":"(D53-D32)","v":{"$error":"#VALUE!"}},"€"]
[]
["Für einen auf 20 Jahre gemittelten Engergiepreis"]
["ergibt sich eine Amortisationszeit von: ",null,null,{"$f":"IF((D92/D90)<0,\"sofort\",(D92/D90))","v":{"$error":"#VALUE!"}},{"$f":"IF((D92/D90)<0,\"\",\"Jahren\")","v":{"$error":"#VALUE!"}}]

{"sheet":"LW2 bival ÖL","index":6,"n_rows":96,"n_cols":18,"rows_kept":96,"cut":false,"hidden":false,"merged":[[54,16,57,16],[55,17,57,17]]}
["Aktueller Gaspreis",null,null,{"$f":"(Energiepreisberechnung!D28)","v":5.5E-2},"€/kWh"]
["Aktueller Ölpreis",null,null,{"$f":"(Energiepreisberechnung!D30)","v":8.5000000000000006E-2},"€/kWh"]
["Aktueller Strompreis",null,null,{"$f":"(Energiepreisberechnung!D31)","v":0.2},"€/kWh"]
["Gemittelter Wirkungsgrad Ölkessel ",null,null,0.93]
["Gemittelter Wirkungsgrad Gasbrennwertgerät",null,null,1.06]
["Gemittelter Wirkungsgrad GAWP LW",null,null,1.5]
["Elektr. Leistung GAWP LW",null,null,1.0900000000000001,"kW"]
["Elektr. Leistung Kesselkreispumpe",null,null,0.06,"kW"]
["Elektr. Leistung Umwälzpumpe GAWP",null,null,0.05,"kW"]
[]
["Gesucht:","Investitions- und Betriebskosten während 20 Jahren"]
[]
["1."]
["Errechnung der mittleren Energiepreise binnen 20 Jahren"]
[]
["Gaspreis Anfangsjahr:",null,null,{"$f":"(D1)","v":5.5E-2},"€/kWh"]
["Gaspreis im 20´sten Jahr:",null,null,{"$f":"(Energiepreisberechnung!C22)","v":0.19890901442685968},"€/kWh"]
["Mittlerer Gaspreis während 20 Jahren:",null,null,{"$f":"(Energiepreisberechnung!C24)","v":0.11273760388338561},"€/kWh"]
[]
["Ölpreis Anfangsjahr:",null,null,{"$f":"(D2)","v":8.5000000000000006E-2},"€/kWh"]
["Ölpreis im 20´sten Jahr:",null,null,{"$f":"(Energiepreisberechnung!F22)","v":0.30740484047787403},"€/kWh"]
["Mittlerer Ölpreis während 20 Jahren:",null,null,{"$f":"(Energiepreisberechnung!F24)","v":0.17423084236523231},"€/kWh"]
[]
["Strompreis Anfangsjahr:",null,null,{"$f":"(D3)","v":0.2},"€/kWh"]
["Strompreis im 20´sten Jahr:",null,null,{"$f":"(Energiepreisberechnung!E22)","v":0.72330550700676266},"€/kWh"]
["Mittlerer Strompreis während 20 Jahren:",null,null,{"$f":"(Energiepreisberechnung!E24)","v":0.40995492321231131},"€/kWh"]
[]
["2."]
["Betrachtung ohne Investition (bestehende Kessel bleiben)"]
[]
["2a"]
["Investitionskosten"]
["Investitionskosten gesamt: ",null,null,0,"€",null,null,null,"R_I_ÖL"]
[]
["2b"]
["Betriebskosten Öl"]
["Jahresarbeit Ölkessel",null,null,{"$f":"(Master!D5*Master!D6)","v":80000},"kWh/a","(Leistung x Jahresvollbenutzungsstunden)"]
["Energieverbrauch Ölkessel",null,null,{"$f":"(D37/D4)","v":86021.505376344081},"kWh/a","(Wirkungsgrad berücksichtigt)",null,null,"R_B_ÖL"]
["Kosten Öl ",null,null,{"$f":"(D38*D22)","v":14987.599343245789},"€/a"]
["Wartungskosten Ölkessel",null,null,300,"€/a",null,null,null,"R_B_WART_ÖL"]
["Stromverbrauch 1 Stück Kesselkreispumpe",null,null,{"$f":"(Master!D6*D8)","v":120},"kWh/a",null,null,null,"R_B_STROM_ÖL"]
["Stromkosten 1 Stück Kesselkreispumpe",null,null,{"$f":"(D41*D26)","v":49.194590785477359},"€/a","(Stromverbrauch x mittlerer Strompreis)"]
[]
["Betriebskosten pro Jahr gesamt:",null,null,{"$f":"SUM(D39:D40)+D42","v":15336.793934031266},"€/a"]
[null,null,null,null,null,null,null,null,null,null,null,"Negative Werte sollen gleich Null gesetzt werden"]
["3.",null,null,null,null,null,null,null,null,null,null,{"$f":"(Master!D5-D59)","v":0}]
["Betrachtung für zwei GAWP 35 LW (70 kW) sowie Spitzenlastkessel"]
[null,null,null,null,null,null,null,null,null,null,null,"Wärmepumpe soll nur die Anlagenheizlast erbringen, welche erforderlich ist"]
["3a",null,null,null,null,null,null,null,null,null,null,{"$f":"IF(Master!D5<70,Master!D5,70)","v":40}]
["Investitionskosten"]
["2 x GAWP + Zubehör",null,null,{"$f":"IF(Master!T15=TRUE,25000, (IF(Master!T16=TRUE,45000, (IF(Master!T17=TRUE,65000,\"\")))))","v":""},"€",null,null,null,null,null,null,"Deckungsrate GAWP"]
["Förderung BAFA",null,null,{"$f":"IF(Master!$T$15=TRUE,(2400+100*25), (IF(Master!$T$16=TRUE,(2400+100*60), (IF(Master!$T$17=TRUE,(2400+100*95),\"\")))))","v":""},"€",null,null,null,null,null,null,{"$f":"(D58/D59)","v":0},"Quotient BW zu GAWP"]
[{"$f":"IF(AND(Master!D5>29,Master!D5<55),Spitzenlastkessel!C4,(IF(AND(Master!D5>54,Master!D5<65),Spitzenlastkessel!C5,(IF(AND(Master!D5>64,Master!D5<85),Spitzenlastkessel!C6,(IF(AND(Master!D5>84,Master!D5<110),Spitzenlastkessel!C7,(IF(AND(Master!D5>109,Master!D5<135),Spitzenlastkessel!C8,(IF(AND(Master!D5>134,Master!D5<150),Spitzenlastkessel!C9,(IF(AND(Master!D5>149,Master!D5<200),Spitzenlastkessel!C10,(IF(AND(Master!D5>199,Master!D5<240),Spitzenlastkessel!C11,(IF(AND(Master!D5>239,Master!D5<300),Spitzenlastkessel!C12,(IF(AND(Master!D5>299,Master!D5<370),Spitzenlastkessel!C13,(IF(AND(Master!D5>369,Master!D5<450),Spitzenlastkessel!C14,(IF(AND(Master!D5>449,Master!D5<520),Spitzenlastkessel!C15,\"Anlagenheizlast zu groß\")))))))))))))))))))))))","v":"Spitzenlastkessel GMR 3035 (35 kW)"},null,null,{"$f":"IF(AND(Master!D5>29,Master!D5<55),Spitzenlastkessel!E4,(IF(AND(Master!D5>54,Master!D5<65),Spitzenlastkessel!E5,(IF(AND(Master!D5>64,Master!D5<85),Spitzenlastkessel!E6,(IF(AND(Master!D5>84,Master!D5<110),Spitzenlastkessel!E7,(IF(AND(Master!D5>109,Master!D5<135),Spitzenlastkessel!E8,(IF(AND(Master!D5>134,Master!D5<150),Spitzenlastkessel!E9,(IF(AND(Master!D5>149,Master!D5<200),Spitzenlastkessel!E10,(IF(AND(Master!D5>199,Master!D5<240),Spitzenlastkessel!E11,(IF(AND(Master!D5>239,Master!D5<300),Spitzenlastkessel!E12,(IF(AND(Master!D5>299,Master!D5<370),Spitzenlastkessel!E13,(IF(AND(Master!D5>369,Master!D5<450),Spitzenlastkessel!E14,(IF(AND(Master!D5>449,Master!D5<520),Spitzenlastkessel!E15,\"Anlagenheizlast zu groß\")))))))))))))))))))))))","v":3600},"€","(gewählt)",null,null,null,null,null,{"$f":"(D58+D59)","v":40},"Max Leistung BW plus Leistung GAWP"]
["Investitionskosten gesamt: ",null,null,{"$f":"(D51+D53-D52)","v":{"$error":"#VALUE!"}},"€",null,null,null,"N_I_GAWP_u_BW",null,null,{"$f":"(100/L53)*D59","v":100},"Prozentuale Anlagenheizlast von GAWP"]
[null,null,null,null,null,null,null,null,null,null,null,{"$f":"MROUND(L54,5)","v":100},"Gerundet",null,null,null,"Prozentuale \nAnlagen-\nheizlast \nder GAWP"]
["3b",null,null,null,null,null,null,null,null,null,null,{"$f":"VLOOKUP(L55,Q59:R86,2)","v":100},"Deckungsrate GAWP",null,null,null,null,"Deckungs-\nrate"]
["Betriebskosten"]
["Max. Leistung Brennwertgerät",null,null,{"$f":"IF(L46<0,0,(Master!D5-D59))","v":0},"kW"]
["Leistung 2 x GAWP",null,null,{"$f":"(L49)","v":40},"kW",null,null,null,null,null,null,null,null,null,null,null,0,0]
[null,null,null,null,null,null,null,null,null,null,null,null,null,null,null,null,5,8]
["Deckungsrate Brennwertgerät",null,null,{"$f":"(100-D62)","v":0},"%","(Ergibt sich aus Leistungsverhältnis Brennwertgerät/GAWP)",null,null,null,null,null,null,null,null,null,null,10,15]
["Deckungsrate 2 x GAWP",null,null,{"$f":"VLOOKUP(L55,Q59:R86,2)","v":100},"%","(Ergibt sich aus Leistungsverhältnis Brennwertgerät/GAWP)",null,null,null,null,null,null,null,null,null,null,15,25]
[null,null,null,null,null,null,null,null,null,null,null,null,null,null,null,null,20,33]
["Jahresarbeit Gas-Brennwertgerät",null,null,{"$f":"(D37*(D61/100))","v":0},"kWh/a","(Deckungsrate berücksichtigt)"]
["Jahresarbeit 2 x GAWP",null,null,{"$f":"(D37*(D62/100))","v":80000},"kWh/a","(Deckungsrate berücksichtigt)",null,null,null,null,null,null,null,null,null,null,25,41]
[null,null,null,null,null,null,null,null,null,null,null,null,null,null,null,null,30,50]
["Vollbenutzungsstunden Gas-Brennwertgerät",null,null,{"$f":"IF(D58=0,0,(D64/D58))","v":0},"h","(ergibt sich aus Jahresarbeit/Leistung)"]
["Vollbenutzungsstunden 2 x GAWP",null,null,{"$f":"(D65/D59)","v":2000},"h","(ergibt sich aus Jahresarbeit/Leistung)",null,null,null,null,null,null,null,null,null,null,35,58]
[null,null,null,null,null,null,null,null,null,null,null,null,null,null,null,null,40,67]
["Gasverbrauch Gas-Brennwertgerät",null,null,{"$f":"(D64/D5)","v":0},"kWh/a","(ergibt sich aus Jahresarbeit/Wirkungsgrad)",null,null,"N_B_GAS_BW"]
["Gasverbrauch 2 x GAWP",null,null,{"$f":"(D65/D6)","v":53333.333333333336},"kWh/a","(ergibt sich aus Jahresarbeit/Wirkungsgrad)",null,null,"N_B_GAS_GAWP",null,null,null,null,null,null,null,45,75]
[null,null,null,null,null,null,null,null,null,null,null,null,null,null,null,null,50,80]
["Kosten Gasverbrauch Gas-Brennwertgerät",null,null,{"$f":"(D70*D18)","v":0},"€/a","(ergibt sich aus Gasverbrauch x mittlerer Gaspreis)"]
["Kosten Gasverbrauch 2 x GAWP",null,null,{"$f":"(D71*D18)","v":6012.6722071138993},"€/a","(ergibt sich aus Gasverbrauch x mittlerer Gaspreis)",null,null,null,null,null,null,null,null,null,null,55,83]
[null,null,null,null,null,null,null,null,null,null,null,null,null,null,null,null,60,87]
["Wartungskosten Gas-Brennwertgerät",null,null,300,"€/a",null,null,null,"N_B_WART_BW"]
["Wartungskosten 2 x GAWP",null,null,500,"€/a",null,null,null,"N_B_WART_GAWP",null,null,null,null,null,null,null,65,90]
[null,null,null,null,null,null,null,null,null,null,null,null,null,null,null,null,70,92]
["Stromverbrauch 2 x GAWP",null,null,{"$f":"(D68*D7)*2","v":4360},"kWh/a",null,null,null,"N_B_STROM_LÜ_GAWP",null,null,null,null,null,null,null,75,94]
["Stromkosten 2 x GAWP",null,null,{"$f":"(D79*D26)","v":1787.4034652056773},"€/a","(Stromverbrauch x mittlerer Strompreis)",null,null,null,null,null,null,null,null,null,null,80,96]
["Stromverbrauch Gas-Brennwertgerät",null,null,{"$f":"(D67*D8)","v":0},"kWh/a",null,null,null,"N_B_STROM_BW"]
["Stromkosten Gas-Brennwertgerät",null,null,{"$f":"(D81*D26)","v":0},"€/a","(Stromverbrauch x mittlerer Strompreis)"]
["Stromverbrauch 2 x Umwälzpumpe GAWP",null,null,{"$f":"((D68)*D9)*2","v":200},"kWh/a",null,null,null,"N_B_STROM_PU_GAWP",null,null,null,null,null,null,null,85,97]
["Stromkosten 2 x Umwälzpumpe GAWP",null,null,{"$f":"(D83*D26)","v":81.990984642462266},"€/a","(Stromverbrauch x mittlerer Strompreis)",null,null,null,null,null,null,null,null,null,null,90,98]
[null,null,null,null,null,null,null,null,null,null,null,null,null,null,null,null,95,99]
["Betriebskosten pro Jahr gesamt:",null,null,{"$f":"SUM(D73:D77)+D84+D80+D82","v":8682.0666569620389},"€/a",null,null,null,null,null,null,null,null,null,null,null,100,100]
[]
["FAZIT:"]
["Mittlere Energieeinsparung pro Jahr bei Einsatz"]
["von zwei GAWP LW und Gas-Brennwertgerät"]
["gegenüber bestehenden Betriebskosten",null,null,{"$f":"(D44-D86)","v":6654.7272770692271},"€/a"]
[]
["Differenz Investitionskosten:",null,null,{"$f":"(D54-D33)","v":{"$error":"#VALUE!"}},"€"]
[]
["Für einen auf 20 Jahre gemittelten Engergiepreis"]
["ergibt sich eine Amortisationszeit von: ",null,null,{"$f":"IF((D93/D91)<0,\"sofort\",(D93/D91))","v":{"$error":"#VALUE!"}},{"$f":"IF((D93/D91)<0,\"\",\"Jahren\")","v":{"$error":"#VALUE!"}}]

{"sheet":"LW3 bival ÖL","index":7,"n_rows":96,"n_cols":18,"rows_kept":96,"cut":false,"hidden":false,"merged":[[54,16,57,16],[55,17,57,17]]}
["Aktueller Gaspreis",null,null,{"$f":"(Energiepreisberechnung!D28)","v":5.5E-2},"€/kWh"]
["Aktueller Ölpreis",null,null,{"$f":"(Energiepreisberechnung!D30)","v":8.5000000000000006E-2},"€/kWh"]
["Aktueller Strompreis",null,null,{"$f":"(Energiepreisberechnung!D31)","v":0.2},"€/kWh"]
["Gemittelter Wirkungsgrad Ölkessel ",null,null,0.93]
["Gemittelter Wirkungsgrad Gasbrennwertgerät",null,null,1.06]
["Gemittelter Wirkungsgrad GAWP LW",null,null,1.5]
["Elektr. Leistung GAWP LW",null,null,1.0900000000000001,"kW"]
["Elektr. Leistung Kesselkreispumpe",null,null,0.1,"kW"]
["Elektr. Leistung Umwälzpumpe GAWP",null,null,0.05,"kW"]
[]
["Gesucht:","Investitions- und Betriebskosten während 20 Jahren"]
[]
["1."]
["Errechnung der mittleren Energiepreise binnen 20 Jahren"]
[]
["Gaspreis Anfangsjahr:",null,null,{"$f":"(D1)","v":5.5E-2},"€/kWh"]
["Gaspreis im 20´sten Jahr:",null,null,{"$f":"(Energiepreisberechnung!C22)","v":0.19890901442685968},"€/kWh"]
["Mittlerer Gaspreis während 20 Jahren:",null,null,{"$f":"(Energiepreisberechnung!C24)","v":0.11273760388338561},"€/kWh"]
[]
["Ölpreis Anfangsjahr:",null,null,{"$f":"(D2)","v":8.5000000000000006E-2},"€/kWh"]
["Ölpreis im 20´sten Jahr:",null,null,{"$f":"(Energiepreisberechnung!F22)","v":0.30740484047787403},"€/kWh"]
["Mittlerer Ölpreis während 20 Jahren:",null,null,{"$f":"(Energiepreisberechnung!F24)","v":0.17423084236523231},"€/kWh"]
[]
["Strompreis Anfangsjahr:",null,null,{"$f":"(D3)","v":0.2},"€/kWh"]
["Strompreis im 20´sten Jahr:",null,null,{"$f":"(Energiepreisberechnung!E22)","v":0.72330550700676266},"€/kWh"]
["Mittlerer Strompreis während 20 Jahren:",null,null,{"$f":"(Energiepreisberechnung!E24)","v":0.40995492321231131},"€/kWh"]
[]
["2."]
["Betrachtung ohne Investition (bestehende Kessel bleiben)"]
[]
["2a"]
["Investitionskosten"]
["Investitionskosten gesamt: ",null,null,0,"€",null,null,null,"R_I_ÖL"]
[]
["2b"]
["Betriebskosten Öl"]
["Jahresarbeit Ölkessel",null,null,{"$f":"(Master!D5*Master!D6)","v":80000},"kWh/a","(Leistung x Jahresvollbenutzungsstunden)"]
["Energieverbrauch Ölkessel",null,null,{"$f":"(D37/D4)","v":86021.505376344081},"kWh/a","(Wirkungsgrad berücksichtigt)",null,null,"R_B_ÖL"]
["Kosten Öl ",null,null,{"$f":"(D38*D22)","v":14987.599343245789},"€/a"]
["Wartungskosten Ölkessel",null,null,300,"€/a",null,null,null,"R_B_WART_ÖL"]
["Stromverbrauch 1 Stück Kesselkreispumpe",null,null,{"$f":"(Master!D6*D8)","v":200},"kWh/a",null,null,null,"R_B_STROM_ÖL"]
["Stromkosten 1 Stück Kesselkreispumpe",null,null,{"$f":"(D41*D26)","v":81.990984642462266},"€/a","(Stromverbrauch x mittlerer Strompreis)"]
[]
["Betriebskosten pro Jahr gesamt:",null,null,{"$f":"SUM(D39:D40)+D42","v":15369.590327888251},"€/a"]
[null,null,null,null,null,null,null,null,null,null,null,"Negative Werte sollen gleich Null gesetzt werden"]
["3.",null,null,null,null,null,null,null,null,null,null,{"$f":"(Master!D5-D59)","v":0}]
["Betrachtung für drei GAWP 35 LW (105 kW) sowie Spitzenlastkessel"]
[null,null,null,null,null,null,null,null,null,null,null,"Wärmepumpe soll nur die Anlagenheizlast erbringen, welche erforderlich ist"]
["3a",null,null,null,null,null,null,null,null,null,null,{"$f":"IF(Master!D5<105,Master!D5,105)","v":40}]
["Investitionskosten"]
["3 x GAWP + Zubehör",null,null,{"$f":"IF(Master!T15=TRUE,25000, (IF(Master!T16=TRUE,45000, (IF(Master!T17=TRUE,65000,\"\")))))","v":""},"€",null,null,null,null,null,null,"Deckungsrate GAWP"]
["Förderung BAFA",null,null,{"$f":"IF(Master!$T$15=TRUE,(2400+100*25), (IF(Master!$T$16=TRUE,(2400+100*60), (IF(Master!$T$17=TRUE,(2400+100*95),\"\")))))","v":""},"€",null,null,null,null,null,null,{"$f":"(D58/D59)","v":0},"Quotient BW zu GAWP"]
[{"$f":"IF(AND(Master!D5>29,Master!D5<55),Spitzenlastkessel!C4,(IF(AND(Master!D5>54,Master!D5<65),Spitzenlastkessel!C5,(IF(AND(Master!D5>64,Master!D5<85),Spitzenlastkessel!C6,(IF(AND(Master!D5>84,Master!D5<110),Spitzenlastkessel!C7,(IF(AND(Master!D5>109,Master!D5<135),Spitzenlastkessel!C8,(IF(AND(Master!D5>134,Master!D5<150),Spitzenlastkessel!C9,(IF(AND(Master!D5>149,Master!D5<200),Spitzenlastkessel!C10,(IF(AND(Master!D5>199,Master!D5<240),Spitzenlastkessel!C11,(IF(AND(Master!D5>239,Master!D5<300),Spitzenlastkessel!C12,(IF(AND(Master!D5>299,Master!D5<370),Spitzenlastkessel!C13,(IF(AND(Master!D5>369,Master!D5<450),Spitzenlastkessel!C14,(IF(AND(Master!D5>449,Master!D5<520),Spitzenlastkessel!C15,\"Anlagenheizlast zu groß\")))))))))))))))))))))))","v":"Spitzenlastkessel GMR 3035 (35 kW)"},null,null,{"$f":"IF(AND(Master!D5>29,Master!D5<55),Spitzenlastkessel!E4,(IF(AND(Master!D5>54,Master!D5<65),Spitzenlastkessel!E5,(IF(AND(Master!D5>64,Master!D5<85),Spitzenlastkessel!E6,(IF(AND(Master!D5>84,Master!D5<110),Spitzenlastkessel!E7,(IF(AND(Master!D5>109,Master!D5<135),Spitzenlastkessel!E8,(IF(AND(Master!D5>134,Master!D5<150),Spitzenlastkessel!E9,(IF(AND(Master!D5>149,Master!D5<200),Spitzenlastkessel!E10,(IF(AND(Master!D5>199,Master!D5<240),Spitzenlastkessel!E11,(IF(AND(Master!D5>239,Master!D5<300),Spitzenlastkessel!E12,(IF(AND(Master!D5>299,Master!D5<370),Spitzenlastkessel!E13,(IF(AND(Master!D5>369,Master!D5<450),Spitzenlastkessel!E14,(IF(AND(Master!D5>449,Master!D5<520),Spitzenlastkessel!E15,\"Anlagenheizlast zu groß\")))))))))))))))))))))))","v":3600},"€","(gewählt)",null,null,null,null,null,{"$f":"(D58+D59)","v":40},"Max Leistung BW plus Leistung GAWP"]
["Investitionskosten gesamt: ",null,null,{"$f":"(D51+D53-D52)","v":{"$error":"#VALUE!"}},"€",null,null,null,"N_I_GAWP_u_BW",null,null,{"$f":"(100/L53)*D59","v":100},"Prozentuale Anlagenheizlast von GAWP"]
[null,null,null,null,null,null,null,null,null,null,null,{"$f":"MROUND(L54,5)","v":100},"Gerundet",null,null,null,"Prozentuale \nAnlagen-\nheizlast \nder GAWP"]
["3b",null,null,null,null,null,null,null,null,null,null,{"$f":"VLOOKUP(L55,Q59:R86,2)","v":100},"Deckungsrate GAWP",null,null,null,null,"Deckungs-\nrate"]
["Betriebskosten"]
["Max. Leistung Brennwertgerät",null,null,{"$f":"IF(L46<0,0,(Master!D5-D59))","v":0},"kW"]
["Leistung 3 x GAWP",null,null,{"$f":"(L49)","v":40},"kW",null,null,null,null,null,null,null,null,null,null,null,0,0]
[null,null,null,null,null,null,null,null,null,null,null,null,null,null,null,null,5,8]
["Deckungsrate Brennwertgerät",null,null,{"$f":"(100-D62)","v":0},"%","(Ergibt sich aus Leistungsverhältnis Brennwertgerät/GAWP)",null,null,null,null,null,null,null,null,null,null,10,15]
["Deckungsrate 3 x GAWP",null,null,{"$f":"VLOOKUP(L55,Q59:R86,2)","v":100},"%","(Ergibt sich aus Leistungsverhältnis Brennwertgerät/GAWP)",null,null,null,null,null,null,null,null,null,null,15,25]
[null,null,null,null,null,null,null,null,null,null,null,null,null,null,null,null,20,33]
["Jahresarbeit Gas-Brennwertgerät",null,null,{"$f":"(D37*(D61/100))","v":0},"kWh/a","(Deckungsrate berücksichtigt)"]
["Jahresarbeit 3 x GAWP",null,null,{"$f":"(D37*(D62/100))","v":80000},"kWh/a","(Deckungsrate berücksichtigt)",null,null,null,null,null,null,null,null,null,null,25,41]
[null,null,null,null,null,null,null,null,null,null,null,null,null,null,null,null,30,50]
["Vollbenutzungsstunden Gas-Brennwertgerät",null,null,{"$f":"IF(D58=0,0,(D64/D58))","v":0},"h","(ergibt sich aus Jahresarbeit/Leistung)"]
["Vollbenutzungsstunden 3 x GAWP",null,null,{"$f":"(D65/D59)","v":2000},"h","(ergibt sich aus Jahresarbeit/Leistung)",null,null,null,null,null,null,null,null,null,null,35,58]
[null,null,null,null,null,null,null,null,null,null,null,null,null,null,null,null,40,67]
["Gasverbrauch Gas-Brennwertgerät",null,null,{"$f":"(D64/D5)","v":0},"kWh/a","(ergibt sich aus Jahresarbeit/Wirkungsgrad)",null,null,"N_B_GAS_BW"]
["Gasverbrauch 3 x GAWP",null,null,{"$f":"(D65/D6)","v":53333.333333333336},"kWh/a","(ergibt sich aus Jahresarbeit/Wirkungsgrad)",null,null,"N_B_GAS_GAWP",null,null,null,null,null,null,null,45,75]
[null,null,null,null,null,null,null,null,null,null,null,null,null,null,null,null,50,80]
["Kosten Gasverbrauch Gas-Brennwertgerät",null,null,{"$f":"(D70*D18)","v":0},"€/a","(ergibt sich aus Gasverbrauch x mittlerer Gaspreis)"]
["Kosten Gasverbrauch 3 x GAWP",null,null,{"$f":"(D71*D18)","v":6012.6722071138993},"€/a","(ergibt sich aus Gasverbrauch x mittlerer Gaspreis)",null,null,null,null,null,null,null,null,null,null,55,83]
[null,null,null,null,null,null,null,null,null,null,null,null,null,null,null,null,60,87]
["Wartungskosten Gas-Brennwertgerät",null,null,300,"€/a",null,null,null,"N_B_WART_BW"]
["Wartungskosten 3 x GAWP",null,null,700,"€/a",null,null,null,"N_B_WART_GAWP",null,null,null,null,null,null,null,65,90]
[null,null,null,null,null,null,null,null,null,null,null,null,null,null,null,null,70,92]
["Stromverbrauch 3 x GAWP",null,null,{"$f":"(D68*D7)*3","v":6540},"kWh/a",null,null,null,"N_B_STROM_LÜ_GAWP",null,null,null,null,null,null,null,75,94]
["Stromkosten 3 x GAWP",null,null,{"$f":"(D79*D26)","v":2681.1051978085161},"€/a","(Stromverbrauch x mittlerer Strompreis)",null,null,null,null,null,null,null,null,null,null,80,96]
["Stromverbrauch Gas-Brennwertgerät",null,null,{"$f":"(D67*D8)","v":0},"kWh/a",null,null,null,"N_B_STROM_BW"]
["Stromkosten Gas-Brennwertgerät",null,null,{"$f":"(D81*D26)","v":0},"€/a","(Stromverbrauch x mittlerer Strompreis)"]
["Stromverbrauch 3 x Umwälzpumpe GAWP",null,null,{"$f":"((D68)*D9)*3","v":300},"kWh/a",null,null,null,"N_B_STROM_PU_GAWP",null,null,null,null,null,null,null,85,97]
["Stromkosten 3 x Umwälzpumpe GAWP",null,null,{"$f":"(D83*D26)","v":122.98647696369339},"€/a","(Stromverbrauch x mittlerer Strompreis)",null,null,null,null,null,null,null,null,null,null,90,98]
[null,null,null,null,null,null,null,null,null,null,null,null,null,null,null,null,95,99]
["Betriebskosten pro Jahr gesamt:",null,null,{"$f":"SUM(D73:D77)+D84+D80+D82","v":9816.7638818861087},"€/a",null,null,null,null,null,null,null,null,null,null,null,100,100]
[]
["FAZIT:"]
["Mittlere Energieeinsparung pro Jahr bei Einsatz"]
["von drei GAWP LW und Gas-Brennwertgerät"]
["gegenüber bestehenden Betriebskosten",null,null,{"$f":"(D44-D86)","v":5552.8264460021419},"€/a"]
[]
["Differenz Investitionskosten:",null,null,{"$f":"(D54-D33)","v":{"$error":"#VALUE!"}},"€"]
[]
["Für einen auf 20 Jahre gemittelten Engergiepreis"]
["ergibt sich eine Amortisationszeit von: ",null,null,{"$f":"IF((D93/D91)<0,\"sofort\",(D93/D91))","v":{"$error":"#VALUE!"}},{"$f":"IF((D93/D91)<0,\"\",\"Jahren\")","v":{"$error":"#VALUE!"}}]

{"sheet":"LW bival PL","index":8,"n_rows":95,"n_cols":18,"rows_kept":95,"cut":false,"hidden":false,"merged":[[53,16,56,16],[54,17,56,17]]}
["Aktueller Gaspreis",null,null,{"$f":"(Energiepreisberechnung!D28)","v":5.5E-2},"€/kWh"]
["Aktueller Pelletpreis",null,null,{"$f":"(Energiepreisberechnung!D32)","v":0.05},"€/kWh"]
["Aktueller Strompreis",null,null,{"$f":"(Energiepreisberechnung!D31)","v":0.2},"€/kWh"]
["Gemittelter Wirkungsgrad Gasbrennwertgerät",null,null,1.06]
["Gemittelter Wirkungsgrad Pelletkessel",null,null,0.93]
["Gemittelter Wirkungsgrad GAWP LW",null,null,1.5]
["Elektr. Leistung GAWP LW",null,null,1.0900000000000001,"kW"]
["Elektr. Leistung Kesselkreispumpe",null,null,0.05,"kW"]
[]
["Gesucht:","Investitions- und Betriebskosten während 20 Jahren"]
[]
["1."]
["Errechnung der mittleren Energiepreise binnen 20 Jahren"]
[]
["Gaspreis Anfangsjahr:",null,null,{"$f":"(D1)","v":5.5E-2},"€/kWh"]
["Gaspreis im 20´sten Jahr:",null,null,{"$f":"(Energiepreisberechnung!C22)","v":0.19890901442685968},"€/kWh"]
["Mittlerer Gaspreis während 20 Jahren:",null,null,{"$f":"(Energiepreisberechnung!C24)","v":0.11273760388338561},"€/kWh"]
[]
["Pelletpreis Anfangsjahr:",null,null,{"$f":"(D2)","v":0.05},"€/kWh"]
["Pelletpreis im 20´sten Jahr:",null,null,{"$f":"(Energiepreisberechnung!G22)","v":0.18082637675169067},"€/kWh"]
["Mittlerer Pelletpreis während 20 Jahren:",null,null,{"$f":"(Energiepreisberechnung!G24)","v":0.10248873080307783},"€/kWh"]
[]
["Strompreis Anfangsjahr:",null,null,{"$f":"(D3)","v":0.2},"€/kWh"]
["Strompreis im 20´sten Jahr:",null,null,{"$f":"(Energiepreisberechnung!E22)","v":0.72330550700676266},"€/kWh"]
["Mittlerer Strompreis während 20 Jahren:",null,null,{"$f":"(Energiepreisberechnung!E24)","v":0.40995492321231131},"€/kWh"]
[]
["2."]
["Betrachtung für einen neuen Pelletkessel + Silo",null,null,{"$f":"(Master!D5)","v":40},"kW"]
[]
["2a"]
["Investitionskosten",null,null,{"$f":"(Master!D8)","v":5000},"€"]
["Investitionskosten gesamt: ",null,null,{"$f":"(D31)","v":5000},"€",null,null,null,"R_I_PL"]
[]
["2b"]
["Betriebskosten Pelletkessel"]
["Jahresarbeit Pelletkessel",null,null,{"$f":"(Master!D5*Master!D6)","v":80000},"kWh/a","(Leistung x Jahresvollbenutzungsstunden)"]
["Energieverbrauch Pelletkessel",null,null,{"$f":"(D36/D5)","v":86021.505376344081},"kWh/a","(Wirkungsgrad berücksichtigt)",null,null,"R_B_PL"]
["Kosten Pellets",null,null,{"$f":"(D37*D21)","v":8816.2349077916406},"€/a"]
["Wartungskosten Pelletkessel",null,null,500,"€/a",null,null,null,"R_B_WART_PL"]
["Stromverbrauch 1 Stück Kesselkreispumpe",null,null,{"$f":"(Master!D6*D8)","v":100},"kWh/a",null,null,null,"R_B_STROM_PL"]
["Stromkosten 1 Stück Kesselkreispumpe",null,null,{"$f":"(D40*D25)","v":40.995492321231133},"€/a","(Stromverbrauch x mittlerer Strompreis)"]
[]
["Betriebskosten pro Jahr gesamt:",null,null,{"$f":"SUM(D38:D39)+D41","v":9357.2304001128723},"€/a"]
[null,null,null,null,null,null,null,null,null,null,null,"Negative Werte sollen gleich Null gesetzt werden"]
["3.",null,null,null,null,null,null,null,null,null,null,{"$f":"(Master!D5-D58)","v":5}]
["Betrachtung für eine GAWP 35 LW (35 kW) sowie Spitzenlastkessel"]
[null,null,null,null,null,null,null,null,null,null,null,"Wärmepumpe soll nur die Anlagenheizlast erbringen, welche erforderlich ist"]
["3a",null,null,null,null,null,null,null,null,null,null,{"$f":"IF(Master!D5<35,Master!D5,35)","v":35}]
["Investitionskosten"]
["GAWP + Zubehör",null,null,{"$f":"IF(Master!T15=TRUE,25000, (IF(Master!T16=TRUE,45000, (IF(Master!T17=TRUE,65000,\"\")))))","v":""},"€",null,null,null,null,null,null,"Deckungsrate GAWP"]
["Förderung BAFA",null,null,{"$f":"IF(Master!$T$15=TRUE,(2400+100*25), (IF(Master!$T$16=TRUE,(2400+100*60), (IF(Master!$T$17=TRUE,(2400+100*95),\"\")))))","v":""},"€",null,null,null,null,null,null,{"$f":"(D57+D58)","v":40},"Max Leistung BW plus Leistung GAWP"]
[{"$f":"IF(AND(Master!D5>29,Master!D5<55),Spitzenlastkessel!C4,(IF(AND(Master!D5>54,Master!D5<65),Spitzenlastkessel!C5,(IF(AND(Master!D5>64,Master!D5<85),Spitzenlastkessel!C6,(IF(AND(Master!D5>84,Master!D5<110),Spitzenlastkessel!C7,(IF(AND(Master!D5>109,Master!D5<135),Spitzenlastkessel!C8,(IF(AND(Master!D5>134,Master!D5<150),Spitzenlastkessel!C9,(IF(AND(Master!D5>149,Master!D5<200),Spitzenlastkessel!C10,(IF(AND(Master!D5>199,Master!D5<240),Spitzenlastkessel!C11,(IF(AND(Master!D5>239,Master!D5<300),Spitzenlastkessel!C12,(IF(AND(Master!D5>299,Master!D5<370),Spitzenlastkessel!C13,(IF(AND(Master!D5>369,Master!D5<450),Spitzenlastkessel!C14,(IF(AND(Master!D5>449,Master!D5<520),Spitzenlastkessel!C15,\"Anlagenheizlast zu groß\")))))))))))))))))))))))","v":"Spitzenlastkessel GMR 3035 (35 kW)"},null,null,{"$f":"IF(AND(Master!D5>29,Master!D5<55),Spitzenlastkessel!E4,(IF(AND(Master!D5>54,Master!D5<65),Spitzenlastkessel!E5,(IF(AND(Master!D5>64,Master!D5<85),Spitzenlastkessel!E6,(IF(AND(Master!D5>84,Master!D5<110),Spitzenlastkessel!E7,(IF(AND(Master!D5>109,Master!D5<135),Spitzenlastkessel!E8,(IF(AND(Master!D5>134,Master!D5<150),Spitzenlastkessel!E9,(IF(AND(Master!D5>149,Master!D5<200),Spitzenlastkessel!E10,(IF(AND(Master!D5>199,Master!D5<240),Spitzenlastkessel!E11,(IF(AND(Master!D5>239,Master!D5<300),Spitzenlastkessel!E12,(IF(AND(Master!D5>299,Master!D5<370),Spitzenlastkessel!E13,(IF(AND(Master!D5>369,Master!D5<450),Spitzenlastkessel!E14,(IF(AND(Master!D5>449,Master!D5<520),Spitzenlastkessel!E15,\"Anlagenheizlast zu groß\")))))))))))))))))))))))","v":3600},"€","(gewählt)",null,null,null,null,null,{"$f":"(100/L51)*D58","v":87.5},"Prozentuale Anlagenheizlast von GAWP"]
["Investitionskosten gesamt: ",null,null,{"$f":"(D50+D52-D51)","v":{"$error":"#VALUE!"}},"€",null,null,null,"N_I_GAWP_u_BW",null,null,{"$f":"MROUND(L52,5)","v":90},"Gerundet"]
[null,null,null,null,null,null,null,null,null,null,null,null,null,null,null,null,"Prozentuale \nAnlagen-\nheizlast \nder GAWP"]
["3b",null,null,null,null,null,null,null,null,null,null,{"$f":"VLOOKUP(L53,Q58:R85,2)","v":98},"Deckungsrate GAWP",null,null,null,null,"Deckungs-\nrate"]
["Betriebskosten"]
["Max. Leistung Brennwertgerät",null,null,{"$f":"IF(L45<0,0,(Master!D5-D58))","v":5},"kW"]
["Leistung GAWP",null,null,{"$f":"(L48)","v":35},"kW",null,null,null,null,null,null,null,null,null,null,null,0,0]
[null,null,null,null,null,null,null,null,null,null,null,null,null,null,null,null,5,8]
["Deckungsrate Brennwertgerät",null,null,{"$f":"(100-D61)","v":2},"%","(Ergibt sich aus Leistungsverhältnis Brennwertgerät/GAWP)",null,null,null,null,null,null,null,null,null,null,10,15]
["Deckungsrate GAWP",null,null,{"$f":"VLOOKUP(L53,Q58:R85,2)","v":98},"%","(Ergibt sich aus Leistungsverhältnis Brennwertgerät/GAWP)",null,null,null,null,null,null,null,null,null,null,15,25]
[null,null,null,null,null,null,null,null,null,null,null,null,null,null,null,null,20,33]
["Jahresarbeit Gas-Brennwertgerät",null,null,{"$f":"(D36*(D60/100))","v":1600},"kWh/a","(Deckungsrate berücksichtigt)"]
["Jahresarbeit GAWP",null,null,{"$f":"(D36*(D61/100))","v":78400},"kWh/a","(Deckungsrate berücksichtigt)",null,null,null,null,null,null,null,null,null,null,25,41]
[null,null,null,null,null,null,null,null,null,null,null,null,null,null,null,null,30,50]
["Vollbenutzungsstunden Gas-Brennwertgerät",null,null,{"$f":"IF(D57=0,0,(D63/D57))","v":320},"h","(ergibt sich aus Jahresarbeit/Leistung)"]
["Vollbenutzungsstunden GAWP",null,null,{"$f":"(D64/D58)","v":2240},"h","(ergibt sich aus Jahresarbeit/Leistung)",null,null,null,null,null,null,null,null,null,null,35,58]
[null,null,null,null,null,null,null,null,null,null,null,null,null,null,null,null,40,67]
["Gasverbrauch Gas-Brennwertgerät",null,null,{"$f":"(D63/D4)","v":1509.433962264151},"kWh/a","(ergibt sich aus Jahresarbeit/Wirkungsgrad)",null,null,"N_B_GAS_BW"]
["Gasverbrauch GAWP",null,null,{"$f":"(D64/D6)","v":52266.666666666664},"kWh/a","(ergibt sich aus Jahresarbeit/Wirkungsgrad)",null,null,"N_B_GAS_GAWP",null,null,null,null,null,null,null,45,75]
[null,null,null,null,null,null,null,null,null,null,null,null,null,null,null,null,50,80]
["Kosten Gasverbrauch Gas-Brennwertgerät",null,null,{"$f":"(D69*D17)","v":170.16996812586507},"€/a","(ergibt sich aus Gasverbrauch x mittlerer Gaspreis)"]
["Kosten Gasverbrauch GAWP",null,null,{"$f":"(D70*D17)","v":5892.4187629716207},"€/a","(ergibt sich aus Gasverbrauch x mittlerer Gaspreis)",null,null,null,null,null,null,null,null,null,null,55,83]
[null,null,null,null,null,null,null,null,null,null,null,null,null,null,null,null,60,87]
["Wartungskosten Gas-Brennwertgerät",null,null,300,"€/a",null,null,null,"N_B_WART_BW"]
["Wartungskosten GAWP",null,null,300,"€/a",null,null,null,"N_B_WART_GAWP",null,null,null,null,null,null,null,65,90]
[null,null,null,null,null,null,null,null,null,null,null,null,null,null,null,null,70,92]
["Stromverbrauch GAWP",null,null,{"$f":"(D67*D7)","v":2441.6000000000004},"kWh/a",null,null,null,"N_B_STROM_LÜ_GAWP",null,null,null,null,null,null,null,75,94]
["Stromkosten GAWP",null,null,{"$f":"(D78*D25)","v":1000.9459405151795},"€/a","(Stromverbrauch x mittlerer Strompreis)",null,null,null,null,null,null,null,null,null,null,80,96]
["Stromverbrauch Gas-Brennwertgerät",null,null,{"$f":"(D66*D8)","v":16},"kWh/a",null,null,null,"N_B_STROM_BW"]
["Stromkosten Gas-Brennwertgerät",null,null,{"$f":"(D80*D25)","v":6.5592787713969809},"€/a","(Stromverbrauch x mittlerer Strompreis)"]
["Stromverbrauch Umwälzpumpe GAWP",null,null,{"$f":"((D67)*D8)","v":112},"kWh/a",null,null,null,"N_B_STROM_PU_GAWP",null,null,null,null,null,null,null,85,97]
["Stromkosten Umwälzpumpe GAWP",null,null,{"$f":"(D82*D25)","v":45.914951399778865},"€/a","(Stromverbrauch x mittlerer Strompreis)",null,null,null,null,null,null,null,null,null,null,90,98]
[null,null,null,null,null,null,null,null,null,null,null,null,null,null,null,null,95,99]
["Betriebskosten pro Jahr gesamt:",null,null,{"$f":"SUM(D72:D76)+D83+D79+D81","v":7716.0089017838409},"€/a",null,null,null,null,null,null,null,null,null,null,null,100,100]
[]
["FAZIT:"]
["Mittlere Energieeinsparung pro Jahr bei Einsatz"]
["von einer GAWP LW und Gas-Brennwertgerät"]
["gegenüber den Betriebskosten eines Pelletkessels:",null,null,{"$f":"(D43-D85)","v":1641.2214983290314},"€/a"]
[]
["Differenz Investitionskosten:",null,null,{"$f":"(D53-D32)","v":{"$error":"#VALUE!"}},"€"]
[]
["Für einen auf 20 Jahre gemittelten Engergiepreis"]
["ergibt sich eine Amortisationszeit von: ",null,null,{"$f":"IF((D92/D90)<0,\"sofort\",(D92/D90))","v":{"$error":"#VALUE!"}},{"$f":"IF((D92/D90)<0,\"\",\"Jahren\")","v":{"$error":"#VALUE!"}}]

{"sheet":"LW2 bival PL","index":9,"n_rows":96,"n_cols":18,"rows_kept":96,"cut":false,"hidden":false,"merged":[[54,16,57,16],[55,17,57,17]]}
["Aktueller Gaspreis",null,null,{"$f":"(Energiepreisberechnung!D28)","v":5.5E-2},"€/kWh"]
["Aktueller Pelletpreis",null,null,{"$f":"(Energiepreisberechnung!D32)","v":0.05},"€/kWh"]
["Aktueller Strompreis",null,null,{"$f":"(Energiepreisberechnung!D31)","v":0.2},"€/kWh"]
["Gemittelter Wirkungsgrad Gasbrennwertgerät",null,null,1.06]
["Gemittelter Wirkungsgrad Pelletkessel",null,null,0.93]
["Gemittelter Wirkungsgrad GAWP LW",null,null,1.5]
["Elektr. Leistung GAWP LW",null,null,1.0900000000000001,"kW"]
["Elektr. Leistung Kesselkreispumpe",null,null,0.06,"kW"]
["Elektr. Leistung Umwälzpumpe GAWP",null,null,0.05,"kW"]
[]
["Gesucht:","Investitions- und Betriebskosten während 20 Jahren"]
[]
["1."]
["Errechnung der mittleren Energiepreise binnen 20 Jahren"]
[]
["Gaspreis Anfangsjahr:",null,null,{"$f":"(D1)","v":5.5E-2},"€/kWh"]
["Gaspreis im 20´sten Jahr:",null,null,{"$f":"(Energiepreisberechnung!C22)","v":0.19890901442685968},"€/kWh"]
["Mittlerer Gaspreis während 20 Jahren:",null,null,{"$f":"(Energiepreisberechnung!C24)","v":0.11273760388338561},"€/kWh"]
[]
["Pelletpreis Anfangsjahr:",null,null,{"$f":"(D2)","v":0.05},"€/kWh"]
["Pelletpreis im 20´sten Jahr:",null,null,{"$f":"(Energiepreisberechnung!G22)","v":0.18082637675169067},"€/kWh"]
["Mittlerer Pelletpreis während 20 Jahren:",null,null,{"$f":"(Energiepreisberechnung!G24)","v":0.10248873080307783},"€/kWh"]
[]
["Strompreis Anfangsjahr:",null,null,{"$f":"(D3)","v":0.2},"€/kWh"]
["Strompreis im 20´sten Jahr:",null,null,{"$f":"(Energiepreisberechnung!E22)","v":0.72330550700676266},"€/kWh"]
["Mittlerer Strompreis während 20 Jahren:",null,null,{"$f":"(Energiepreisberechnung!E24)","v":0.40995492321231131},"€/kWh"]
[]
["2."]
["Betrachtung für einen neuen Pelletkessel + Silo",null,null,{"$f":"(Master!D5)","v":40},"kW"]
[]
["2a"]
["Investitionskosten",null,null,{"$f":"(Master!D8)","v":5000},"€"]
["Investitionskosten gesamt: ",null,null,{"$f":"(D32)","v":5000},"€",null,null,null,"R_I_PL"]
[]
["2b"]
["Betriebskosten Pelletkessel"]
["Jahresarbeit Pelletkessel",null,null,{"$f":"(Master!D5*Master!D6)","v":80000},"kWh/a","(Leistung x Jahresvollbenutzungsstunden)"]
["Energieverbrauch Pelletkessel",null,null,{"$f":"(D37/D5)","v":86021.505376344081},"kWh/a","(Wirkungsgrad berücksichtigt)",null,null,"R_B_PL"]
["Kosten Pellets",null,null,{"$f":"(D38*D22)","v":8816.2349077916406},"€/a"]
["Wartungskosten Pelletkessel",null,null,500,"€/a",null,null,null,"R_B_WART_PL"]
["Stromverbrauch 1 Stück Kesselkreispumpe",null,null,{"$f":"(Master!D6*D8)","v":120},"kWh/a",null,null,null,"R_B_STROM_PL"]
["Stromkosten 1 Stück Kesselkreispumpe",null,null,{"$f":"(D41*D26)","v":49.194590785477359},"€/a","(Stromverbrauch x mittlerer Strompreis)"]
[]
["Betriebskosten pro Jahr gesamt:",null,null,{"$f":"SUM(D39:D40)+D42","v":9365.4294985771176},"€/a"]
[null,null,null,null,null,null,null,null,null,null,null,"Negative Werte sollen gleich Null gesetzt werden"]
["3.",null,null,null,null,null,null,null,null,null,null,{"$f":"(Master!D5-D59)","v":0}]
["Betrachtung für zwei GAWP 35 LW (70 kW) sowie Spitzenlastkessel"]
[null,null,null,null,null,null,null,null,null,null,null,"Wärmepumpe soll nur die Anlagenheizlast erbringen, welche erforderlich ist"]
["3a",null,null,null,null,null,null,null,null,null,null,{"$f":"IF(Master!D5<70,Master!D5,70)","v":40}]
["Investitionskosten"]
["2 x GAWP + Zubehör",null,null,{"$f":"IF(Master!T15=TRUE,25000, (IF(Master!T16=TRUE,45000, (IF(Master!T17=TRUE,65000,\"\")))))","v":""},"€",null,null,null,null,null,null,"Deckungsrate GAWP"]
["Förderung BAFA",null,null,{"$f":"IF(Master!$T$15=TRUE,(2400+100*25), (IF(Master!$T$16=TRUE,(2400+100*60), (IF(Master!$T$17=TRUE,(2400+100*95),\"\")))))","v":""},"€",null,null,null,null,null,null,{"$f":"(D58+D59)","v":40},"Max Leistung BW plus Leistung GAWP"]
[{"$f":"IF(AND(Master!D5>29,Master!D5<55),Spitzenlastkessel!C4,(IF(AND(Master!D5>54,Master!D5<65),Spitzenlastkessel!C5,(IF(AND(Master!D5>64,Master!D5<85),Spitzenlastkessel!C6,(IF(AND(Master!D5>84,Master!D5<110),Spitzenlastkessel!C7,(IF(AND(Master!D5>109,Master!D5<135),Spitzenlastkessel!C8,(IF(AND(Master!D5>134,Master!D5<150),Spitzenlastkessel!C9,(IF(AND(Master!D5>149,Master!D5<200),Spitzenlastkessel!C10,(IF(AND(Master!D5>199,Master!D5<240),Spitzenlastkessel!C11,(IF(AND(Master!D5>239,Master!D5<300),Spitzenlastkessel!C12,(IF(AND(Master!D5>299,Master!D5<370),Spitzenlastkessel!C13,(IF(AND(Master!D5>369,Master!D5<450),Spitzenlastkessel!C14,(IF(AND(Master!D5>449,Master!D5<520),Spitzenlastkessel!C15,\"Anlagenheizlast zu groß\")))))))))))))))))))))))","v":"Spitzenlastkessel GMR 3035 (35 kW)"},null,null,{"$f":"IF(AND(Master!D5>29,Master!D5<55),Spitzenlastkessel!E4,(IF(AND(Master!D5>54,Master!D5<65),Spitzenlastkessel!E5,(IF(AND(Master!D5>64,Master!D5<85),Spitzenlastkessel!E6,(IF(AND(Master!D5>84,Master!D5<110),Spitzenlastkessel!E7,(IF(AND(Master!D5>109,Master!D5<135),Spitzenlastkessel!E8,(IF(AND(Master!D5>134,Master!D5<150),Spitzenlastkessel!E9,(IF(AND(Master!D5>149,Master!D5<200),Spitzenlastkessel!E10,(IF(AND(Master!D5>199,Master!D5<240),Spitzenlastkessel!E11,(IF(AND(Master!D5>239,Master!D5<300),Spitzenlastkessel!E12,(IF(AND(Master!D5>299,Master!D5<370),Spitzenlastkessel!E13,(IF(AND(Master!D5>369,Master!D5<450),Spitzenlastkessel!E14,(IF(AND(Master!D5>449,Master!D5<520),Spitzenlastkessel!E15,\"Anlagenheizlast zu groß\")))))))))))))))))))))))","v":3600},"€","(gewählt)",null,null,null,null,null,{"$f":"(100/L52)*D59","v":100},"Prozentuale Anlagenheizlast von GAWP"]
["Investitionskosten gesamt: ",null,null,{"$f":"(D51+D53-D52)","v":{"$error":"#VALUE!"}},"€",null,null,null,"N_I_GAWP_u_BW",null,null,{"$f":"MROUND(L53,5)","v":100},"Gerundet"]
[null,null,null,null,null,null,null,null,null,null,null,null,null,null,null,null,"Prozentuale \nAnlagen-\nheizlast \nder GAWP"]
["3b",null,null,null,null,null,null,null,null,null,null,{"$f":"VLOOKUP(L54,Q59:R86,2)","v":100},"Deckungsrate GAWP",null,null,null,null,"Deckungs-\nrate"]
["Betriebskosten"]
["Max. Leistung Brennwertgerät",null,null,{"$f":"IF(L46<0,0,(Master!D5-D59))","v":0},"kW"]
["Leistung 2 x GAWP",null,null,{"$f":"(L49)","v":40},"kW",null,null,null,null,null,null,null,null,null,null,null,0,0]
[null,null,null,null,null,null,null,null,null,null,null,null,null,null,null,null,5,8]
["Deckungsrate Brennwertgerät",null,null,{"$f":"(100-D62)","v":0},"%","(Ergibt sich aus Leistungsverhältnis Brennwertgerät/GAWP)",null,null,null,null,null,null,null,null,null,null,10,15]
["Deckungsrate 2 x GAWP",null,null,{"$f":"VLOOKUP(L54,Q59:R86,2)","v":100},"%","(Ergibt sich aus Leistungsverhältnis Brennwertgerät/GAWP)",null,null,null,null,null,null,null,null,null,null,15,25]
[null,null,null,null,null,null,null,null,null,null,null,null,null,null,null,null,20,33]
["Jahresarbeit Gas-Brennwertgerät",null,null,{"$f":"(D37*(D61/100))","v":0},"kWh/a","(Deckungsrate berücksichtigt)"]
["Jahresarbeit 2 x GAWP",null,null,{"$f":"(D37*(D62/100))","v":80000},"kWh/a","(Deckungsrate berücksichtigt)",null,null,null,null,null,null,null,null,null,null,25,41]
[null,null,null,null,null,null,null,null,null,null,null,null,null,null,null,null,30,50]
["Vollbenutzungsstunden Gas-Brennwertgerät",null,null,{"$f":"IF(D58=0,0,(D64/D58))","v":0},"h","(ergibt sich aus Jahresarbeit/Leistung)"]
["Vollbenutzungsstunden 2 x GAWP",null,null,{"$f":"(D65/D59)","v":2000},"h","(ergibt sich aus Jahresarbeit/Leistung)",null,null,null,null,null,null,null,null,null,null,35,58]
[null,null,null,null,null,null,null,null,null,null,null,null,null,null,null,null,40,67]
["Gasverbrauch Gas-Brennwertgerät",null,null,{"$f":"(D64/D4)","v":0},"kWh/a","(ergibt sich aus Jahresarbeit/Wirkungsgrad)",null,null,"N_B_GAS_BW"]
["Gasverbrauch 2 x GAWP",null,null,{"$f":"(D65/D6)","v":53333.333333333336},"kWh/a","(ergibt sich aus Jahresarbeit/Wirkungsgrad)",null,null,"N_B_GAS_GAWP",null,null,null,null,null,null,null,45,75]
[null,null,null,null,null,null,null,null,null,null,null,null,null,null,null,null,50,80]
["Kosten Gasverbrauch Gas-Brennwertgerät",null,null,{"$f":"(D70*D18)","v":0},"€/a","(ergibt sich aus Gasverbrauch x mittlerer Gaspreis)"]
["Kosten Gasverbrauch 2 x GAWP",null,null,{"$f":"(D71*D18)","v":6012.6722071138993},"€/a","(ergibt sich aus Gasverbrauch x mittlerer Gaspreis)",null,null,null,null,null,null,null,null,null,null,55,83]
[null,null,null,null,null,null,null,null,null,null,null,null,null,null,null,null,60,87]
["Wartungskosten Gas-Brennwertgerät",null,null,300,"€/a",null,null,null,"N_B_WART_BW"]
["Wartungskosten 2 x GAWP",null,null,500,"€/a",null,null,null,"N_B_WART_GAWP",null,null,null,null,null,null,null,65,90]
[null,null,null,null,null,null,null,null,null,null,null,null,null,null,null,null,70,92]
["Stromverbrauch 2 x GAWP",null,null,{"$f":"(D68*D7)*2","v":4360},"kWh/a",null,null,null,"N_B_STROM_LÜ_GAWP",null,null,null,null,null,null,null,75,94]
["Stromkosten 2 x GAWP",null,null,{"$f":"(D79*D26)","v":1787.4034652056773},"€/a","(Stromverbrauch x mittlerer Strompreis)",null,null,null,null,null,null,null,null,null,null,80,96]
["Stromverbrauch Gas-Brennwertgerät",null,null,{"$f":"(D67*D8)","v":0},"kWh/a",null,null,null,"N_B_STROM_BW"]
["Stromkosten Gas-Brennwertgerät",null,null,{"$f":"(D81*D26)","v":0},"€/a","(Stromverbrauch x mittlerer Strompreis)"]
["Stromverbrauch 2 x Umwälzpumpe GAWP",null,null,{"$f":"((D68)*D9)*2","v":200},"kWh/a",null,null,null,"N_B_STROM_PU_GAWP",null,null,null,null,null,null,null,85,97]
["Stromkosten 2 x Umwälzpumpe GAWP",null,null,{"$f":"(D83*D26)","v":81.990984642462266},"€/a","(Stromverbrauch x mittlerer Strompreis)",null,null,null,null,null,null,null,null,null,null,90,98]
[null,null,null,null,null,null,null,null,null,null,null,null,null,null,null,null,95,99]
["Betriebskosten pro Jahr gesamt:",null,null,{"$f":"SUM(D73:D77)+D84+D80+D82","v":8682.0666569620389},"€/a",null,null,null,null,null,null,null,null,null,null,null,100,100]
[]
["FAZIT:"]
["Mittlere Energieeinsparung pro Jahr bei Einsatz"]
["von zwei GAWP LW und Gas-Brennwertgerät"]
["gegenüber den Betriebskosten eines Pelletkessels:",null,null,{"$f":"IF((D44-D86)<0,\"negativ\",(D44-D86))","v":683.36284161507865},"€/a"]
[]
["Differenz Investitionskosten:",null,null,{"$f":"(D54-D33)","v":{"$error":"#VALUE!"}},"€"]
[]
["Für einen auf 20 Jahre gemittelten Engergiepreis"]
["ergibt sich eine Amortisationszeit von: ",null,null,{"$f":"IF(D91=\"negativ\",\"negativ\",(IF(D93<0,\"sofort\",D93/D91)))","v":{"$error":"#VALUE!"}},{"$f":"IF(D91=\"negativ\",\"\",(IF(D93<0,\"\",\"Jahren\")))","v":{"$error":"#VALUE!"}}]

{"sheet":"LW3 bival PL","index":10,"n_rows":96,"n_cols":18,"rows_kept":96,"cut":false,"hidden":false,"merged":[[54,16,57,16],[55,17,57,17]]}
["Aktueller Gaspreis",null,null,{"$f":"(Energiepreisberechnung!D28)","v":5.5E-2},"€/kWh"]
["Aktueller Pelletpreis",null,null,{"$f":"(Energiepreisberechnung!D32)","v":0.05},"€/kWh"]
["Aktueller Strompreis",null,null,{"$f":"(Energiepreisberechnung!D31)","v":0.2},"€/kWh"]
["Gemittelter Wirkungsgrad Gasbrennwertgerät",null,null,1.06]
["Gemittelter Wirkungsgrad Pelletkessel",null,null,0.93]
["Gemittelter Wirkungsgrad GAWP LW",null,null,1.5]
["Elektr. Leistung GAWP LW",null,null,1.0900000000000001,"kW"]
["Elektr. Leistung Kesselkreispumpe",null,null,0.1,"kW"]
["Elektr. Leistung Umwälzpumpe GAWP",null,null,0.05,"kW"]
[]
["Gesucht:","Investitions- und Betriebskosten während 20 Jahren"]
[]
["1."]
["Errechnung der mittleren Energiepreise binnen 20 Jahren"]
[]
["Gaspreis Anfangsjahr:",null,null,{"$f":"(D1)","v":5.5E-2},"€/kWh"]
["Gaspreis im 20´sten Jahr:",null,null,{"$f":"(Energiepreisberechnung!C22)","v":0.19890901442685968},"€/kWh"]
["Mittlerer Gaspreis während 20 Jahren:",null,null,{"$f":"(Energiepreisberechnung!C24)","v":0.11273760388338561},"€/kWh"]
[]
["Pelletpreis Anfangsjahr:",null,null,{"$f":"(D2)","v":0.05},"€/kWh"]
["Pelletpreis im 20´sten Jahr:",null,null,{"$f":"(Energiepreisberechnung!G22)","v":0.18082637675169067},"€/kWh"]
["Mittlerer Pelletpreis während 20 Jahren:",null,null,{"$f":"(Energiepreisberechnung!G24)","v":0.10248873080307783},"€/kWh"]
[]
["Strompreis Anfangsjahr:",null,null,{"$f":"(D3)","v":0.2},"€/kWh"]
["Strompreis im 20´sten Jahr:",null,null,{"$f":"(Energiepreisberechnung!E22)","v":0.72330550700676266},"€/kWh"]
["Mittlerer Strompreis während 20 Jahren:",null,null,{"$f":"(Energiepreisberechnung!E24)","v":0.40995492321231131},"€/kWh"]
[]
["2."]
["Betrachtung für einen neuen Pelletkessel + Silo",null,null,{"$f":"(Master!D5)","v":40},"kW"]
[]
["2a"]
["Investitionskosten",null,null,{"$f":"(Master!D8)","v":5000},"€"]
["Investitionskosten gesamt: ",null,null,{"$f":"(D32)","v":5000},"€",null,null,null,"R_I_PL"]
[]
["2b"]
["Betriebskosten Pelletkessel"]
["Jahresarbeit Pelletkessel",null,null,{"$f":"(Master!D5*Master!D6)","v":80000},"kWh/a","(Leistung x Jahresvollbenutzungsstunden)"]
["Energieverbrauch Pelletkessel",null,null,{"$f":"(D37/D5)","v":86021.505376344081},"kWh/a","(Wirkungsgrad berücksichtigt)",null,null,"R_B_PL"]
["Kosten Pellets",null,null,{"$f":"(D38*D22)","v":8816.2349077916406},"€/a"]
["Wartungskosten Pelletkessel",null,null,500,"€/a",null,null,null,"R_B_WART_PL"]
["Stromverbrauch 1 Stück Kesselkreispumpe",null,null,{"$f":"(Master!D6*D8)","v":200},"kWh/a",null,null,null,"R_B_STROM_PL"]
["Stromkosten 1 Stück Kesselkreispumpe",null,null,{"$f":"(D41*D26)","v":81.990984642462266},"€/a","(Stromverbrauch x mittlerer Strompreis)"]
[]
["Betriebskosten pro Jahr gesamt:",null,null,{"$f":"SUM(D39:D40)+D42","v":9398.2258924341022},"€/a"]
[null,null,null,null,null,null,null,null,null,null,null,"Negative Werte sollen gleich Null gesetzt werden"]
["3.",null,null,null,null,null,null,null,null,null,null,{"$f":"(Master!D5-D59)","v":0}]
["Betrachtung für drei GAWP 35 LW (105 kW) sowie Spitzenlastkessel"]
[null,null,null,null,null,null,null,null,null,null,null,"Wärmepumpe soll nur die Anlagenheizlast erbringen, welche erforderlich ist"]
["3a",null,null,null,null,null,null,null,null,null,null,{"$f":"IF(Master!D5<105,Master!D5,105)","v":40}]
["Investitionskosten"]
["3 x GAWP + Zubehör",null,null,{"$f":"IF(Master!T15=TRUE,25000, (IF(Master!T16=TRUE,45000, (IF(Master!T17=TRUE,65000,\"\")))))","v":""},"€",null,null,null,null,null,null,"Deckungsrate GAWP"]
["Förderung BAFA",null,null,{"$f":"IF(Master!$T$15=TRUE,(2400+100*25), (IF(Master!$T$16=TRUE,(2400+100*60), (IF(Master!$T$17=TRUE,(2400+100*95),\"\")))))","v":""},"€",null,null,null,null,null,null,{"$f":"(D58+D59)","v":40},"Max Leistung BW plus Leistung GAWP"]
[{"$f":"IF(AND(Master!D5>29,Master!D5<55),Spitzenlastkessel!C4,(IF(AND(Master!D5>54,Master!D5<65),Spitzenlastkessel!C5,(IF(AND(Master!D5>64,Master!D5<85),Spitzenlastkessel!C6,(IF(AND(Master!D5>84,Master!D5<110),Spitzenlastkessel!C7,(IF(AND(Master!D5>109,Master!D5<135),Spitzenlastkessel!C8,(IF(AND(Master!D5>134,Master!D5<150),Spitzenlastkessel!C9,(IF(AND(Master!D5>149,Master!D5<200),Spitzenlastkessel!C10,(IF(AND(Master!D5>199,Master!D5<240),Spitzenlastkessel!C11,(IF(AND(Master!D5>239,Master!D5<300),Spitzenlastkessel!C12,(IF(AND(Master!D5>299,Master!D5<370),Spitzenlastkessel!C13,(IF(AND(Master!D5>369,Master!D5<450),Spitzenlastkessel!C14,(IF(AND(Master!D5>449,Master!D5<520),Spitzenlastkessel!C15,\"Anlagenheizlast zu groß\")))))))))))))))))))))))","v":"Spitzenlastkessel GMR 3035 (35 kW)"},null,null,{"$f":"IF(AND(Master!D5>29,Master!D5<55),Spitzenlastkessel!E4,(IF(AND(Master!D5>54,Master!D5<65),Spitzenlastkessel!E5,(IF(AND(Master!D5>64,Master!D5<85),Spitzenlastkessel!E6,(IF(AND(Master!D5>84,Master!D5<110),Spitzenlastkessel!E7,(IF(AND(Master!D5>109,Master!D5<135),Spitzenlastkessel!E8,(IF(AND(Master!D5>134,Master!D5<150),Spitzenlastkessel!E9,(IF(AND(Master!D5>149,Master!D5<200),Spitzenlastkessel!E10,(IF(AND(Master!D5>199,Master!D5<240),Spitzenlastkessel!E11,(IF(AND(Master!D5>239,Master!D5<300),Spitzenlastkessel!E12,(IF(AND(Master!D5>299,Master!D5<370),Spitzenlastkessel!E13,(IF(AND(Master!D5>369,Master!D5<450),Spitzenlastkessel!E14,(IF(AND(Master!D5>449,Master!D5<520),Spitzenlastkessel!E15,\"Anlagenheizlast zu groß\")))))))))))))))))))))))","v":3600},"€","(gewählt)",null,null,null,null,null,{"$f":"(100/L52)*D59","v":100},"Prozentuale Anlagenheizlast von GAWP"]
["Investitionskosten gesamt: ",null,null,{"$f":"(D51+D53-D52)","v":{"$error":"#VALUE!"}},"€",null,null,null,"N_I_GAWP_u_BW",null,null,{"$f":"MROUND(L53,5)","v":100},"Gerundet"]
[null,null,null,null,null,null,null,null,null,null,null,null,null,null,null,null,"Prozentuale \nAnlagen-\nheizlast \nder GAWP"]
["3b",null,null,null,null,null,null,null,null,null,null,{"$f":"VLOOKUP(L54,Q59:R86,2)","v":100},"Deckungsrate GAWP",null,null,null,null,"Deckungs-\nrate"]
["Betriebskosten"]
["Max. Leistung Brennwertgerät",null,null,{"$f":"IF(L46<0,0,(Master!D5-D59))","v":0},"kW"]
["Leistung 3 x GAWP",null,null,{"$f":"(L49)","v":40},"kW",null,null,null,null,null,null,null,null,null,null,null,0,0]
[null,null,null,null,null,null,null,null,null,null,null,null,null,null,null,null,5,8]
["Deckungsrate Brennwertgerät",null,null,{"$f":"(100-D62)","v":0},"%","(Ergibt sich aus Leistungsverhältnis Brennwertgerät/GAWP)",null,null,null,null,null,null,null,null,null,null,10,15]
["Deckungsrate 3 x GAWP",null,null,{"$f":"VLOOKUP(L54,Q59:R86,2)","v":100},"%","(Ergibt sich aus Leistungsverhältnis Brennwertgerät/GAWP)",null,null,null,null,null,null,null,null,null,null,15,25]
[null,null,null,null,null,null,null,null,null,null,null,null,null,null,null,null,20,33]
["Jahresarbeit Gas-Brennwertgerät",null,null,{"$f":"(D37*(D61/100))","v":0},"kWh/a","(Deckungsrate berücksichtigt)"]
["Jahresarbeit 3 x GAWP",null,null,{"$f":"(D37*(D62/100))","v":80000},"kWh/a","(Deckungsrate berücksichtigt)",null,null,null,null,null,null,null,null,null,null,25,41]
[null,null,null,null,null,null,null,null,null,null,null,null,null,null,null,null,30,50]
["Vollbenutzungsstunden Gas-Brennwertgerät",null,null,{"$f":"IF(D58=0,0,(D64/D58))","v":0},"h","(ergibt sich aus Jahresarbeit/Leistung)"]
["Vollbenutzungsstunden 3 x GAWP",null,null,{"$f":"(D65/D59)","v":2000},"h","(ergibt sich aus Jahresarbeit/Leistung)",null,null,null,null,null,null,null,null,null,null,35,58]
[null,null,null,null,null,null,null,null,null,null,null,null,null,null,null,null,40,67]
["Gasverbrauch Gas-Brennwertgerät",null,null,{"$f":"(D64/D4)","v":0},"kWh/a","(ergibt sich aus Jahresarbeit/Wirkungsgrad)",null,null,"N_B_GAS_BW"]
["Gasverbrauch 3 x GAWP",null,null,{"$f":"(D65/D6)","v":53333.333333333336},"kWh/a","(ergibt sich aus Jahresarbeit/Wirkungsgrad)",null,null,"N_B_GAS_GAWP",null,null,null,null,null,null,null,45,75]
[null,null,null,null,null,null,null,null,null,null,null,null,null,null,null,null,50,80]
["Kosten Gasverbrauch Gas-Brennwertgerät",null,null,{"$f":"(D70*D18)","v":0},"€/a","(ergibt sich aus Gasverbrauch x mittlerer Gaspreis)"]
["Kosten Gasverbrauch 3 x GAWP",null,null,{"$f":"(D71*D18)","v":6012.6722071138993},"€/a","(ergibt sich aus Gasverbrauch x mittlerer Gaspreis)",null,null,null,null,null,null,null,null,null,null,55,83]
[null,null,null,null,null,null,null,null,null,null,null,null,null,null,null,null,60,87]
["Wartungskosten Gas-Brennwertgerät",null,null,300,"€/a",null,null,null,"N_B_WART_BW"]
["Wartungskosten 3 x GAWP",null,null,700,"€/a",null,null,null,"N_B_WART_GAWP",null,null,null,null,null,null,null,65,90]
[null,null,null,null,null,null,null,null,null,null,null,null,null,null,null,null,70,92]
["Stromverbrauch 3 x GAWP",null,null,{"$f":"(D68*D7)*3","v":6540},"kWh/a",null,null,null,"N_B_STROM_LÜ_GAWP",null,null,null,null,null,null,null,75,94]
["Stromkosten 3 x GAWP",null,null,{"$f":"(D79*D26)","v":2681.1051978085161},"€/a","(Stromverbrauch x mittlerer Strompreis)",null,null,null,null,null,null,null,null,null,null,80,96]
["Stromverbrauch Gas-Brennwertgerät",null,null,{"$f":"(D67*D8)","v":0},"kWh/a",null,null,null,"N_B_STROM_BW"]
["Stromkosten Gas-Brennwertgerät",null,null,{"$f":"(D81*D26)","v":0},"€/a","(Stromverbrauch x mittlerer Strompreis)"]
["Stromverbrauch 3 x Umwälzpumpe GAWP",null,null,{"$f":"((D68)*D9)*3","v":300},"kWh/a",null,null,null,"N_B_STROM_PU_GAWP",null,null,null,null,null,null,null,85,97]
["Stromkosten 3 x Umwälzpumpe GAWP",null,null,{"$f":"(D83*D26)","v":122.98647696369339},"€/a","(Stromverbrauch x mittlerer Strompreis)",null,null,null,null,null,null,null,null,null,null,90,98]
[null,null,null,null,null,null,null,null,null,null,null,null,null,null,null,null,95,99]
["Betriebskosten pro Jahr gesamt:",null,null,{"$f":"SUM(D73:D77)+D84+D80+D82","v":9816.7638818861087},"€/a",null,null,null,null,null,null,null,null,null,null,null,100,100]
[]
["FAZIT:"]
["Mittlere Energieeinsparung pro Jahr bei Einsatz"]
["von drei GAWP LW und Gas-Brennwertgerät"]
["gegenüber den Betriebskosten eines Pelletkessels:",null,null,{"$f":"IF((D44-D86)<0,\"negativ\",(D44-D86))","v":"negativ"},"€/a"]
[]
["Differenz Investitionskosten:",null,null,{"$f":"(D54-D33)","v":{"$error":"#VALUE!"}},"€"]
[]
["Für einen auf 20 Jahre gemittelten Engergiepreis"]
["ergibt sich eine Amortisationszeit von: ",null,null,{"$f":"IF(D91=\"negativ\",\"negativ\",(IF(D93<0,\"sofort\",D93/D91)))","v":"negativ"},{"$f":"IF(D91=\"negativ\",\"\",(IF(D93<0,\"\",\"Jahren\")))","v":""}]

{"sheet":"LW bival GAS","index":11,"n_rows":89,"n_cols":18,"rows_kept":89,"cut":false,"hidden":false,"merged":[[47,16,50,16],[48,17,50,17]]}
["Aktueller Gaspreis",null,null,{"$f":"(Energiepreisberechnung!D28)","v":5.5E-2},"€/kWh"]
["Aktueller Strompreis",null,null,{"$f":"(Energiepreisberechnung!D31)","v":0.2},"€/kWh"]
["Gemittelter Wirkungsgrad Gasbrennwertgerät",null,null,1.06]
["Gemittelter Wirkungsgrad GAWP LW",null,null,1.5]
["Elektr. Leistung GAWP LW",null,null,1.0900000000000001,"kW"]
["Elektr. Leistung Kesselkreispumpe",null,null,0.05,"kW"]
[]
["Gesucht:","Investitions- und Betriebskosten während 20 Jahren"]
[]
["1."]
["Errechnung der mittleren Energiepreise binnen 20 Jahren"]
[]
["Gaspreis Anfangsjahr:",null,null,{"$f":"(D1)","v":5.5E-2},"€/kWh"]
["Gaspreis im 20´sten Jahr:",null,null,{"$f":"(Energiepreisberechnung!C22)","v":0.19890901442685968},"€/kWh"]
["Mittlerer Gaspreis während 20 Jahren:",null,null,{"$f":"(Energiepreisberechnung!C24)","v":0.11273760388338561},"€/kWh"]
[]
["Strompreis Anfangsjahr:",null,null,{"$f":"(D2)","v":0.2},"€/kWh"]
["Strompreis im 20´sten Jahr:",null,null,{"$f":"(Energiepreisberechnung!E22)","v":0.72330550700676266},"€/kWh"]
["Mittlerer Strompreis während 20 Jahren:",null,null,{"$f":"(Energiepreisberechnung!E24)","v":0.40995492321231131},"€/kWh"]
[]
["2."]
["Betrachtung für ein neues Gasbrennwertgerät",null,null,{"$f":"(Master!D5)","v":40},"kW"]
[]
["2a"]
["Investitionskosten",null,null,{"$f":"(Master!D8)","v":5000},"€"]
["Investitionskosten gesamt: ",null,null,{"$f":"(D25)","v":5000},"€",null,null,null,"R_I_GAS"]
[]
["2b"]
["Betriebskosten Gas-Brennwertgerät"]
["Jahresarbeit Gas-Brennwertgerät",null,null,{"$f":"(Master!D5*Master!D6)","v":80000},"kWh/a","(Leistung x Jahresvollbenutzungsstunden)"]
["Energieverbrauch Gas-Brennwertgerät",null,null,{"$f":"(D30/D3)","v":75471.698113207545},"kWh/a","(Wirkungsgrad berücksichtigt)",null,null,"R_B_GAS"]
["Kosten Gas",null,null,{"$f":"(D31*D15)","v":8508.4984062932526},"€/a"]
["Wartungskosten Gas-Brennwertgerät",null,null,300,"€/a",null,null,null,"R_B_WART_GAS"]
["Stromverbrauch 1 Stück Kesselkreispumpe",null,null,{"$f":"(Master!D6*D6)","v":100},"kWh/a",null,null,null,"R_B_STROM_GAS"]
["Stromkosten 1 Stück Kesselkreispumpe",null,null,{"$f":"(D34*D19)","v":40.995492321231133},"€/a","(Stromverbrauch x mittlerer Strompreis)"]
[]
["Betriebskosten pro Jahr gesamt:",null,null,{"$f":"SUM(D32:D33)+D35","v":8849.4938986144844},"€/a"]
[null,null,null,null,null,null,null,null,null,null,null,"Negative Werte sollen gleich Null gesetzt werden"]
["3.",null,null,null,null,null,null,null,null,null,null,{"$f":"(Master!D5-D52)","v":5}]
["Betrachtung für eine GAWP 35 LW (35 kW) sowie Spitzenlastkessel"]
[null,null,null,null,null,null,null,null,null,null,null,"Wärmepumpe soll nur die Anlagenheizlast erbringen, welche erforderlich ist"]
["3a",null,null,null,null,null,null,null,null,null,null,{"$f":"IF(Master!D5<35,Master!D5,35)","v":35}]
["Investitionskosten"]
["GAWP + Zubehör",null,null,{"$f":"IF(Master!T15=TRUE,25000, (IF(Master!T16=TRUE,45000, (IF(Master!T17=TRUE,65000,\"\")))))","v":""},"€",null,null,null,null,null,null,"Deckungsrate GAWP"]
["Förderung BAFA",null,null,{"$f":"IF(Master!$T$15=TRUE,(2400+100*25), (IF(Master!$T$16=TRUE,(2400+100*60), (IF(Master!$T$17=TRUE,(2400+100*95),\"\")))))","v":""},"€",null,null,null,null,null,null,{"$f":"(D51+D52)","v":40},"Max Leistung BW plus Leistung GAWP"]
[{"$f":"IF(AND(Master!D5>29,Master!D5<55),Spitzenlastkessel!C4,(IF(AND(Master!D5>54,Master!D5<65),Spitzenlastkessel!C5,(IF(AND(Master!D5>64,Master!D5<85),Spitzenlastkessel!C6,(IF(AND(Master!D5>84,Master!D5<110),Spitzenlastkessel!C7,(IF(AND(Master!D5>109,Master!D5<135),Spitzenlastkessel!C8,(IF(AND(Master!D5>134,Master!D5<150),Spitzenlastkessel!C9,(IF(AND(Master!D5>149,Master!D5<200),Spitzenlastkessel!C10,(IF(AND(Master!D5>199,Master!D5<240),Spitzenlastkessel!C11,(IF(AND(Master!D5>239,Master!D5<300),Spitzenlastkessel!C12,(IF(AND(Master!D5>299,Master!D5<370),Spitzenlastkessel!C13,(IF(AND(Master!D5>369,Master!D5<450),Spitzenlastkessel!C14,(IF(AND(Master!D5>449,Master!D5<520),Spitzenlastkessel!C15,\"Anlagenheizlast zu groß\")))))))))))))))))))))))","v":"Spitzenlastkessel GMR 3035 (35 kW)"},null,null,{"$f":"IF(AND(Master!D5>29,Master!D5<55),Spitzenlastkessel!E4,(IF(AND(Master!D5>54,Master!D5<65),Spitzenlastkessel!E5,(IF(AND(Master!D5>64,Master!D5<85),Spitzenlastkessel!E6,(IF(AND(Master!D5>84,Master!D5<110),Spitzenlastkessel!E7,(IF(AND(Master!D5>109,Master!D5<135),Spitzenlastkessel!E8,(IF(AND(Master!D5>134,Master!D5<150),Spitzenlastkessel!E9,(IF(AND(Master!D5>149,Master!D5<200),Spitzenlastkessel!E10,(IF(AND(Master!D5>199,Master!D5<240),Spitzenlastkessel!E11,(IF(AND(Master!D5>239,Master!D5<300),Spitzenlastkessel!E12,(IF(AND(Master!D5>299,Master!D5<370),Spitzenlastkessel!E13,(IF(AND(Master!D5>369,Master!D5<450),Spitzenlastkessel!E14,(IF(AND(Master!D5>449,Master!D5<520),Spitzenlastkessel!E15,\"Anlagenheizlast zu groß\")))))))))))))))))))))))","v":3600},"€","(gewählt)",null,null,null,null,null,{"$f":"(100/L45)*D52","v":87.5},"Prozentuale Anlagenheizlast von GAWP"]
["Investitionskosten gesamt: ",null,null,{"$f":"(D44+D46-D45)","v":{"$error":"#VALUE!"}},"€",null,null,null,"N_I_GAWP_u_BW",null,null,{"$f":"MROUND(L46,5)","v":90},"Gerundet"]
[null,null,null,null,null,null,null,null,null,null,null,null,null,null,null,null,"Prozentuale \nAnlagen-\nheizlast \nder GAWP"]
["3b",null,null,null,null,null,null,null,null,null,null,{"$f":"VLOOKUP(L47,Q52:R79,2)","v":98},"Deckungsrate GAWP",null,null,null,null,"Deckungs-\nrate"]
["Betriebskosten"]
["Max. Leistung Brennwertgerät",null,null,{"$f":"IF(L39<0,0,(Master!D5-D52))","v":5},"kW"]
["Leistung GAWP",null,null,{"$f":"(L42)","v":35},"kW",null,null,null,null,null,null,null,null,null,null,null,0,0]
[null,null,null,null,null,null,null,null,null,null,null,null,null,null,null,null,5,8]
["Deckungsrate Brennwertgerät",null,null,{"$f":"(100-D55)","v":2},"%","(Ergibt sich aus Leistungsverhältnis Brennwertgerät/GAWP)",null,null,null,null,null,null,null,null,null,null,10,15]
["Deckungsrate GAWP",null,null,{"$f":"VLOOKUP(L47,Q52:R79,2)","v":98},"%","(Ergibt sich aus Leistungsverhältnis Brennwertgerät/GAWP)",null,null,null,null,null,null,null,null,null,null,15,25]
[null,null,null,null,null,null,null,null,null,null,null,null,null,null,null,null,20,33]
["Jahresarbeit Gas-Brennwertgerät",null,null,{"$f":"(D30*(D54/100))","v":1600},"kWh/a","(Deckungsrate berücksichtigt)"]
["Jahresarbeit GAWP",null,null,{"$f":"(D30*(D55/100))","v":78400},"kWh/a","(Deckungsrate berücksichtigt)",null,null,null,null,null,null,null,null,null,null,25,41]
[null,null,null,null,null,null,null,null,null,null,null,null,null,null,null,null,30,50]
["Vollbenutzungsstunden Gas-Brennwertgerät",null,null,{"$f":"IF(D51=0,0,(D57/D51))","v":320},"h","(ergibt sich aus Jahresarbeit/Leistung)"]
["Vollbenutzungsstunden GAWP",null,null,{"$f":"(D58/D52)","v":2240},"h","(ergibt sich aus Jahresarbeit/Leistung)",null,null,null,null,null,null,null,null,null,null,35,58]
[null,null,null,null,null,null,null,null,null,null,null,null,null,null,null,null,40,67]
["Gasverbrauch Gas-Brennwertgerät",null,null,{"$f":"(D57/D3)","v":1509.433962264151},"kWh/a","(ergibt sich aus Jahresarbeit/Wirkungsgrad)",null,null,"N_B_GAS_BW"]
["Gasverbrauch GAWP",null,null,{"$f":"(D58/D4)","v":52266.666666666664},"kWh/a","(ergibt sich aus Jahresarbeit/Wirkungsgrad)",null,null,"N_B_GAS_GAWP",null,null,null,null,null,null,null,45,75]
[null,null,null,null,null,null,null,null,null,null,null,null,null,null,null,null,50,80]
["Kosten Gasverbrauch Gas-Brennwertgerät",null,null,{"$f":"(D63*D15)","v":170.16996812586507},"€/a","(ergibt sich aus Gasverbrauch x mittlerer Gaspreis)"]
["Kosten Gasverbrauch GAWP",null,null,{"$f":"(D64*D15)","v":5892.4187629716207},"€/a","(ergibt sich aus Gasverbrauch x mittlerer Gaspreis)",null,null,null,null,null,null,null,null,null,null,55,83]
[null,null,null,null,null,null,null,null,null,null,null,null,null,null,null,null,60,87]
["Wartungskosten Gas-Brennwertgerät",null,null,300,"€/a",null,null,null,"N_B_WART_BW"]
["Wartungskosten GAWP",null,null,300,"€/a",null,null,null,"N_B_WART_GAWP",null,null,null,null,null,null,null,65,90]
[null,null,null,null,null,null,null,null,null,null,null,null,null,null,null,null,70,92]
["Stromverbrauch GAWP",null,null,{"$f":"(D61*D5)","v":2441.6000000000004},"kWh/a",null,null,null,"N_B_STROM_LÜ_GAWP",null,null,null,null,null,null,null,75,94]
["Stromkosten GAWP",null,null,{"$f":"(D72*D19)","v":1000.9459405151795},"€/a","(Stromverbrauch x mittlerer Strompreis)",null,null,null,null,null,null,null,null,null,null,80,96]
["Stromverbrauch Gas-Brennwertgerät",null,null,{"$f":"(D60*D6)","v":16},"kWh/a",null,null,null,"N_B_STROM_BW"]
["Stromkosten Gas-Brennwertgerät",null,null,{"$f":"(D74*D19)","v":6.5592787713969809},"€/a","(Stromverbrauch x mittlerer Strompreis)"]
["Stromverbrauch Umwälzpumpe GAWP",null,null,{"$f":"((D61)*D6)","v":112},"kWh/a",null,null,null,"N_B_STROM_PU_GAWP",null,null,null,null,null,null,null,85,97]
["Stromkosten Umwälzpumpe GAWP",null,null,{"$f":"(D76*D19)","v":45.914951399778865},"€/a","(Stromverbrauch x mittlerer Strompreis)",null,null,null,null,null,null,null,null,null,null,90,98]
[null,null,null,null,null,null,null,null,null,null,null,null,null,null,null,null,95,99]
["Betriebskosten pro Jahr gesamt:",null,null,{"$f":"SUM(D66:D70)+D77+D73+D75","v":7716.0089017838409},"€/a",null,null,null,null,null,null,null,null,null,null,null,100,100]
[]
["FAZIT:"]
["Mittlere Energieeinsparung pro Jahr bei Einsatz"]
["von einer GAWP LW und Gas-Brennwertgerät"]
["gegenüber \"nur Gas-Brennwert\":",null,null,{"$f":"(D37-D79)","v":1133.4849968306435},"€/a"]
[]
["Differenz Investitionskosten:",null,null,{"$f":"(D47-D26)","v":{"$error":"#VALUE!"}},"€"]
[]
["Für einen auf 20 Jahre gemittelten Engergiepreis"]
["ergibt sich eine Amortisationszeit von: ",null,null,{"$f":"IF((D86/D84)<0,\"sofort\",(D86/D84))","v":{"$error":"#VALUE!"}},{"$f":"IF((D86/D84)<0,\"\",\"Jahren\")","v":{"$error":"#VALUE!"}}]

{"sheet":"LW2 bival GAS","index":12,"n_rows":90,"n_cols":18,"rows_kept":90,"cut":false,"hidden":false,"merged":[[48,16,51,16],[49,17,51,17]]}
["Aktueller Gaspreis",null,null,{"$f":"(Energiepreisberechnung!D28)","v":5.5E-2},"€/kWh"]
["Aktueller Strompreis",null,null,{"$f":"(Energiepreisberechnung!D31)","v":0.2},"€/kWh"]
["Gemittelter Wirkungsgrad Gasbrennwertgerät",null,null,1.06]
["Gemittelter Wirkungsgrad GAWP LW",null,null,1.5]
["Elektr. Leistung GAWP LW",null,null,1.0900000000000001,"kW"]
["Elektr. Leistung Kesselkreispumpe",null,null,0.06,"kW"]
["Elektr. Leistung Umwälzpumpe GAWP",null,null,0.05,"kW"]
[]
["Gesucht:","Investitions- und Betriebskosten während 20 Jahren"]
[]
["1."]
["Errechnung der mittleren Energiepreise binnen 20 Jahren"]
[]
["Gaspreis Anfangsjahr:",null,null,{"$f":"(D1)","v":5.5E-2},"€/kWh"]
["Gaspreis im 20´sten Jahr:",null,null,{"$f":"(Energiepreisberechnung!C22)","v":0.19890901442685968},"€/kWh"]
["Mittlerer Gaspreis während 20 Jahren:",null,null,{"$f":"(Energiepreisberechnung!C24)","v":0.11273760388338561},"€/kWh"]
[]
["Strompreis Anfangsjahr:",null,null,{"$f":"(D2)","v":0.2},"€/kWh"]
["Strompreis im 20´sten Jahr:",null,null,{"$f":"(Energiepreisberechnung!E22)","v":0.72330550700676266},"€/kWh"]
["Mittlerer Strompreis während 20 Jahren:",null,null,{"$f":"(Energiepreisberechnung!E24)","v":0.40995492321231131},"€/kWh"]
[]
["2."]
["Betrachtung für ein neues Gasbrennwertgerät",null,null,{"$f":"(Master!D5)","v":40},"kW"]
[]
["2a"]
["Investitionskosten",null,null,{"$f":"(Master!D8)","v":5000},"€"]
["Investitionskosten gesamt: ",null,null,{"$f":"(D26)","v":5000},"€",null,null,null,"R_I_GAS"]
[]
["2b"]
["Betriebskosten Gas-Brennwertgerät"]
["Jahresarbeit Gas-Brennwertgerät",null,null,{"$f":"(Master!D5*Master!D6)","v":80000},"kWh/a","(Leistung x Jahresvollbenutzungsstunden)"]
["Energieverbrauch Gas-Brennwertgerät",null,null,{"$f":"(D31/D3)","v":75471.698113207545},"kWh/a","(Wirkungsgrad berücksichtigt)",null,null,"R_B_GAS"]
["Kosten Gas",null,null,{"$f":"(D32*D16)","v":8508.4984062932526},"€/a"]
["Wartungskosten Gas-Brennwertgerät",null,null,300,"€/a",null,null,null,"R_B_WART_GAS"]
["Stromverbrauch 1 Stück Kesselkreispumpe",null,null,{"$f":"(Master!D6*D6)","v":120},"kWh/a",null,null,null,"R_B_STROM_GAS"]
["Stromkosten 1 Stück Kesselkreispumpe",null,null,{"$f":"(D35*D20)","v":49.194590785477359},"€/a","(Stromverbrauch x mittlerer Strompreis)"]
[]
["Betriebskosten pro Jahr gesamt:",null,null,{"$f":"SUM(D33:D34)+D36","v":8857.6929970787296},"€/a"]
[null,null,null,null,null,null,null,null,null,null,null,"Negative Werte sollen gleich Null gesetzt werden"]
["3.",null,null,null,null,null,null,null,null,null,null,{"$f":"(Master!D5-D53)","v":0}]
["Betrachtung für zwei GAWP 35 LW (70 kW) sowie Spitzenlastkessel"]
[null,null,null,null,null,null,null,null,null,null,null,"Wärmepumpe soll nur die Anlagenheizlast erbringen, welche erforderlich ist"]
["3a",null,null,null,null,null,null,null,null,null,null,{"$f":"IF(Master!D5<70,Master!D5,70)","v":40}]
["Investitionskosten"]
["2 x GAWP + Zubehör",null,null,{"$f":"IF(Master!T15=TRUE,25000, (IF(Master!T16=TRUE,45000, (IF(Master!T17=TRUE,65000,\"\")))))","v":""},"€",null,null,null,null,null,null,"Deckungsrate GAWP"]
["Förderung BAFA",null,null,{"$f":"IF(Master!$T$15=TRUE,(2400+100*25), (IF(Master!$T$16=TRUE,(2400+100*60), (IF(Master!$T$17=TRUE,(2400+100*95),\"\")))))","v":""},"€",null,null,null,null,null,null,{"$f":"(D52+D53)","v":40},"Max Leistung BW plus Leistung GAWP"]
[{"$f":"IF(AND(Master!D5>29,Master!D5<55),Spitzenlastkessel!C4,(IF(AND(Master!D5>54,Master!D5<65),Spitzenlastkessel!C5,(IF(AND(Master!D5>64,Master!D5<85),Spitzenlastkessel!C6,(IF(AND(Master!D5>84,Master!D5<110),Spitzenlastkessel!C7,(IF(AND(Master!D5>109,Master!D5<135),Spitzenlastkessel!C8,(IF(AND(Master!D5>134,Master!D5<150),Spitzenlastkessel!C9,(IF(AND(Master!D5>149,Master!D5<200),Spitzenlastkessel!C10,(IF(AND(Master!D5>199,Master!D5<240),Spitzenlastkessel!C11,(IF(AND(Master!D5>239,Master!D5<300),Spitzenlastkessel!C12,(IF(AND(Master!D5>299,Master!D5<370),Spitzenlastkessel!C13,(IF(AND(Master!D5>369,Master!D5<450),Spitzenlastkessel!C14,(IF(AND(Master!D5>449,Master!D5<520),Spitzenlastkessel!C15,\"Anlagenheizlast zu groß\")))))))))))))))))))))))","v":"Spitzenlastkessel GMR 3035 (35 kW)"},null,null,{"$f":"IF(AND(Master!D5>29,Master!D5<55),Spitzenlastkessel!E4,(IF(AND(Master!D5>54,Master!D5<65),Spitzenlastkessel!E5,(IF(AND(Master!D5>64,Master!D5<85),Spitzenlastkessel!E6,(IF(AND(Master!D5>84,Master!D5<110),Spitzenlastkessel!E7,(IF(AND(Master!D5>109,Master!D5<135),Spitzenlastkessel!E8,(IF(AND(Master!D5>134,Master!D5<150),Spitzenlastkessel!E9,(IF(AND(Master!D5>149,Master!D5<200),Spitzenlastkessel!E10,(IF(AND(Master!D5>199,Master!D5<240),Spitzenlastkessel!E11,(IF(AND(Master!D5>239,Master!D5<300),Spitzenlastkessel!E12,(IF(AND(Master!D5>299,Master!D5<370),Spitzenlastkessel!E13,(IF(AND(Master!D5>369,Master!D5<450),Spitzenlastkessel!E14,(IF(AND(Master!D5>449,Master!D5<520),Spitzenlastkessel!E15,\"Anlagenheizlast zu groß\")))))))))))))))))))))))","v":3600},"€","(gewählt)",null,null,null,null,null,{"$f":"(100/L46)*D53","v":100},"Prozentuale Anlagenheizlast von GAWP"]
["Investitionskosten gesamt: ",null,null,{"$f":"(D45+D47-D46)","v":{"$error":"#VALUE!"}},"€",null,null,null,"N_I_GAWP_u_BW",null,null,{"$f":"MROUND(L47,5)","v":100},"Gerundet"]
[null,null,null,null,null,null,null,null,null,null,null,null,null,null,null,null,"Prozentuale \nAnlagen-\nheizlast \nder GAWP"]
["3b",null,null,null,null,null,null,null,null,null,null,{"$f":"VLOOKUP(L48,Q53:R80,2)","v":100},"Deckungsrate GAWP",null,null,null,null,"Deckungs-\nrate"]
["Betriebskosten"]
["Max. Leistung Brennwertgerät",null,null,{"$f":"IF(L40<0,0,(Master!D5-D53))","v":0},"kW"]
["Leistung 2 x GAWP",null,null,{"$f":"(L43)","v":40},"kW",null,null,null,null,null,null,null,null,null,null,null,0,0]
[null,null,null,null,null,null,null,null,null,null,null,null,null,null,null,null,5,8]
["Deckungsrate Brennwertgerät",null,null,{"$f":"(100-D56)","v":0},"%","(Ergibt sich aus Leistungsverhältnis Brennwertgerät/GAWP)",null,null,null,null,null,null,null,null,null,null,10,15]
["Deckungsrate 2 x GAWP",null,null,{"$f":"VLOOKUP(L48,Q53:R80,2)","v":100},"%","(Ergibt sich aus Leistungsverhältnis Brennwertgerät/GAWP)",null,null,null,null,null,null,null,null,null,null,15,25]
[null,null,null,null,null,null,null,null,null,null,null,null,null,null,null,null,20,33]
["Jahresarbeit Gas-Brennwertgerät",null,null,{"$f":"(D31*(D55/100))","v":0},"kWh/a","(Deckungsrate berücksichtigt)"]
["Jahresarbeit 2 x GAWP",null,null,{"$f":"(D31*(D56/100))","v":80000},"kWh/a","(Deckungsrate berücksichtigt)",null,null,null,null,null,null,null,null,null,null,25,41]
[null,null,null,null,null,null,null,null,null,null,null,null,null,null,null,null,30,50]
["Vollbenutzungsstunden Gas-Brennwertgerät",null,null,{"$f":"IF(D52=0,0,(D58/D52))","v":0},"h","(ergibt sich aus Jahresarbeit/Leistung)"]
["Vollbenutzungsstunden 2 x GAWP",null,null,{"$f":"(D59/D53)","v":2000},"h","(ergibt sich aus Jahresarbeit/Leistung)",null,null,null,null,null,null,null,null,null,null,35,58]
[null,null,null,null,null,null,null,null,null,null,null,null,null,null,null,null,40,67]
["Gasverbrauch Gas-Brennwertgerät",null,null,{"$f":"(D58/D3)","v":0},"kWh/a","(ergibt sich aus Jahresarbeit/Wirkungsgrad)",null,null,"N_B_GAS_BW"]
["Gasverbrauch 2 x GAWP",null,null,{"$f":"(D59/D4)","v":53333.333333333336},"kWh/a","(ergibt sich aus Jahresarbeit/Wirkungsgrad)",null,null,"N_B_GAS_GAWP",null,null,null,null,null,null,null,45,75]
[null,null,null,null,null,null,null,null,null,null,null,null,null,null,null,null,50,80]
["Kosten Gasverbrauch Gas-Brennwertgerät",null,null,{"$f":"(D64*D16)","v":0},"€/a","(ergibt sich aus Gasverbrauch x mittlerer Gaspreis)"]
["Kosten Gasverbrauch 2 x GAWP",null,null,{"$f":"(D65*D16)","v":6012.6722071138993},"€/a","(ergibt sich aus Gasverbrauch x mittlerer Gaspreis)",null,null,null,null,null,null,null,null,null,null,55,83]
[null,null,null,null,null,null,null,null,null,null,null,null,null,null,null,null,60,87]
["Wartungskosten Gas-Brennwertgerät",null,null,300,"€/a",null,null,null,"N_B_WART_BW"]
["Wartungskosten 2 x GAWP",null,null,500,"€/a",null,null,null,"N_B_WART_GAWP",null,null,null,null,null,null,null,65,90]
[null,null,null,null,null,null,null,null,null,null,null,null,null,null,null,null,70,92]
["Stromverbrauch 2 x GAWP",null,null,{"$f":"(D62*D5)*2","v":4360},"kWh/a",null,null,null,"N_B_STROM_LÜ_GAWP",null,null,null,null,null,null,null,75,94]
["Stromkosten 2 x GAWP",null,null,{"$f":"(D73*D20)","v":1787.4034652056773},"€/a","(Stromverbrauch x mittlerer Strompreis)",null,null,null,null,null,null,null,null,null,null,80,96]
["Stromverbrauch Gas-Brennwertgerät",null,null,{"$f":"(D61*D6)","v":0},"kWh/a",null,null,null,"N_B_STROM_BW"]
["Stromkosten Gas-Brennwertgerät",null,null,{"$f":"(D75*D20)","v":0},"€/a","(Stromverbrauch x mittlerer Strompreis)"]
["Stromverbrauch 2 x Umwälzpumpe GAWP",null,null,{"$f":"((D62)*D7)*2","v":200},"kWh/a",null,null,null,"N_B_STROM_PU_GAWP",null,null,null,null,null,null,null,85,97]
["Stromkosten 2 x Umwälzpumpe GAWP",null,null,{"$f":"(D77*D20)","v":81.990984642462266},"€/a","(Stromverbrauch x mittlerer Strompreis)",null,null,null,null,null,null,null,null,null,null,90,98]
[null,null,null,null,null,null,null,null,null,null,null,null,null,null,null,null,95,99]
["Betriebskosten pro Jahr gesamt:",null,null,{"$f":"SUM(D67:D71)+D78+D74+D76","v":8682.0666569620389},"€/a",null,null,null,null,null,null,null,null,null,null,null,100,100]
[]
["FAZIT:"]
["Mittlere Energieeinsparung pro Jahr bei Einsatz"]
["von zwei GAWP LW und Gas-Brennwertgerät"]
["gegenüber \"nur Gas-Brennwert\":",null,null,{"$f":"IF((D38-D80)<0,\"negativ\",(D38-D80))","v":175.6263401166907},"€/a"]
[]
["Differenz Investitionskosten:",null,null,{"$f":"(D48-D27)","v":{"$error":"#VALUE!"}},"€"]
[]
["Für einen auf 20 Jahre gemittelten Engergiepreis"]
["ergibt sich eine Amortisationszeit von: ",null,null,{"$f":"IF(D85=\"negativ\",\"negativ\",(IF(D87<0,\"sofort\",D87/D85)))","v":{"$error":"#VALUE!"}},{"$f":"IF(D85=\"negativ\",\"\",(IF(D87<0,\"\",\"Jahren\")))","v":{"$error":"#VALUE!"}}]

{"sheet":"LW3 bival GAS","index":13,"n_rows":90,"n_cols":18,"rows_kept":90,"cut":false,"hidden":false,"merged":[[48,16,51,16],[49,17,51,17]]}
["Aktueller Gaspreis",null,null,{"$f":"(Energiepreisberechnung!D28)","v":5.5E-2},"€/kWh"]
["Aktueller Strompreis",null,null,{"$f":"(Energiepreisberechnung!D31)","v":0.2},"€/kWh"]
["Gemittelter Wirkungsgrad Gasbrennwertgerät",null,null,1.06]
["Gemittelter Wirkungsgrad GAWP LW",null,null,1.5]
["Elektr. Leistung GAWP LW",null,null,1.0900000000000001,"kW"]
["Elektr. Leistung Kesselkreispumpe",null,null,0.1,"kW"]
["Elektr. Leistung Umwälzpumpe GAWP",null,null,0.05,"kW"]
[]
["Gesucht:","Investitions- und Betriebskosten während 20 Jahren"]
[]
["1."]
["Errechnung der mittleren Energiepreise binnen 20 Jahren"]
[]
["Gaspreis Anfangsjahr:",null,null,{"$f":"(D1)","v":5.5E-2},"€/kWh"]
["Gaspreis im 20´sten Jahr:",null,null,{"$f":"(Energiepreisberechnung!C22)","v":0.19890901442685968},"€/kWh"]
["Mittlerer Gaspreis während 20 Jahren:",null,null,{"$f":"(Energiepreisberechnung!C24)","v":0.11273760388338561},"€/kWh"]
[]
["Strompreis Anfangsjahr:",null,null,{"$f":"(D2)","v":0.2},"€/kWh"]
["Strompreis im 20´sten Jahr:",null,null,{"$f":"(Energiepreisberechnung!E22)","v":0.72330550700676266},"€/kWh"]
["Mittlerer Strompreis während 20 Jahren:",null,null,{"$f":"(Energiepreisberechnung!E24)","v":0.40995492321231131},"€/kWh"]
[]
["2."]
["Betrachtung für ein neues Gasbrennwertgerät",null,null,{"$f":"(Master!D5)","v":40},"kW"]
[]
["2a"]
["Investitionskosten",null,null,{"$f":"(Master!D8)","v":5000},"€"]
["Investitionskosten gesamt: ",null,null,{"$f":"(D26)","v":5000},"€",null,null,null,"R_I_GAS"]
[]
["2b"]
["Betriebskosten Gas-Brennwertgerät"]
["Jahresarbeit Gas-Brennwertgerät",null,null,{"$f":"(Master!D5*Master!D6)","v":80000},"kWh/a","(Leistung x Jahresvollbenutzungsstunden)"]
["Energieverbrauch Gas-Brennwertgerät",null,null,{"$f":"(D31/D3)","v":75471.698113207545},"kWh/a","(Wirkungsgrad berücksichtigt)",null,null,"R_B_GAS"]
["Kosten Gas",null,null,{"$f":"(D32*D16)","v":8508.4984062932526},"€/a"]
["Wartungskosten Gas-Brennwertgerät",null,null,300,"€/a",null,null,null,"R_B_WART_GAS"]
["Stromverbrauch 1 Stück Kesselkreispumpe",null,null,{"$f":"(Master!D6*D6)","v":200},"kWh/a",null,null,null,"R_B_STROM_GAS"]
["Stromkosten 1 Stück Kesselkreispumpe",null,null,{"$f":"(D35*D20)","v":81.990984642462266},"€/a","(Stromverbrauch x mittlerer Strompreis)"]
[]
["Betriebskosten pro Jahr gesamt:",null,null,{"$f":"SUM(D33:D34)+D36","v":8890.4893909357143},"€/a"]
[null,null,null,null,null,null,null,null,null,null,null,"Negative Werte sollen gleich Null gesetzt werden"]
["3.",null,null,null,null,null,null,null,null,null,null,{"$f":"(Master!D5-D53)","v":0}]
["Betrachtung für drei GAWP 35 LW (105 kW) sowie Spitzenlastkessel"]
[null,null,null,null,null,null,null,null,null,null,null,"Wärmepumpe soll nur die Anlagenheizlast erbringen, welche erforderlich ist"]
["3a",null,null,null,null,null,null,null,null,null,null,{"$f":"IF(Master!D5<105,Master!D5,105)","v":40}]
["Investitionskosten"]
["3 x GAWP + Zubehör",null,null,{"$f":"IF(Master!T15=TRUE,25000, (IF(Master!T16=TRUE,45000, (IF(Master!T17=TRUE,65000,\"\")))))","v":""},"€",null,null,null,null,null,null,"Deckungsrate GAWP"]
["Förderung BAFA",null,null,{"$f":"IF(Master!$T$15=TRUE,(2400+100*25), (IF(Master!$T$16=TRUE,(2400+100*60), (IF(Master!$T$17=TRUE,(2400+100*95),\"\")))))","v":""},"€",null,null,null,null,null,null,{"$f":"(D52+D53)","v":40},"Max Leistung BW plus Leistung GAWP"]
[{"$f":"IF(AND(Master!D5>29,Master!D5<55),Spitzenlastkessel!C4,(IF(AND(Master!D5>54,Master!D5<65),Spitzenlastkessel!C5,(IF(AND(Master!D5>64,Master!D5<85),Spitzenlastkessel!C6,(IF(AND(Master!D5>84,Master!D5<110),Spitzenlastkessel!C7,(IF(AND(Master!D5>109,Master!D5<135),Spitzenlastkessel!C8,(IF(AND(Master!D5>134,Master!D5<150),Spitzenlastkessel!C9,(IF(AND(Master!D5>149,Master!D5<200),Spitzenlastkessel!C10,(IF(AND(Master!D5>199,Master!D5<240),Spitzenlastkessel!C11,(IF(AND(Master!D5>239,Master!D5<300),Spitzenlastkessel!C12,(IF(AND(Master!D5>299,Master!D5<370),Spitzenlastkessel!C13,(IF(AND(Master!D5>369,Master!D5<450),Spitzenlastkessel!C14,(IF(AND(Master!D5>449,Master!D5<520),Spitzenlastkessel!C15,\"Anlagenheizlast zu groß\")))))))))))))))))))))))","v":"Spitzenlastkessel GMR 3035 (35 kW)"},null,null,{"$f":"IF(AND(Master!D5>29,Master!D5<55),Spitzenlastkessel!E4,(IF(AND(Master!D5>54,Master!D5<65),Spitzenlastkessel!E5,(IF(AND(Master!D5>64,Master!D5<85),Spitzenlastkessel!E6,(IF(AND(Master!D5>84,Master!D5<110),Spitzenlastkessel!E7,(IF(AND(Master!D5>109,Master!D5<135),Spitzenlastkessel!E8,(IF(AND(Master!D5>134,Master!D5<150),Spitzenlastkessel!E9,(IF(AND(Master!D5>149,Master!D5<200),Spitzenlastkessel!E10,(IF(AND(Master!D5>199,Master!D5<240),Spitzenlastkessel!E11,(IF(AND(Master!D5>239,Master!D5<300),Spitzenlastkessel!E12,(IF(AND(Master!D5>299,Master!D5<370),Spitzenlastkessel!E13,(IF(AND(Master!D5>369,Master!D5<450),Spitzenlastkessel!E14,(IF(AND(Master!D5>449,Master!D5<520),Spitzenlastkessel!E15,\"Anlagenheizlast zu groß\")))))))))))))))))))))))","v":3600},"€","(gewählt)",null,null,null,null,null,{"$f":"(100/L46)*D53","v":100},"Prozentuale Anlagenheizlast von GAWP"]
["Investitionskosten gesamt: ",null,null,{"$f":"(D45+D47-D46)","v":{"$error":"#VALUE!"}},"€",null,null,null,"N_I_GAWP_u_BW",null,null,{"$f":"MROUND(L47,5)","v":100},"Gerundet"]
[null,null,null,null,null,null,null,null,null,null,null,null,null,null,null,null,"Prozentuale \nAnlagen-\nheizlast \nder GAWP"]
["3b",null,null,null,null,null,null,null,null,null,null,{"$f":"VLOOKUP(L48,Q53:R80,2)","v":100},"Deckungsrate GAWP",null,null,null,null,"Deckungs-\nrate"]
["Betriebskosten"]
["Max. Leistung Brennwertgerät",null,null,{"$f":"IF(L40<0,0,(Master!D5-D53))","v":0},"kW"]
["Leistung 3 x GAWP",null,null,{"$f":"(L43)","v":40},"kW",null,null,null,null,null,null,null,null,null,null,null,0,0]
[null,null,null,null,null,null,null,null,null,null,null,null,null,null,null,null,5,8]
["Deckungsrate Brennwertgerät",null,null,{"$f":"(100-D56)","v":0},"%","(Ergibt sich aus Leistungsverhältnis Brennwertgerät/GAWP)",null,null,null,null,null,null,null,null,null,null,10,15]
["Deckungsrate 3 x GAWP",null,null,{"$f":"VLOOKUP(L48,Q53:R80,2)","v":100},"%","(Ergibt sich aus Leistungsverhältnis Brennwertgerät/GAWP)",null,null,null,null,null,null,null,null,null,null,15,25]
[null,null,null,null,null,null,null,null,null,null,null,null,null,null,null,null,20,33]
["Jahresarbeit Gas-Brennwertgerät",null,null,{"$f":"(D31*(D55/100))","v":0},"kWh/a","(Deckungsrate berücksichtigt)"]
["Jahresarbeit 3 x GAWP",null,null,{"$f":"(D31*(D56/100))","v":80000},"kWh/a","(Deckungsrate berücksichtigt)",null,null,null,null,null,null,null,null,null,null,25,41]
[null,null,null,null,null,null,null,null,null,null,null,null,null,null,null,null,30,50]
["Vollbenutzungsstunden Gas-Brennwertgerät",null,null,{"$f":"IF(D52=0,0,(D58/D52))","v":0},"h","(ergibt sich aus Jahresarbeit/Leistung)"]
["Vollbenutzungsstunden 3 x GAWP",null,null,{"$f":"(D59/D53)","v":2000},"h","(ergibt sich aus Jahresarbeit/Leistung)",null,null,null,null,null,null,null,null,null,null,35,58]
[null,null,null,null,null,null,null,null,null,null,null,null,null,null,null,null,40,67]
["Gasverbrauch Gas-Brennwertgerät",null,null,{"$f":"(D58/D3)","v":0},"kWh/a","(ergibt sich aus Jahresarbeit/Wirkungsgrad)",null,null,"N_B_GAS_BW"]
["Gasverbrauch 3 x GAWP",null,null,{"$f":"(D59/D4)","v":53333.333333333336},"kWh/a","(ergibt sich aus Jahresarbeit/Wirkungsgrad)",null,null,"N_B_GAS_GAWP",null,null,null,null,null,null,null,45,75]
[null,null,null,null,null,null,null,null,null,null,null,null,null,null,null,null,50,80]
["Kosten Gasverbrauch Gas-Brennwertgerät",null,null,{"$f":"(D64*D16)","v":0},"€/a","(ergibt sich aus Gasverbrauch x mittlerer Gaspreis)"]
["Kosten Gasverbrauch 3 x GAWP",null,null,{"$f":"(D65*D16)","v":6012.6722071138993},"€/a","(ergibt sich aus Gasverbrauch x mittlerer Gaspreis)",null,null,null,null,null,null,null,null,null,null,55,83]
[null,null,null,null,null,null,null,null,null,null,null,null,null,null,null,null,60,87]
["Wartungskosten Gas-Brennwertgerät",null,null,300,"€/a",null,null,null,"N_B_WART_BW"]
["Wartungskosten 3 x GAWP",null,null,700,"€/a",null,null,null,"N_B_WART_GAWP",null,null,null,null,null,null,null,65,90]
[null,null,null,null,null,null,null,null,null,null,null,null,null,null,null,null,70,92]
["Stromverbrauch 3 x GAWP",null,null,{"$f":"(D62*D5)*3","v":6540},"kWh/a",null,null,null,"N_B_STROM_LÜ_GAWP",null,null,null,null,null,null,null,75,94]
["Stromkosten 3 x GAWP",null,null,{"$f":"(D73*D20)","v":2681.1051978085161},"€/a","(Stromverbrauch x mittlerer Strompreis)",null,null,null,null,null,null,null,null,null,null,80,96]
["Stromverbrauch Gas-Brennwertgerät",null,null,{"$f":"(D61*D6)","v":0},"kWh/a",null,null,null,"N_B_STROM_BW"]
["Stromkosten Gas-Brennwertgerät",null,null,{"$f":"(D75*D20)","v":0},"€/a","(Stromverbrauch x mittlerer Strompreis)"]
["Stromverbrauch 3 x Umwälzpumpe GAWP",null,null,{"$f":"((D62)*D7)*3","v":300},"kWh/a",null,null,null,"N_B_STROM_PU_GAWP",null,null,null,null,null,null,null,85,97]
["Stromkosten 3 x Umwälzpumpe GAWP",null,null,{"$f":"(D77*D20)","v":122.98647696369339},"€/a","(Stromverbrauch x mittlerer Strompreis)",null,null,null,null,null,null,null,null,null,null,90,98]
[null,null,null,null,null,null,null,null,null,null,null,null,null,null,null,null,95,99]
["Betriebskosten pro Jahr gesamt:",null,null,{"$f":"SUM(D67:D71)+D78+D74+D76","v":9816.7638818861087},"€/a",null,null,null,null,null,null,null,null,null,null,null,100,100]
[]
["FAZIT:"]
["Mittlere Energieeinsparung pro Jahr bei Einsatz"]
["von drei GAWP LW und Gas-Brennwertgerät"]
["gegenüber \"nur Gas-Brennwert\":",null,null,{"$f":"IF((D38-D80)<0,\"negativ\",(D38-D80))","v":"negativ"},"€/a"]
[]
["Differenz Investitionskosten:",null,null,{"$f":"(D48-D27)","v":{"$error":"#VALUE!"}},"€"]
[]
["Für einen auf 20 Jahre gemittelten Engergiepreis"]
["ergibt sich eine Amortisationszeit von: ",null,null,{"$f":"IF(D85=\"negativ\",\"negativ\",(IF(D87<0,\"sofort\",D87/D85)))","v":"negativ"},{"$f":"IF(D85=\"negativ\",\"\",(IF(D87<0,\"\",\"Jahren\")))","v":""}]

{"sheet":"LW bival FLGAS","index":14,"n_rows":89,"n_cols":18,"rows_kept":89,"cut":false,"hidden":false,"merged":[[47,16,50,16],[48,17,50,17]]}
["Aktueller Flüssiggaspreis",null,null,{"$f":"(Energiepreisberechnung!D29)","v":7.0000000000000007E-2},"€/kWh"]
["Aktueller Strompreis",null,null,{"$f":"(Energiepreisberechnung!D31)","v":0.2},"€/kWh"]
["Gemittelter Wirkungsgrad Gasbrennwertgerät",null,null,1.06]
["Gemittelter Wirkungsgrad GAWP LW",null,null,1.5]
["Elektr. Leistung GAWP LW",null,null,1.0900000000000001,"kW"]
["Elektr. Leistung Kesselkreispumpe",null,null,0.05,"kW"]
[]
["Gesucht:","Investitions- und Betriebskosten während 20 Jahren"]
[]
["1."]
["Errechnung der mittleren Energiepreise binnen 20 Jahren"]
[]
["Flüssiggaspreis Anfangsjahr:",null,null,{"$f":"(D1)","v":7.0000000000000007E-2},"€/kWh"]
["Flüssiggaspreis im 20´sten Jahr:",null,null,{"$f":"(Energiepreisberechnung!D22)","v":0.25315692745236701},"€/kWh"]
["Mittlerer Flüssiggaspreis während 20 Jahren:",null,null,{"$f":"(Energiepreisberechnung!D24)","v":0.14348422312430903},"€/kWh"]
[]
["Strompreis Anfangsjahr:",null,null,{"$f":"(D2)","v":0.2},"€/kWh"]
["Strompreis im 20´sten Jahr:",null,null,{"$f":"(Energiepreisberechnung!E22)","v":0.72330550700676266},"€/kWh"]
["Mittlerer Strompreis während 20 Jahren:",null,null,{"$f":"(Energiepreisberechnung!E24)","v":0.40995492321231131},"€/kWh"]
[]
["2."]
["Betrachtung für ein neues Gasbrennwertgerät",null,null,{"$f":"(Master!D5)","v":40},"kW"]
[]
["2a"]
["Investitionskosten",null,null,{"$f":"(Master!D8)","v":5000},"€"]
["Investitionskosten gesamt: ",null,null,{"$f":"(D25)","v":5000},"€",null,null,null,"R_I_GAS"]
[]
["2b"]
["Betriebskosten Gas-Brennwertgerät"]
["Jahresarbeit Gas-Brennwertgerät",null,null,{"$f":"(Master!D5*Master!D6)","v":80000},"kWh/a","(Leistung x Jahresvollbenutzungsstunden)"]
["Energieverbrauch Gas-Brennwertgerät",null,null,{"$f":"(D30/D3)","v":75471.698113207545},"kWh/a","(Wirkungsgrad berücksichtigt)",null,null,"R_B_FLGAS"]
["Kosten Flüssiggas",null,null,{"$f":"(D31*D15)","v":10828.997971645964},"€/a"]
["Wartungskosten Gas-Brennwertgerät",null,null,300,"€/a",null,null,null,"R_B_WART_GAS"]
["Stromverbrauch 1 Stück Kesselkreispumpe",null,null,{"$f":"(Master!D6*D6)","v":100},"kWh/a",null,null,null,"R_B_STROM_GAS"]
["Stromkosten 1 Stück Kesselkreispumpe",null,null,{"$f":"(D34*D19)","v":40.995492321231133},"€/a","(Stromverbrauch x mittlerer Strompreis)"]
[]
["Betriebskosten pro Jahr gesamt:",null,null,{"$f":"SUM(D32:D33)+D35","v":11169.993463967196},"€/a"]
[null,null,null,null,null,null,null,null,null,null,null,"Negative Werte sollen gleich Null gesetzt werden"]
["3.",null,null,null,null,null,null,null,null,null,null,{"$f":"(Master!D5-D52)","v":5}]
["Betrachtung für eine GAWP 35 LW (35 kW) sowie Spitzenlastkessel"]
[null,null,null,null,null,null,null,null,null,null,null,"Wärmepumpe soll nur die Anlagenheizlast erbringen, welche erforderlich ist"]
["3a",null,null,null,null,null,null,null,null,null,null,{"$f":"IF(Master!D5<35,Master!D5,35)","v":35}]
["Investitionskosten"]
["GAWP + Zubehör",null,null,{"$f":"IF(Master!T15=TRUE,25000, (IF(Master!T16=TRUE,45000, (IF(Master!T17=TRUE,65000,\"\")))))","v":""},"€",null,null,null,null,null,null,"Deckungsrate GAWP"]
["Förderung BAFA",null,null,{"$f":"IF(Master!$T$15=TRUE,(2400+100*25), (IF(Master!$T$16=TRUE,(2400+100*60), (IF(Master!$T$17=TRUE,(2400+100*95),\"\")))))","v":""},"€",null,null,null,null,null,null,{"$f":"(D51+D52)","v":40},"Max Leistung BW plus Leistung GAWP"]
[{"$f":"IF(AND(Master!D5>29,Master!D5<55),Spitzenlastkessel!C4,(IF(AND(Master!D5>54,Master!D5<65),Spitzenlastkessel!C5,(IF(AND(Master!D5>64,Master!D5<85),Spitzenlastkessel!C6,(IF(AND(Master!D5>84,Master!D5<110),Spitzenlastkessel!C7,(IF(AND(Master!D5>109,Master!D5<135),Spitzenlastkessel!C8,(IF(AND(Master!D5>134,Master!D5<150),Spitzenlastkessel!C9,(IF(AND(Master!D5>149,Master!D5<200),Spitzenlastkessel!C10,(IF(AND(Master!D5>199,Master!D5<240),Spitzenlastkessel!C11,(IF(AND(Master!D5>239,Master!D5<300),Spitzenlastkessel!C12,(IF(AND(Master!D5>299,Master!D5<370),Spitzenlastkessel!C13,(IF(AND(Master!D5>369,Master!D5<450),Spitzenlastkessel!C14,(IF(AND(Master!D5>449,Master!D5<520),Spitzenlastkessel!C15,\"Anlagenheizlast zu groß\")))))))))))))))))))))))","v":"Spitzenlastkessel GMR 3035 (35 kW)"},null,null,{"$f":"IF(AND(Master!D5>29,Master!D5<55),Spitzenlastkessel!E4,(IF(AND(Master!D5>54,Master!D5<65),Spitzenlastkessel!E5,(IF(AND(Master!D5>64,Master!D5<85),Spitzenlastkessel!E6,(IF(AND(Master!D5>84,Master!D5<110),Spitzenlastkessel!E7,(IF(AND(Master!D5>109,Master!D5<135),Spitzenlastkessel!E8,(IF(AND(Master!D5>134,Master!D5<150),Spitzenlastkessel!E9,(IF(AND(Master!D5>149,Master!D5<200),Spitzenlastkessel!E10,(IF(AND(Master!D5>199,Master!D5<240),Spitzenlastkessel!E11,(IF(AND(Master!D5>239,Master!D5<300),Spitzenlastkessel!E12,(IF(AND(Master!D5>299,Master!D5<370),Spitzenlastkessel!E13,(IF(AND(Master!D5>369,Master!D5<450),Spitzenlastkessel!E14,(IF(AND(Master!D5>449,Master!D5<520),Spitzenlastkessel!E15,\"Anlagenheizlast zu groß\")))))))))))))))))))))))","v":3600},"€","(gewählt)",null,null,null,null,null,{"$f":"(100/L45)*D52","v":87.5},"Prozentuale Anlagenheizlast von GAWP"]
["Investitionskosten gesamt: ",null,null,{"$f":"(D44+D46-D45)","v":{"$error":"#VALUE!"}},"€",null,null,null,"N_I_GAWP_u_BW",null,null,{"$f":"MROUND(L46,5)","v":90},"Gerundet"]
[null,null,null,null,null,null,null,null,null,null,null,null,null,null,null,null,"Prozentuale \nAnlagen-\nheizlast \nder GAWP"]
["3b",null,null,null,null,null,null,null,null,null,null,{"$f":"VLOOKUP(L47,Q52:R79,2)","v":98},"Deckungsrate GAWP",null,null,null,null,"Deckungs-\nrate"]
["Betriebskosten"]
["Max. Leistung Brennwertgerät",null,null,{"$f":"IF(L39<0,0,(Master!D5-D52))","v":5},"kW"]
["Leistung GAWP",null,null,{"$f":"(L42)","v":35},"kW",null,null,null,null,null,null,null,null,null,null,null,0,0]
[null,null,null,null,null,null,null,null,null,null,null,null,null,null,null,null,5,8]
["Deckungsrate Brennwertgerät",null,null,{"$f":"(100-D55)","v":2},"%","(Ergibt sich aus Leistungsverhältnis Brennwertgerät/GAWP)",null,null,null,null,null,null,null,null,null,null,10,15]
["Deckungsrate GAWP",null,null,{"$f":"VLOOKUP(L47,Q52:R79,2)","v":98},"%","(Ergibt sich aus Leistungsverhältnis Brennwertgerät/GAWP)",null,null,null,null,null,null,null,null,null,null,15,25]
[null,null,null,null,null,null,null,null,null,null,null,null,null,null,null,null,20,33]
["Jahresarbeit Gas-Brennwertgerät",null,null,{"$f":"(D30*(D54/100))","v":1600},"kWh/a","(Deckungsrate berücksichtigt)"]
["Jahresarbeit GAWP",null,null,{"$f":"(D30*(D55/100))","v":78400},"kWh/a","(Deckungsrate berücksichtigt)",null,null,null,null,null,null,null,null,null,null,25,41]
[null,null,null,null,null,null,null,null,null,null,null,null,null,null,null,null,30,50]
["Vollbenutzungsstunden Gas-Brennwertgerät",null,null,{"$f":"IF(D51=0,0,(D57/D51))","v":320},"h","(ergibt sich aus Jahresarbeit/Leistung)"]
["Vollbenutzungsstunden GAWP",null,null,{"$f":"(D58/D52)","v":2240},"h","(ergibt sich aus Jahresarbeit/Leistung)",null,null,null,null,null,null,null,null,null,null,35,58]
[null,null,null,null,null,null,null,null,null,null,null,null,null,null,null,null,40,67]
["Flüssiggasverbrauch Gas-Brennwertgerät",null,null,{"$f":"(D57/D3)","v":1509.433962264151},"kWh/a","(ergibt sich aus Jahresarbeit/Wirkungsgrad)",null,null,"N_B_FLGAS_BW"]
["Flüssiggasverbrauch GAWP",null,null,{"$f":"(D58/D4)","v":52266.666666666664},"kWh/a","(ergibt sich aus Jahresarbeit/Wirkungsgrad)",null,null,"N_B_FLGAS_GAWP",null,null,null,null,null,null,null,45,75]
[null,null,null,null,null,null,null,null,null,null,null,null,null,null,null,null,50,80]
["Kosten Flüssiggasverbrauch Brennwertgerät",null,null,{"$f":"(D63*D15)","v":216.57995943291928},"€/a","(ergibt sich aus Flüssiggasverbrauch x mittlerer Flüssiggaspreis)"]
["Kosten Flüssiggasverbrauch GAWP",null,null,{"$f":"(D64*D15)","v":7499.442061963885},"€/a","(ergibt sich aus Flüssiggasverbrauch x mittlerer Flüssiggaspreis)",null,null,null,null,null,null,null,null,null,null,55,83]
[null,null,null,null,null,null,null,null,null,null,null,null,null,null,null,null,60,87]
["Wartungskosten Gas-Brennwertgerät",null,null,300,"€/a",null,null,null,"N_B_WART_BW"]
["Wartungskosten GAWP",null,null,300,"€/a",null,null,null,"N_B_WART_GAWP",null,null,null,null,null,null,null,65,90]
[null,null,null,null,null,null,null,null,null,null,null,null,null,null,null,null,70,92]
["Stromverbrauch GAWP",null,null,{"$f":"(D61*D5)","v":2441.6000000000004},"kWh/a",null,null,null,"N_B_STROM_LÜ_GAWP",null,null,null,null,null,null,null,75,94]
["Stromkosten GAWP",null,null,{"$f":"(D72*D19)","v":1000.9459405151795},"€/a","(Stromverbrauch x mittlerer Strompreis)",null,null,null,null,null,null,null,null,null,null,80,96]
["Stromverbrauch Gas-Brennwertgerät",null,null,{"$f":"(D60*D6)","v":16},"kWh/a",null,null,null,"N_B_STROM_BW"]
["Stromkosten Gas-Brennwertgerät",null,null,{"$f":"(D74*D19)","v":6.5592787713969809},"€/a","(Stromverbrauch x mittlerer Strompreis)"]
["Stromverbrauch Umwälzpumpe GAWP",null,null,{"$f":"((D61)*D6)","v":112},"kWh/a",null,null,null,"N_B_STROM_PU_GAWP",null,null,null,null,null,null,null,85,97]
["Stromkosten Umwälzpumpe GAWP",null,null,{"$f":"(D76*D19)","v":45.914951399778865},"€/a","(Stromverbrauch x mittlerer Strompreis)",null,null,null,null,null,null,null,null,null,null,90,98]
[null,null,null,null,null,null,null,null,null,null,null,null,null,null,null,null,95,99]
["Betriebskosten pro Jahr gesamt:",null,null,{"$f":"SUM(D66:D70)+D77+D73+D75","v":9369.4421920831592},"€/a",null,null,null,null,null,null,null,null,null,null,null,100,100]
[]
["FAZIT:"]
["Mittlere Energieeinsparung pro Jahr bei Einsatz"]
["von einer GAWP LW und Gas-Brennwertgerät"]
["gegenüber \"nur Gas-Brennwert\" (Flüssiggas):",null,null,{"$f":"(D37-D79)","v":1800.5512718840364},"€/a"]
[]
["Differenz Investitionskosten:",null,null,{"$f":"(D47-D26)","v":{"$error":"#VALUE!"}},"€"]
[]
["Für einen auf 20 Jahre gemittelten Engergiepreis"]
["ergibt sich eine Amortisationszeit von: ",null,null,{"$f":"IF((D86/D84)<0,\"sofort\",(D86/D84))","v":{"$error":"#VALUE!"}},{"$f":"IF((D86/D84)<0,\"\",\"Jahren\")","v":{"$error":"#VALUE!"}}]

{"sheet":"LW2 bival FLGAS","index":15,"n_rows":90,"n_cols":18,"rows_kept":90,"cut":false,"hidden":false,"merged":[[48,16,51,16],[49,17,51,17]]}
["Aktueller Flüssiggaspreis",null,null,{"$f":"(Energiepreisberechnung!D29)","v":7.0000000000000007E-2},"€/kWh"]
["Aktueller Strompreis",null,null,{"$f":"(Energiepreisberechnung!D31)","v":0.2},"€/kWh"]
["Gemittelter Wirkungsgrad Gasbrennwertgerät",null,null,1.06]
["Gemittelter Wirkungsgrad GAWP LW",null,null,1.5]
["Elektr. Leistung GAWP LW",null,null,1.0900000000000001,"kW"]
["Elektr. Leistung Kesselkreispumpe",null,null,0.06,"kW"]
["Elektr. Leistung Umwälzpumpe GAWP",null,null,0.05,"kW"]
[]
["Gesucht:","Investitions- und Betriebskosten während 20 Jahren"]
[]
["1."]
["Errechnung der mittleren Energiepreise binnen 20 Jahren"]
[]
["Flüssiggaspreis Anfangsjahr:",null,null,{"$f":"(D1)","v":7.0000000000000007E-2},"€/kWh"]
["Flüssiggaspreis im 20´sten Jahr:",null,null,{"$f":"(Energiepreisberechnung!D22)","v":0.25315692745236701},"€/kWh"]
["Mittlerer Flüssiggaspreis während 20 Jahren:",null,null,{"$f":"(Energiepreisberechnung!D24)","v":0.14348422312430903},"€/kWh"]
[]
["Strompreis Anfangsjahr:",null,null,{"$f":"(D2)","v":0.2},"€/kWh"]
["Strompreis im 20´sten Jahr:",null,null,{"$f":"(Energiepreisberechnung!E22)","v":0.72330550700676266},"€/kWh"]
["Mittlerer Strompreis während 20 Jahren:",null,null,{"$f":"(Energiepreisberechnung!E24)","v":0.40995492321231131},"€/kWh"]
[]
["2."]
["Betrachtung für ein neues Gasbrennwertgerät",null,null,{"$f":"(Master!D5)","v":40},"kW"]
[]
["2a"]
["Investitionskosten",null,null,{"$f":"(Master!D8)","v":5000},"€"]
["Investitionskosten gesamt: ",null,null,{"$f":"(D26)","v":5000},"€",null,null,null,"R_I_GAS"]
[]
["2b"]
["Betriebskosten Gas-Brennwertgerät"]
["Jahresarbeit Gas-Brennwertgerät",null,null,{"$f":"(Master!D5*Master!D6)","v":80000},"kWh/a","(Leistung x Jahresvollbenutzungsstunden)"]
["Energieverbrauch Gas-Brennwertgerät",null,null,{"$f":"(D31/D3)","v":75471.698113207545},"kWh/a","(Wirkungsgrad berücksichtigt)",null,null,"R_B_FLGAS"]
["Kosten Flüssiggas",null,null,{"$f":"(D32*D16)","v":10828.997971645964},"€/a"]
["Wartungskosten Gas-Brennwertgerät",null,null,300,"€/a",null,null,null,"R_B_WART_GAS"]
["Stromverbrauch 1 Stück Kesselkreispumpe",null,null,{"$f":"(Master!D6*D6)","v":120},"kWh/a",null,null,null,"R_B_STROM_GAS"]
["Stromkosten 1 Stück Kesselkreispumpe",null,null,{"$f":"(D35*D20)","v":49.194590785477359},"€/a","(Stromverbrauch x mittlerer Strompreis)"]
[]
["Betriebskosten pro Jahr gesamt:",null,null,{"$f":"SUM(D33:D34)+D36","v":11178.192562431441},"€/a"]
[null,null,null,null,null,null,null,null,null,null,null,"Negative Werte sollen gleich Null gesetzt werden"]
["3.",null,null,null,null,null,null,null,null,null,null,{"$f":"(Master!D5-D53)","v":0}]
["Betrachtung für zwei GAWP 35 LW (70 kW) sowie Spitzenlastkessel"]
[null,null,null,null,null,null,null,null,null,null,null,"Wärmepumpe soll nur die Anlagenheizlast erbringen, welche erforderlich ist"]
["3a",null,null,null,null,null,null,null,null,null,null,{"$f":"IF(Master!D5<70,Master!D5,70)","v":40}]
["Investitionskosten"]
["2 x GAWP + Zubehör",null,null,{"$f":"IF(Master!T15=TRUE,25000, (IF(Master!T16=TRUE,45000, (IF(Master!T17=TRUE,65000,\"\")))))","v":""},"€",null,null,null,null,null,null,"Deckungsrate GAWP"]
["Förderung BAFA",null,null,{"$f":"IF(Master!$T$15=TRUE,(2400+100*25), (IF(Master!$T$16=TRUE,(2400+100*60), (IF(Master!$T$17=TRUE,(2400+100*95),\"\")))))","v":""},"€",null,null,null,null,null,null,{"$f":"(D52+D53)","v":40},"Max Leistung BW plus Leistung GAWP"]
[{"$f":"IF(AND(Master!D5>29,Master!D5<55),Spitzenlastkessel!C4,(IF(AND(Master!D5>54,Master!D5<65),Spitzenlastkessel!C5,(IF(AND(Master!D5>64,Master!D5<85),Spitzenlastkessel!C6,(IF(AND(Master!D5>84,Master!D5<110),Spitzenlastkessel!C7,(IF(AND(Master!D5>109,Master!D5<135),Spitzenlastkessel!C8,(IF(AND(Master!D5>134,Master!D5<150),Spitzenlastkessel!C9,(IF(AND(Master!D5>149,Master!D5<200),Spitzenlastkessel!C10,(IF(AND(Master!D5>199,Master!D5<240),Spitzenlastkessel!C11,(IF(AND(Master!D5>239,Master!D5<300),Spitzenlastkessel!C12,(IF(AND(Master!D5>299,Master!D5<370),Spitzenlastkessel!C13,(IF(AND(Master!D5>369,Master!D5<450),Spitzenlastkessel!C14,(IF(AND(Master!D5>449,Master!D5<520),Spitzenlastkessel!C15,\"Anlagenheizlast zu groß\")))))))))))))))))))))))","v":"Spitzenlastkessel GMR 3035 (35 kW)"},null,null,{"$f":"IF(AND(Master!D5>29,Master!D5<55),Spitzenlastkessel!E4,(IF(AND(Master!D5>54,Master!D5<65),Spitzenlastkessel!E5,(IF(AND(Master!D5>64,Master!D5<85),Spitzenlastkessel!E6,(IF(AND(Master!D5>84,Master!D5<110),Spitzenlastkessel!E7,(IF(AND(Master!D5>109,Master!D5<135),Spitzenlastkessel!E8,(IF(AND(Master!D5>134,Master!D5<150),Spitzenlastkessel!E9,(IF(AND(Master!D5>149,Master!D5<200),Spitzenlastkessel!E10,(IF(AND(Master!D5>199,Master!D5<240),Spitzenlastkessel!E11,(IF(AND(Master!D5>239,Master!D5<300),Spitzenlastkessel!E12,(IF(AND(Master!D5>299,Master!D5<370),Spitzenlastkessel!E13,(IF(AND(Master!D5>369,Master!D5<450),Spitzenlastkessel!E14,(IF(AND(Master!D5>449,Master!D5<520),Spitzenlastkessel!E15,\"Anlagenheizlast zu groß\")))))))))))))))))))))))","v":3600},"€","(gewählt)",null,null,null,null,null,{"$f":"(100/L46)*D53","v":100},"Prozentuale Anlagenheizlast von GAWP"]
["Investitionskosten gesamt: ",null,null,{"$f":"(D45+D47-D46)","v":{"$error":"#VALUE!"}},"€",null,null,null,"N_I_GAWP_u_BW",null,null,{"$f":"MROUND(L47,5)","v":100},"Gerundet"]
[null,null,null,null,null,null,null,null,null,null,null,null,null,null,null,null,"Prozentuale \nAnlagen-\nheizlast \nder GAWP"]
["3b",null,null,null,null,null,null,null,null,null,null,{"$f":"VLOOKUP(L48,Q53:R80,2)","v":100},"Deckungsrate GAWP",null,null,null,null,"Deckungs-\nrate"]
["Betriebskosten"]
["Max. Leistung Brennwertgerät",null,null,{"$f":"IF(L40<0,0,(Master!D5-D53))","v":0},"kW"]
["Leistung 2 x GAWP",null,null,{"$f":"(L43)","v":40},"kW",null,null,null,null,null,null,null,null,null,null,null,0,0]
[null,null,null,null,null,null,null,null,null,null,null,null,null,null,null,null,5,8]
["Deckungsrate Brennwertgerät",null,null,{"$f":"(100-D56)","v":0},"%","(Ergibt sich aus Leistungsverhältnis Brennwertgerät/GAWP)",null,null,null,null,null,null,null,null,null,null,10,15]
["Deckungsrate 2 x GAWP",null,null,{"$f":"VLOOKUP(L48,Q53:R80,2)","v":100},"%","(Ergibt sich aus Leistungsverhältnis Brennwertgerät/GAWP)",null,null,null,null,null,null,null,null,null,null,15,25]
[null,null,null,null,null,null,null,null,null,null,null,null,null,null,null,null,20,33]
["Jahresarbeit Gas-Brennwertgerät",null,null,{"$f":"(D31*(D55/100))","v":0},"kWh/a","(Deckungsrate berücksichtigt)"]
["Jahresarbeit 2 x GAWP",null,null,{"$f":"(D31*(D56/100))","v":80000},"kWh/a","(Deckungsrate berücksichtigt)",null,null,null,null,null,null,null,null,null,null,25,41]
[null,null,null,null,null,null,null,null,null,null,null,null,null,null,null,null,30,50]
["Vollbenutzungsstunden Gas-Brennwertgerät",null,null,{"$f":"IF(D52=0,0,(D58/D52))","v":0},"h","(ergibt sich aus Jahresarbeit/Leistung)"]
["Vollbenutzungsstunden 2 x GAWP",null,null,{"$f":"(D59/D53)","v":2000},"h","(ergibt sich aus Jahresarbeit/Leistung)",null,null,null,null,null,null,null,null,null,null,35,58]
[null,null,null,null,null,null,null,null,null,null,null,null,null,null,null,null,40,67]
["Flüssiggasverbrauch Gas-Brennwertgerät",null,null,{"$f":"(D58/D3)","v":0},"kWh/a","(ergibt sich aus Jahresarbeit/Wirkungsgrad)",null,null,"N_B_FLGAS_BW"]
["Flüssiggasverbrauch 2 x GAWP",null,null,{"$f":"(D59/D4)","v":53333.333333333336},"kWh/a","(ergibt sich aus Jahresarbeit/Wirkungsgrad)",null,null,"N_B_FLGAS_GAWP",null,null,null,null,null,null,null,45,75]
[null,null,null,null,null,null,null,null,null,null,null,null,null,null,null,null,50,80]
["Kosten Flüssiggasverbrauch Brennwertgerät",null,null,{"$f":"(D64*D16)","v":0},"€/a","(ergibt sich aus Flüssiggasverbrauch x mittlerer Flüssiggaspreis)"]
["Kosten Flüssiggasverbrauch 2 x GAWP",null,null,{"$f":"(D65*D16)","v":7652.4918999631482},"€/a","(ergibt sich aus Flüssiggasverbrauch x mittlerer Flüssiggaspreis)",null,null,null,null,null,null,null,null,null,null,55,83]
[null,null,null,null,null,null,null,null,null,null,null,null,null,null,null,null,60,87]
["Wartungskosten Gas-Brennwertgerät",null,null,300,"€/a",null,null,null,"N_B_WART_BW"]
["Wartungskosten 2 x GAWP",null,null,500,"€/a",null,null,null,"N_B_WART_GAWP",null,null,null,null,null,null,null,65,90]
[null,null,null,null,null,null,null,null,null,null,null,null,null,null,null,null,70,92]
["Stromverbrauch 2 x GAWP",null,null,{"$f":"(D62*D5)*2","v":4360},"kWh/a",null,null,null,"N_B_STROM_LÜ_GAWP",null,null,null,null,null,null,null,75,94]
["Stromkosten 2 x GAWP",null,null,{"$f":"(D73*D20)","v":1787.4034652056773},"€/a","(Stromverbrauch x mittlerer Strompreis)",null,null,null,null,null,null,null,null,null,null,80,96]
["Stromverbrauch Gas-Brennwertgerät",null,null,{"$f":"(D61*D6)","v":0},"kWh/a",null,null,null,"N_B_STROM_BW"]
["Stromkosten Gas-Brennwertgerät",null,null,{"$f":"(D75*D20)","v":0},"€/a","(Stromverbrauch x mittlerer Strompreis)"]
["Stromverbrauch 2 x Umwälzpumpe GAWP",null,null,{"$f":"((D62)*D7)*2","v":200},"kWh/a",null,null,null,"N_B_STROM_PU_GAWP",null,null,null,null,null,null,null,85,97]
["Stromkosten 2 x Umwälzpumpe GAWP",null,null,{"$f":"(D77*D20)","v":81.990984642462266},"€/a","(Stromverbrauch x mittlerer Strompreis)",null,null,null,null,null,null,null,null,null,null,90,98]
[null,null,null,null,null,null,null,null,null,null,null,null,null,null,null,null,95,99]
["Betriebskosten pro Jahr gesamt:",null,null,{"$f":"SUM(D67:D71)+D78+D74+D76","v":10321.886349811288},"€/a",null,null,null,null,null,null,null,null,null,null,null,100,100]
[]
["FAZIT:"]
["Mittlere Energieeinsparung pro Jahr bei Einsatz"]
["von zwei GAWP LW und Gas-Brennwertgerät"]
["gegenüber \"nur Gas-Brennwert\" (Flüssiggas):",null,null,{"$f":"IF((D38-D80)<0,\"negativ\",(D38-D80))","v":856.30621262015302},"€/a"]
[]
["Differenz Investitionskosten:",null,null,{"$f":"(D48-D27)","v":{"$error":"#VALUE!"}},"€"]
[]
["Für einen auf 20 Jahre gemittelten Engergiepreis"]
["ergibt sich eine Amortisationszeit von: ",null,null,{"$f":"IF(D85=\"negativ\",\"negativ\",(IF(D87<0,\"sofort\",D87/D85)))","v":{"$error":"#VALUE!"}},{"$f":"IF(D85=\"negativ\",\"\",(IF(D87<0,\"\",\"Jahren\")))","v":{"$error":"#VALUE!"}}]

{"sheet":"LW3 bival FLGAS","index":16,"n_rows":90,"n_cols":18,"rows_kept":90,"cut":false,"hidden":false,"merged":[[48,16,51,16],[49,17,51,17]]}
["Aktueller Flüssiggaspreis",null,null,{"$f":"(Energiepreisberechnung!D29)","v":7.0000000000000007E-2},"€/kWh"]
["Aktueller Strompreis",null,null,{"$f":"(Energiepreisberechnung!D31)","v":0.2},"€/kWh"]
["Gemittelter Wirkungsgrad Gasbrennwertgerät",null,null,1.06]
["Gemittelter Wirkungsgrad GAWP LW",null,null,1.5]
["Elektr. Leistung GAWP LW",null,null,1.0900000000000001,"kW"]
["Elektr. Leistung Kesselkreispumpe",null,null,0.1,"kW"]
["Elektr. Leistung Umwälzpumpe GAWP",null,null,0.05,"kW"]
[]
["Gesucht:","Investitions- und Betriebskosten während 20 Jahren"]
[]
["1."]
["Errechnung der mittleren Energiepreise binnen 20 Jahren"]
[]
["Flüssiggaspreis Anfangsjahr:",null,null,{"$f":"(D1)","v":7.0000000000000007E-2},"€/kWh"]
["Flüssiggaspreis im 20´sten Jahr:",null,null,{"$f":"(Energiepreisberechnung!D22)","v":0.25315692745236701},"€/kWh"]
["Mittlerer Flüssiggaspreis während 20 Jahren:",null,null,{"$f":"(Energiepreisberechnung!D24)","v":0.14348422312430903},"€/kWh"]
[]
["Strompreis Anfangsjahr:",null,null,{"$f":"(D2)","v":0.2},"€/kWh"]
["Strompreis im 20´sten Jahr:",null,null,{"$f":"(Energiepreisberechnung!E22)","v":0.72330550700676266},"€/kWh"]
["Mittlerer Strompreis während 20 Jahren:",null,null,{"$f":"(Energiepreisberechnung!E24)","v":0.40995492321231131},"€/kWh"]
[]
["2."]
["Betrachtung für ein neues Gasbrennwertgerät",null,null,{"$f":"(Master!D5)","v":40},"kW"]
[]
["2a"]
["Investitionskosten",null,null,{"$f":"(Master!D8)","v":5000},"€"]
["Investitionskosten gesamt: ",null,null,{"$f":"(D26)","v":5000},"€",null,null,null,"R_I_GAS"]
[]
["2b"]
["Betriebskosten Gas-Brennwertgerät"]
["Jahresarbeit Gas-Brennwertgerät",null,null,{"$f":"(Master!D5*Master!D6)","v":80000},"kWh/a","(Leistung x Jahresvollbenutzungsstunden)"]
["Energieverbrauch Gas-Brennwertgerät",null,null,{"$f":"(D31/D3)","v":75471.698113207545},"kWh/a","(Wirkungsgrad berücksichtigt)",null,null,"R_B_FLGAS"]
["Kosten Flüssiggas",null,null,{"$f":"(D32*D16)","v":10828.997971645964},"€/a"]
["Wartungskosten Gas-Brennwertgerät",null,null,300,"€/a",null,null,null,"R_B_WART_GAS"]
["Stromverbrauch 1 Stück Kesselkreispumpe",null,null,{"$f":"(Master!D6*D6)","v":200},"kWh/a",null,null,null,"R_B_STROM_GAS"]
["Stromkosten 1 Stück Kesselkreispumpe",null,null,{"$f":"(D35*D20)","v":81.990984642462266},"€/a","(Stromverbrauch x mittlerer Strompreis)"]
[]
["Betriebskosten pro Jahr gesamt:",null,null,{"$f":"SUM(D33:D34)+D36","v":11210.988956288425},"€/a"]
[null,null,null,null,null,null,null,null,null,null,null,"Negative Werte sollen gleich Null gesetzt werden"]
["3.",null,null,null,null,null,null,null,null,null,null,{"$f":"(Master!D5-D53)","v":0}]
["Betrachtung für drei GAWP 35 LW (105 kW) sowie Spitzenlastkessel"]
[null,null,null,null,null,null,null,null,null,null,null,"Wärmepumpe soll nur die Anlagenheizlast erbringen, welche erforderlich ist"]
["3a",null,null,null,null,null,null,null,null,null,null,{"$f":"IF(Master!D5<105,Master!D5,105)","v":40}]
["Investitionskosten"]
["3 x GAWP + Zubehör",null,null,{"$f":"IF(Master!T15=TRUE,25000, (IF(Master!T16=TRUE,45000, (IF(Master!T17=TRUE,65000,\"\")))))","v":""},"€",null,null,null,null,null,null,"Deckungsrate GAWP"]
["Förderung BAFA",null,null,{"$f":"IF(Master!$T$15=TRUE,(2400+100*25), (IF(Master!$T$16=TRUE,(2400+100*60), (IF(Master!$T$17=TRUE,(2400+100*95),\"\")))))","v":""},"€",null,null,null,null,null,null,{"$f":"(D52+D53)","v":40},"Max Leistung BW plus Leistung GAWP"]
[{"$f":"IF(AND(Master!D5>29,Master!D5<55),Spitzenlastkessel!C4,(IF(AND(Master!D5>54,Master!D5<65),Spitzenlastkessel!C5,(IF(AND(Master!D5>64,Master!D5<85),Spitzenlastkessel!C6,(IF(AND(Master!D5>84,Master!D5<110),Spitzenlastkessel!C7,(IF(AND(Master!D5>109,Master!D5<135),Spitzenlastkessel!C8,(IF(AND(Master!D5>134,Master!D5<150),Spitzenlastkessel!C9,(IF(AND(Master!D5>149,Master!D5<200),Spitzenlastkessel!C10,(IF(AND(Master!D5>199,Master!D5<240),Spitzenlastkessel!C11,(IF(AND(Master!D5>239,Master!D5<300),Spitzenlastkessel!C12,(IF(AND(Master!D5>299,Master!D5<370),Spitzenlastkessel!C13,(IF(AND(Master!D5>369,Master!D5<450),Spitzenlastkessel!C14,(IF(AND(Master!D5>449,Master!D5<520),Spitzenlastkessel!C15,\"Anlagenheizlast zu groß\")))))))))))))))))))))))","v":"Spitzenlastkessel GMR 3035 (35 kW)"},null,null,{"$f":"IF(AND(Master!D5>29,Master!D5<55),Spitzenlastkessel!E4,(IF(AND(Master!D5>54,Master!D5<65),Spitzenlastkessel!E5,(IF(AND(Master!D5>64,Master!D5<85),Spitzenlastkessel!E6,(IF(AND(Master!D5>84,Master!D5<110),Spitzenlastkessel!E7,(IF(AND(Master!D5>109,Master!D5<135),Spitzenlastkessel!E8,(IF(AND(Master!D5>134,Master!D5<150),Spitzenlastkessel!E9,(IF(AND(Master!D5>149,Master!D5<200),Spitzenlastkessel!E10,(IF(AND(Master!D5>199,Master!D5<240),Spitzenlastkessel!E11,(IF(AND(Master!D5>239,Master!D5<300),Spitzenlastkessel!E12,(IF(AND(Master!D5>299,Master!D5<370),Spitzenlastkessel!E13,(IF(AND(Master!D5>369,Master!D5<450),Spitzenlastkessel!E14,(IF(AND(Master!D5>449,Master!D5<520),Spitzenlastkessel!E15,\"Anlagenheizlast zu groß\")))))))))))))))))))))))","v":3600},"€","(gewählt)",null,null,null,null,null,{"$f":"(100/L46)*D53","v":100},"Prozentuale Anlagenheizlast von GAWP"]
["Investitionskosten gesamt: ",null,null,{"$f":"(D45+D47-D46)","v":{"$error":"#VALUE!"}},"€",null,null,null,"N_I_GAWP_u_BW",null,null,{"$f":"MROUND(L47,5)","v":100},"Gerundet"]
[null,null,null,null,null,null,null,null,null,null,null,null,null,null,null,null,"Prozentuale \nAnlagen-\nheizlast \nder GAWP"]
["3b",null,null,null,null,null,null,null,null,null,null,{"$f":"VLOOKUP(L48,Q53:R80,2)","v":100},"Deckungsrate GAWP",null,null,null,null,"Deckungs-\nrate"]
["Betriebskosten"]
["Max. Leistung Brennwertgerät",null,null,{"$f":"IF(L40<0,0,(Master!D5-D53))","v":0},"kW"]
["Leistung 3 x GAWP",null,null,{"$f":"(L43)","v":40},"kW",null,null,null,null,null,null,null,null,null,null,null,0,0]
[null,null,null,null,null,null,null,null,null,null,null,null,null,null,null,null,5,8]
["Deckungsrate Brennwertgerät",null,null,{"$f":"(100-D56)","v":0},"%","(Ergibt sich aus Leistungsverhältnis Brennwertgerät/GAWP)",null,null,null,null,null,null,null,null,null,null,10,15]
["Deckungsrate 3 x GAWP",null,null,{"$f":"VLOOKUP(L48,Q53:R80,2)","v":100},"%","(Ergibt sich aus Leistungsverhältnis Brennwertgerät/GAWP)",null,null,null,null,null,null,null,null,null,null,15,25]
[null,null,null,null,null,null,null,null,null,null,null,null,null,null,null,null,20,33]
["Jahresarbeit Gas-Brennwertgerät",null,null,{"$f":"(D31*(D55/100))","v":0},"kWh/a","(Deckungsrate berücksichtigt)"]
["Jahresarbeit 3 x GAWP",null,null,{"$f":"(D31*(D56/100))","v":80000},"kWh/a","(Deckungsrate berücksichtigt)",null,null,null,null,null,null,null,null,null,null,25,41]
[null,null,null,null,null,null,null,null,null,null,null,null,null,null,null,null,30,50]
["Vollbenutzungsstunden Gas-Brennwertgerät",null,null,{"$f":"IF(D52=0,0,(D58/D52))","v":0},"h","(ergibt sich aus Jahresarbeit/Leistung)"]
["Vollbenutzungsstunden 3 x GAWP",null,null,{"$f":"(D59/D53)","v":2000},"h","(ergibt sich aus Jahresarbeit/Leistung)",null,null,null,null,null,null,null,null,null,null,35,58]
[null,null,null,null,null,null,null,null,null,null,null,null,null,null,null,null,40,67]
["Flüssiggasverbrauch Gas-Brennwertgerät",null,null,{"$f":"(D58/D3)","v":0},"kWh/a","(ergibt sich aus Jahresarbeit/Wirkungsgrad)",null,null,"N_B_FLGAS_BW"]
["Flüssiggasverbrauch 3 x GAWP",null,null,{"$f":"(D59/D4)","v":53333.333333333336},"kWh/a","(ergibt sich aus Jahresarbeit/Wirkungsgrad)",null,null,"N_B_FLGAS_GAWP",null,null,null,null,null,null,null,45,75]
[null,null,null,null,null,null,null,null,null,null,null,null,null,null,null,null,50,80]
["Kosten Flüssiggasverbrauch Brennwertgerät",null,null,{"$f":"(D64*D16)","v":0},"€/a","(ergibt sich aus Flüssiggasverbrauch x mittlerer Flüssiggaspreis)"]
["Kosten Flüssiggasverbrauch 3 x GAWP",null,null,{"$f":"(D65*D16)","v":7652.4918999631482},"€/a","(ergibt sich aus Flüssiggasverbrauch x mittlerer Flüssiggaspreis)",null,null,null,null,null,null,null,null,null,null,55,83]
[null,null,null,null,null,null,null,null,null,null,null,null,null,null,null,null,60,87]
["Wartungskosten Gas-Brennwertgerät",null,null,300,"€/a",null,null,null,"N_B_WART_BW"]
["Wartungskosten 3 x GAWP",null,null,700,"€/a",null,null,null,"N_B_WART_GAWP",null,null,null,null,null,null,null,65,90]
[null,null,null,null,null,null,null,null,null,null,null,null,null,null,null,null,70,92]
["Stromverbrauch 3 x GAWP",null,null,{"$f":"(D62*D5)*3","v":6540},"kWh/a",null,null,null,"N_B_STROM_LÜ_GAWP",null,null,null,null,null,null,null,75,94]
["Stromkosten 3 x GAWP",null,null,{"$f":"(D73*D20)","v":2681.1051978085161},"€/a","(Stromverbrauch x mittlerer Strompreis)",null,null,null,null,null,null,null,null,null,null,80,96]
["Stromverbrauch Gas-Brennwertgerät",null,null,{"$f":"(D61*D6)","v":0},"kWh/a",null,null,null,"N_B_STROM_BW"]
["Stromkosten Gas-Brennwertgerät",null,null,{"$f":"(D75*D20)","v":0},"€/a","(Stromverbrauch x mittlerer Strompreis)"]
["Stromverbrauch 3 x Umwälzpumpe GAWP",null,null,{"$f":"((D62)*D7)*3","v":300},"kWh/a",null,null,null,"N_B_STROM_PU_GAWP",null,null,null,null,null,null,null,85,97]
["Stromkosten 3 x Umwälzpumpe GAWP",null,null,{"$f":"(D77*D20)","v":122.98647696369339},"€/a","(Stromverbrauch x mittlerer Strompreis)",null,null,null,null,null,null,null,null,null,null,90,98]
[null,null,null,null,null,null,null,null,null,null,null,null,null,null,null,null,95,99]
["Betriebskosten pro Jahr gesamt:",null,null,{"$f":"SUM(D67:D71)+D78+D74+D76","v":11456.583574735358},"€/a",null,null,null,null,null,null,null,null,null,null,null,100,100]
[]
["FAZIT:"]
["Mittlere Energieeinsparung pro Jahr bei Einsatz"]
["von drei GAWP LW und Gas-Brennwertgerät"]
["gegenüber \"nur Gas-Brennwert\" (Flüssiggas):",null,null,{"$f":"IF((D38-D80)<0,\"negativ\",(D38-D80))","v":"negativ"},"€/a"]
[]
["Differenz Investitionskosten:",null,null,{"$f":"(D48-D27)","v":{"$error":"#VALUE!"}},"€"]
[]
["Für einen auf 20 Jahre gemittelten Engergiepreis"]
["ergibt sich eine Amortisationszeit von: ",null,null,{"$f":"IF(D85=\"negativ\",\"negativ\",(IF(D87<0,\"sofort\",D87/D85)))","v":"negativ"},{"$f":"IF(D85=\"negativ\",\"\",(IF(D87<0,\"\",\"Jahren\")))","v":""}]

{"sheet":"SW bival ÖL","index":17,"n_rows":95,"n_cols":18,"rows_kept":95,"cut":false,"hidden":false,"merged":[[54,17,56,17],[53,16,56,16]]}
["Aktueller Gaspreis",null,null,{"$f":"(Energiepreisberechnung!D28)","v":5.5E-2},"€/kWh"]
["Aktueller Ölpreis",null,null,{"$f":"(Energiepreisberechnung!D30)","v":8.5000000000000006E-2},"€/kWh"]
["Aktueller Strompreis",null,null,{"$f":"(Energiepreisberechnung!D31)","v":0.2},"€/kWh"]
["Gemittelter Wirkungsgrad Ölkessel ",null,null,0.93]
["Gemittelter Wirkungsgrad Gasbrennwertgerät",null,null,1.06]
["Gemittelter Wirkungsgrad GAWP SW",null,null,1.55]
["Elektr. Leistung GAWP SW",null,null,0.47,"kW"]
["Elektr. Leistung Kesselkreispumpe",null,null,0.05,"kW"]
[]
["Gesucht:","Investitions- und Betriebskosten während 20 Jahren"]
[]
["1."]
["Errechnung der mittleren Energiepreise binnen 20 Jahren"]
[]
["Gaspreis Anfangsjahr:",null,null,{"$f":"(D1)","v":5.5E-2},"€/kWh"]
["Gaspreis im 20´sten Jahr:",null,null,{"$f":"(Energiepreisberechnung!C22)","v":0.19890901442685968},"€/kWh"]
["Mittlerer Gaspreis während 20 Jahren:",null,null,{"$f":"(Energiepreisberechnung!C24)","v":0.11273760388338561},"€/kWh"]
[]
["Ölpreis Anfangsjahr:",null,null,{"$f":"(D2)","v":8.5000000000000006E-2},"€/kWh"]
["Ölpreis im 20´sten Jahr:",null,null,{"$f":"(Energiepreisberechnung!F22)","v":0.30740484047787403},"€/kWh"]
["Mittlerer Ölpreis während 20 Jahren:",null,null,{"$f":"(Energiepreisberechnung!F24)","v":0.17423084236523231},"€/kWh"]
[]
["Strompreis Anfangsjahr:",null,null,{"$f":"(D3)","v":0.2},"€/kWh"]
["Strompreis im 20´sten Jahr:",null,null,{"$f":"(Energiepreisberechnung!E22)","v":0.72330550700676266},"€/kWh"]
["Mittlerer Strompreis während 20 Jahren:",null,null,{"$f":"(Energiepreisberechnung!E24)","v":0.40995492321231131},"€/kWh"]
[]
["2."]
["Betrachtung ohne Investition (bestehende Kessel bleiben)"]
[]
["2a"]
["Investitionskosten"]
["Investitionskosten gesamt: ",null,null,0,"€",null,null,null,"R_I_ÖL"]
[]
["2b"]
["Betriebskosten Öl"]
["Jahresarbeit Ölkessel",null,null,{"$f":"(Master!D5*Master!D6)","v":80000},"kWh/a","(Leistung x Jahresvollbenutzungsstunden)"]
["Energieverbrauch Ölkessel",null,null,{"$f":"(D36/D4)","v":86021.505376344081},"kWh/a","(Wirkungsgrad berücksichtigt)",null,null,"R_B_ÖL"]
["Kosten Öl ",null,null,{"$f":"(D37*D21)","v":14987.599343245789},"€/a"]
["Wartungskosten Ölkessel",null,null,300,"€/a",null,null,null,"R_B_WART_ÖL"]
["Stromverbrauch 1 Stück Kesselkreispumpe",null,null,{"$f":"(Master!D6*D8)","v":100},"kWh/a",null,null,null,"R_B_STROM_ÖL"]
["Stromkosten 1 Stück Kesselkreispumpe",null,null,{"$f":"(D40*D25)","v":40.995492321231133},"€/a","(Stromverbrauch x mittlerer Strompreis)"]
[]
["Betriebskosten pro Jahr gesamt:",null,null,{"$f":"SUM(D38:D39)+D41","v":15328.594835567021},"€/a"]
[null,null,null,null,null,null,null,null,null,null,null,"Negative Werte sollen gleich Null gesetzt werden"]
["3.",null,null,null,null,null,null,null,null,null,null,{"$f":"(Master!D5-D58)","v":0}]
["Betrachtung für eine GAWP 40 SW (40 kW) sowie Spitzenlastkessel"]
[null,null,null,null,null,null,null,null,null,null,null,"Wärmepumpe soll nur die Anlagenheizlast erbringen, welche erforderlich ist"]
["3a",null,null,null,null,null,null,null,null,null,null,{"$f":"IF(Master!D5<40,Master!D5,40)","v":40}]
["Investitionskosten"]
["GAWP + Zubehör",null,null,{"$f":"IF(Master!T12=TRUE,25000, (IF(Master!T13=TRUE,45000, (IF(Master!T14=TRUE,65000,\"\")))))","v":""},"€",null,null,null,null,null,null,"Deckungsrate GAWP"]
["Förderung BAFA",null,null,{"$f":"IF(Master!$T$12=TRUE,(2400+100*30), (IF(Master!$T$13=TRUE,(2400+100*70), (IF(Master!$T$14=TRUE,(2400+100*110),\"\")))))","v":""},"€",null,null,null,null,null,null,{"$f":"(D57/D58)","v":0},"Quotient BW zu GAWP"]
[{"$f":"IF(AND(Master!D5>29,Master!D5<55),Spitzenlastkessel!C4,(IF(AND(Master!D5>54,Master!D5<65),Spitzenlastkessel!C5,(IF(AND(Master!D5>64,Master!D5<85),Spitzenlastkessel!C6,(IF(AND(Master!D5>84,Master!D5<110),Spitzenlastkessel!C7,(IF(AND(Master!D5>109,Master!D5<135),Spitzenlastkessel!C8,(IF(AND(Master!D5>134,Master!D5<150),Spitzenlastkessel!C9,(IF(AND(Master!D5>149,Master!D5<200),Spitzenlastkessel!C10,(IF(AND(Master!D5>199,Master!D5<240),Spitzenlastkessel!C11,(IF(AND(Master!D5>239,Master!D5<300),Spitzenlastkessel!C12,(IF(AND(Master!D5>299,Master!D5<370),Spitzenlastkessel!C13,(IF(AND(Master!D5>369,Master!D5<450),Spitzenlastkessel!C14,(IF(AND(Master!D5>449,Master!D5<520),Spitzenlastkessel!C15,\"Anlagenheizlast zu groß\")))))))))))))))))))))))","v":"Spitzenlastkessel GMR 3035 (35 kW)"},null,null,{"$f":"IF(AND(Master!D5>29,Master!D5<55),Spitzenlastkessel!E4,(IF(AND(Master!D5>54,Master!D5<65),Spitzenlastkessel!E5,(IF(AND(Master!D5>64,Master!D5<85),Spitzenlastkessel!E6,(IF(AND(Master!D5>84,Master!D5<110),Spitzenlastkessel!E7,(IF(AND(Master!D5>109,Master!D5<135),Spitzenlastkessel!E8,(IF(AND(Master!D5>134,Master!D5<150),Spitzenlastkessel!E9,(IF(AND(Master!D5>149,Master!D5<200),Spitzenlastkessel!E10,(IF(AND(Master!D5>199,Master!D5<240),Spitzenlastkessel!E11,(IF(AND(Master!D5>239,Master!D5<300),Spitzenlastkessel!E12,(IF(AND(Master!D5>299,Master!D5<370),Spitzenlastkessel!E13,(IF(AND(Master!D5>369,Master!D5<450),Spitzenlastkessel!E14,(IF(AND(Master!D5>449,Master!D5<520),Spitzenlastkessel!E15,\"Anlagenheizlast zu groß\")))))))))))))))))))))))","v":3600},"€","(gewählt)",null,null,null,null,null,{"$f":"(D57+D58)","v":40},"Max Leistung BW plus Leistung GAWP"]
["Investitionskosten gesamt: ",null,null,{"$f":"(D50+D52-D51)","v":{"$error":"#VALUE!"}},"€",null,null,null,"N_I_GAWP_u_BW",null,null,{"$f":"(100/L52)*D58","v":100},"Prozentuale Anlagenheizlast von GAWP"]
[null,null,null,null,null,null,null,null,null,null,null,{"$f":"MROUND(L53,5)","v":100},"Gerundet",null,null,null,"Prozentuale \nAnlagen-\nheizlast \nder GAWP"]
["3b",null,null,null,null,null,null,null,null,null,null,{"$f":"VLOOKUP(L54,Q58:R85,2)","v":100},"Deckungsrate GAWP",null,null,null,null,"Deckungs-\nrate"]
["Betriebskosten"]
["Max. Leistung Brennwertgerät",null,null,{"$f":"IF(L45<0,0,(Master!D5-D58))","v":0},"kW"]
["Leistung GAWP",null,null,{"$f":"(L48)","v":40},"kW",null,null,null,null,null,null,null,null,null,null,null,0,0]
[null,null,null,null,null,null,null,null,null,null,null,null,null,null,null,null,5,8]
["Deckungsrate Brennwertgerät",null,null,{"$f":"(100-D61)","v":0},"%","(Ergibt sich aus Leistungsverhältnis Brennwertgerät/GAWP)",null,null,null,null,null,null,null,null,null,null,10,15]
["Deckungsrate GAWP",null,null,{"$f":"VLOOKUP(L54,Q58:R85,2)","v":100},"%","(Ergibt sich aus Leistungsverhältnis Brennwertgerät/GAWP)",null,null,null,null,null,null,null,null,null,null,15,25]
[null,null,null,null,null,null,null,null,null,null,null,null,null,null,null,null,20,33]
["Jahresarbeit Gas-Brennwertgerät",null,null,{"$f":"(D36*(D60/100))","v":0},"kWh/a","(Deckungsrate berücksichtigt)"]
["Jahresarbeit GAWP",null,null,{"$f":"(D36*(D61/100))","v":80000},"kWh/a","(Deckungsrate berücksichtigt)",null,null,null,null,null,null,null,null,null,null,25,41]
[null,null,null,null,null,null,null,null,null,null,null,null,null,null,null,null,30,50]
["Vollbenutzungsstunden Gas-Brennwertgerät",null,null,{"$f":"IF(D57=0,0,(D63/D57))","v":0},"h","(ergibt sich aus Jahresarbeit/Leistung)"]
["Vollbenutzungsstunden GAWP",null,null,{"$f":"(D64/D58)","v":2000},"h","(ergibt sich aus Jahresarbeit/Leistung)",null,null,null,null,null,null,null,null,null,null,35,58]
[null,null,null,null,null,null,null,null,null,null,null,null,null,null,null,null,40,67]
["Gasverbrauch Gas-Brennwertgerät",null,null,{"$f":"(D63/D5)","v":0},"kWh/a","(ergibt sich aus Jahresarbeit/Wirkungsgrad)",null,null,"N_B_GAS_BW"]
["Gasverbrauch GAWP",null,null,{"$f":"(D64/D6)","v":51612.903225806447},"kWh/a","(ergibt sich aus Jahresarbeit/Wirkungsgrad)",null,null,"N_B_GAS_GAWP",null,null,null,null,null,null,null,45,75]
[null,null,null,null,null,null,null,null,null,null,null,null,null,null,null,null,50,80]
["Kosten Gasverbrauch Gas-Brennwertgerät",null,null,{"$f":"(D69*D17)","v":0},"€/a","(ergibt sich aus Gasverbrauch x mittlerer Gaspreis)"]
["Kosten Gasverbrauch GAWP",null,null,{"$f":"(D70*D17)","v":5818.7150391424821},"€/a","(ergibt sich aus Gasverbrauch x mittlerer Gaspreis)",null,null,null,null,null,null,null,null,null,null,55,83]
[null,null,null,null,null,null,null,null,null,null,null,null,null,null,null,null,60,87]
["Wartungskosten Gas-Brennwertgerät",null,null,300,"€/a",null,null,null,"N_B_WART_BW"]
["Wartungskosten GAWP",null,null,300,"€/a",null,null,null,"N_B_WART_GAWP",null,null,null,null,null,null,null,65,90]
[null,null,null,null,null,null,null,null,null,null,null,null,null,null,null,null,70,92]
["Stromverbrauch GAWP",null,null,{"$f":"(D67*D7)","v":940},"kWh/a",null,null,null,"N_B_STROM_LÜ_GAWP",null,null,null,null,null,null,null,75,94]
["Stromkosten GAWP",null,null,{"$f":"(D78*D25)","v":385.35762781957266},"€/a","(Stromverbrauch x mittlerer Strompreis)",null,null,null,null,null,null,null,null,null,null,80,96]
["Stromverbrauch Gas-Brennwertgerät",null,null,{"$f":"(D66*D8)","v":0},"kWh/a",null,null,null,"N_B_STROM_BW"]
["Stromkosten Gas-Brennwertgerät",null,null,{"$f":"(D80*D25)","v":0},"€/a","(Stromverbrauch x mittlerer Strompreis)"]
["Stromverbrauch 2 x Umwälzpumpe GAWP",null,null,{"$f":"((D67)*D8*2)","v":200},"kWh/a",null,null,null,"N_B_STROM_PU_GAWP",null,null,null,null,null,null,null,85,97]
["Stromkosten 2 x Umwälzpumpe GAWP",null,null,{"$f":"(D82*D25)","v":81.990984642462266},"€/a","(Stromverbrauch x mittlerer Strompreis)",null,null,null,null,null,null,null,null,null,null,90,98]
[null,null,null,null,null,null,null,null,null,null,null,null,null,null,null,null,95,99]
["Betriebskosten pro Jahr gesamt:",null,null,{"$f":"SUM(D72:D76)+D83+D79+D81","v":6886.063651604517},"€/a",null,null,null,null,null,null,null,null,null,null,null,100,100]
[]
["FAZIT:"]
["Mittlere Energieeinsparung pro Jahr bei Einsatz"]
["von einer GAWP SW und Gas-Brennwertgerät"]
["gegenüber bestehenden Betriebskosten",null,null,{"$f":"(D43-D85)","v":8442.5311839625028},"€/a"]
[]
["Differenz Investitionskosten:",null,null,{"$f":"(D53-D32)","v":{"$error":"#VALUE!"}},"€"]
[]
["Für einen auf 20 Jahre gemittelten Engergiepreis"]
["ergibt sich eine Amortisationszeit von: ",null,null,{"$f":"IF((D92/D90)<0,\"sofort\",(D92/D90))","v":{"$error":"#VALUE!"}},{"$f":"IF((D92/D90)<0,\"\",\"Jahren\")","v":{"$error":"#VALUE!"}}]

{"sheet":"SW2 bival ÖL","index":18,"n_rows":96,"n_cols":18,"rows_kept":96,"cut":false,"hidden":false,"merged":[[54,16,57,16],[55,17,57,17]]}
["Aktueller Gaspreis",null,null,{"$f":"(Energiepreisberechnung!D28)","v":5.5E-2},"€/kWh"]
["Aktueller Ölpreis",null,null,{"$f":"(Energiepreisberechnung!D30)","v":8.5000000000000006E-2},"€/kWh"]
["Aktueller Strompreis",null,null,{"$f":"(Energiepreisberechnung!D31)","v":0.2},"€/kWh"]
["Gemittelter Wirkungsgrad Ölkessel ",null,null,0.93]
["Gemittelter Wirkungsgrad Gasbrennwertgerät",null,null,1.06]
["Gemittelter Wirkungsgrad GAWP SW",null,null,1.55]
["Elektr. Leistung GAWP SW",null,null,0.47,"kW"]
["Elektr. Leistung Kesselkreispumpe",null,null,0.06,"kW"]
["Elektr. Leistung Umwälzpumpe GAWP",null,null,0.05,"kW"]
[]
["Gesucht:","Investitions- und Betriebskosten während 20 Jahren"]
[]
["1."]
["Errechnung der mittleren Energiepreise binnen 20 Jahren"]
[]
["Gaspreis Anfangsjahr:",null,null,{"$f":"(D1)","v":5.5E-2},"€/kWh"]
["Gaspreis im 20´sten Jahr:",null,null,{"$f":"(Energiepreisberechnung!C22)","v":0.19890901442685968},"€/kWh"]
["Mittlerer Gaspreis während 20 Jahren:",null,null,{"$f":"(Energiepreisberechnung!C24)","v":0.11273760388338561},"€/kWh"]
[]
["Ölpreis Anfangsjahr:",null,null,{"$f":"(D2)","v":8.5000000000000006E-2},"€/kWh"]
["Ölpreis im 20´sten Jahr:",null,null,{"$f":"(Energiepreisberechnung!F22)","v":0.30740484047787403},"€/kWh"]
["Mittlerer Ölpreis während 20 Jahren:",null,null,{"$f":"(Energiepreisberechnung!F24)","v":0.17423084236523231},"€/kWh"]
[]
["Strompreis Anfangsjahr:",null,null,{"$f":"(D3)","v":0.2},"€/kWh"]
["Strompreis im 20´sten Jahr:",null,null,{"$f":"(Energiepreisberechnung!E22)","v":0.72330550700676266},"€/kWh"]
["Mittlerer Strompreis während 20 Jahren:",null,null,{"$f":"(Energiepreisberechnung!E24)","v":0.40995492321231131},"€/kWh"]
[]
["2."]
["Betrachtung ohne Investition (bestehende Kessel bleiben)"]
[]
["2a"]
["Investitionskosten"]
["Investitionskosten gesamt: ",null,null,0,"€",null,null,null,"R_I_ÖL"]
[]
["2b"]
["Betriebskosten Öl"]
["Jahresarbeit Ölkessel",null,null,{"$f":"(Master!D5*Master!D6)","v":80000},"kWh/a","(Leistung x Jahresvollbenutzungsstunden)"]
["Energieverbrauch Ölkessel",null,null,{"$f":"(D37/D4)","v":86021.505376344081},"kWh/a","(Wirkungsgrad berücksichtigt)",null,null,"R_B_ÖL"]
["Kosten Öl ",null,null,{"$f":"(D38*D22)","v":14987.599343245789},"€/a"]
["Wartungskosten Ölkessel",null,null,300,"€/a",null,null,null,"R_B_WART_ÖL"]
["Stromverbrauch 1 Stück Kesselkreispumpe",null,null,{"$f":"(Master!D6*D8)","v":120},"kWh/a",null,null,null,"R_B_STROM_ÖL"]
["Stromkosten 1 Stück Kesselkreispumpe",null,null,{"$f":"(D41*D26)","v":49.194590785477359},"€/a","(Stromverbrauch x mittlerer Strompreis)"]
[]
["Betriebskosten pro Jahr gesamt:",null,null,{"$f":"SUM(D39:D40)+D42","v":15336.793934031266},"€/a"]
[null,null,null,null,null,null,null,null,null,null,null,"Negative Werte sollen gleich Null gesetzt werden"]
["3.",null,null,null,null,null,null,null,null,null,null,{"$f":"(Master!D5-D59)","v":0}]
["Betrachtung für zwei GAWP 40 SW (80 kW) sowie Spitzenlastkessel"]
[null,null,null,null,null,null,null,null,null,null,null,"Wärmepumpe soll nur die Anlagenheizlast erbringen, welche erforderlich ist"]
["3a",null,null,null,null,null,null,null,null,null,null,{"$f":"IF(Master!D5<80,Master!D5,80)","v":40}]
["Investitionskosten"]
["GAWP + Zubehör",null,null,{"$f":"IF(Master!T12=TRUE,25000, (IF(Master!T13=TRUE,45000, (IF(Master!T14=TRUE,65000,\"\")))))","v":""},"€",null,null,null,null,null,null,"Deckungsrate GAWP"]
["Förderung BAFA",null,null,{"$f":"IF(Master!$T$12=TRUE,(2400+100*30), (IF(Master!$T$13=TRUE,(2400+100*70), (IF(Master!$T$14=TRUE,(2400+100*110),\"\")))))","v":""},"€",null,null,null,null,null,null,{"$f":"(D58/D59)","v":0},"Quotient BW zu GAWP"]
[{"$f":"IF(AND(Master!D5>29,Master!D5<55),Spitzenlastkessel!C4,(IF(AND(Master!D5>54,Master!D5<65),Spitzenlastkessel!C5,(IF(AND(Master!D5>64,Master!D5<85),Spitzenlastkessel!C6,(IF(AND(Master!D5>84,Master!D5<110),Spitzenlastkessel!C7,(IF(AND(Master!D5>109,Master!D5<135),Spitzenlastkessel!C8,(IF(AND(Master!D5>134,Master!D5<150),Spitzenlastkessel!C9,(IF(AND(Master!D5>149,Master!D5<200),Spitzenlastkessel!C10,(IF(AND(Master!D5>199,Master!D5<240),Spitzenlastkessel!C11,(IF(AND(Master!D5>239,Master!D5<300),Spitzenlastkessel!C12,(IF(AND(Master!D5>299,Master!D5<370),Spitzenlastkessel!C13,(IF(AND(Master!D5>369,Master!D5<450),Spitzenlastkessel!C14,(IF(AND(Master!D5>449,Master!D5<520),Spitzenlastkessel!C15,\"Anlagenheizlast zu groß\")))))))))))))))))))))))","v":"Spitzenlastkessel GMR 3035 (35 kW)"},null,null,{"$f":"IF(AND(Master!D5>29,Master!D5<55),Spitzenlastkessel!E4,(IF(AND(Master!D5>54,Master!D5<65),Spitzenlastkessel!E5,(IF(AND(Master!D5>64,Master!D5<85),Spitzenlastkessel!E6,(IF(AND(Master!D5>84,Master!D5<110),Spitzenlastkessel!E7,(IF(AND(Master!D5>109,Master!D5<135),Spitzenlastkessel!E8,(IF(AND(Master!D5>134,Master!D5<150),Spitzenlastkessel!E9,(IF(AND(Master!D5>149,Master!D5<200),Spitzenlastkessel!E10,(IF(AND(Master!D5>199,Master!D5<240),Spitzenlastkessel!E11,(IF(AND(Master!D5>239,Master!D5<300),Spitzenlastkessel!E12,(IF(AND(Master!D5>299,Master!D5<370),Spitzenlastkessel!E13,(IF(AND(Master!D5>369,Master!D5<450),Spitzenlastkessel!E14,(IF(AND(Master!D5>449,Master!D5<520),Spitzenlastkessel!E15,\"Anlagenheizlast zu groß\")))))))))))))))))))))))","v":3600},"€","(gewählt)",null,null,null,null,null,{"$f":"(D58+D59)","v":40},"Max Leistung BW plus Leistung GAWP"]
["Investitionskosten gesamt: ",null,null,{"$f":"(D51+D53-D52)","v":{"$error":"#VALUE!"}},"€",null,null,null,"N_I_GAWP_u_BW",null,null,{"$f":"(100/L53)*D59","v":100},"Prozentuale Anlagenheizlast von GAWP"]
[null,null,null,null,null,null,null,null,null,null,null,{"$f":"MROUND(L54,5)","v":100},"Gerundet",null,null,null,"Prozentuale \nAnlagen-\nheizlast \nder GAWP"]
["3b",null,null,null,null,null,null,null,null,null,null,{"$f":"VLOOKUP(L55,Q59:R86,2)","v":100},"Deckungsrate GAWP",null,null,null,null,"Deckungs-\nrate"]
["Betriebskosten"]
["Max. Leistung Brennwertgerät",null,null,{"$f":"IF(L46<0,0,(Master!D5-D59))","v":0},"kW"]
["Leistung 2 x GAWP",null,null,{"$f":"(L49)","v":40},"kW",null,null,null,null,null,null,null,null,null,null,null,0,0]
[null,null,null,null,null,null,null,null,null,null,null,null,null,null,null,null,5,8]
["Deckungsrate Brennwertgerät",null,null,{"$f":"(100-D62)","v":0},"%","(Ergibt sich aus Leistungsverhältnis Brennwertgerät/GAWP)",null,null,null,null,null,null,null,null,null,null,10,15]
["Deckungsrate 2 x GAWP",null,null,{"$f":"VLOOKUP(L55,Q59:R86,2)","v":100},"%","(Ergibt sich aus Leistungsverhältnis Brennwertgerät/GAWP)",null,null,null,null,null,null,null,null,null,null,15,25]
[null,null,null,null,null,null,null,null,null,null,null,null,null,null,null,null,20,33]
["Jahresarbeit Gas-Brennwertgerät",null,null,{"$f":"(D37*(D61/100))","v":0},"kWh/a","(Deckungsrate berücksichtigt)"]
["Jahresarbeit 2 x GAWP",null,null,{"$f":"(D37*(D62/100))","v":80000},"kWh/a","(Deckungsrate berücksichtigt)",null,null,null,null,null,null,null,null,null,null,25,41]
[null,null,null,null,null,null,null,null,null,null,null,null,null,null,null,null,30,50]
["Vollbenutzungsstunden Gas-Brennwertgerät",null,null,{"$f":"IF(D58=0,0,(D64/D58))","v":0},"h","(ergibt sich aus Jahresarbeit/Leistung)"]
["Vollbenutzungsstunden 2 x GAWP",null,null,{"$f":"(D65/D59)","v":2000},"h","(ergibt sich aus Jahresarbeit/Leistung)",null,null,null,null,null,null,null,null,null,null,35,58]
[null,null,null,null,null,null,null,null,null,null,null,null,null,null,null,null,40,67]
["Gasverbrauch Gas-Brennwertgerät",null,null,{"$f":"(D64/D5)","v":0},"kWh/a","(ergibt sich aus Jahresarbeit/Wirkungsgrad)",null,null,"N_B_GAS_BW"]
["Gasverbrauch 2 x GAWP",null,null,{"$f":"(D65/D6)","v":51612.903225806447},"kWh/a","(ergibt sich aus Jahresarbeit/Wirkungsgrad)",null,null,"N_B_GAS_GAWP",null,null,null,null,null,null,null,45,75]
[null,null,null,null,null,null,null,null,null,null,null,null,null,null,null,null,50,80]
["Kosten Gasverbrauch Gas-Brennwertgerät",null,null,{"$f":"(D70*D18)","v":0},"€/a","(ergibt sich aus Gasverbrauch x mittlerer Gaspreis)"]
["Kosten Gasverbrauch 2 x GAWP",null,null,{"$f":"(D71*D18)","v":5818.7150391424821},"€/a","(ergibt sich aus Gasverbrauch x mittlerer Gaspreis)",null,null,null,null,null,null,null,null,null,null,55,83]
[null,null,null,null,null,null,null,null,null,null,null,null,null,null,null,null,60,87]
["Wartungskosten Gas-Brennwertgerät",null,null,300,"€/a",null,null,null,"N_B_WART_BW"]
["Wartungskosten 2 x GAWP",null,null,500,"€/a",null,null,null,"N_B_WART_GAWP",null,null,null,null,null,null,null,65,90]
[null,null,null,null,null,null,null,null,null,null,null,null,null,null,null,null,70,92]
["Stromverbrauch 2 x GAWP",null,null,{"$f":"(D68*D7)*2","v":1880},"kWh/a",null,null,null,"N_B_STROM_LÜ_GAWP",null,null,null,null,null,null,null,75,94]
["Stromkosten 2 x GAWP",null,null,{"$f":"(D79*D26)","v":770.71525563914531},"€/a","(Stromverbrauch x mittlerer Strompreis)",null,null,null,null,null,null,null,null,null,null,80,96]
["Stromverbrauch Gas-Brennwertgerät",null,null,{"$f":"(D67*D8)","v":0},"kWh/a",null,null,null,"N_B_STROM_BW"]
["Stromkosten Gas-Brennwertgerät",null,null,{"$f":"(D81*D26)","v":0},"€/a","(Stromverbrauch x mittlerer Strompreis)"]
["Stromverbrauch 4 x Umwälzpumpe GAWP",null,null,{"$f":"((D68)*D9*4)","v":400},"kWh/a",null,null,null,"N_B_STROM_PU_GAWP",null,null,null,null,null,null,null,85,97]
["Stromkosten 4 x Umwälzpumpe GAWP",null,null,{"$f":"(D83*D26)","v":163.98196928492453},"€/a","(Stromverbrauch x mittlerer Strompreis)",null,null,null,null,null,null,null,null,null,null,90,98]
[null,null,null,null,null,null,null,null,null,null,null,null,null,null,null,null,95,99]
["Betriebskosten pro Jahr gesamt:",null,null,{"$f":"SUM(D73:D77)+D84+D80+D82","v":7553.4122640665519},"€/a",null,null,null,null,null,null,null,null,null,null,null,100,100]
[]
["FAZIT:"]
["Mittlere Energieeinsparung pro Jahr bei Einsatz"]
["von zwei GAWP SW und Gas-Brennwertgerät"]
["gegenüber bestehenden Betriebskosten",null,null,{"$f":"(D44-D86)","v":7783.3816699647141},"€/a"]
[]
["Differenz Investitionskosten:",null,null,{"$f":"(D54-D33)","v":{"$error":"#VALUE!"}},"€"]
[]
["Für einen auf 20 Jahre gemittelten Engergiepreis"]
["ergibt sich eine Amortisationszeit von: ",null,null,{"$f":"IF((D93/D91)<0,\"sofort\",(D93/D91))","v":{"$error":"#VALUE!"}},{"$f":"IF((D93/D91)<0,\"\",\"Jahren\")","v":{"$error":"#VALUE!"}}]

{"sheet":"SW3 bival ÖL","index":19,"n_rows":96,"n_cols":18,"rows_kept":96,"cut":false,"hidden":false,"merged":[[54,16,57,16],[55,17,57,17]]}
["Aktueller Gaspreis",null,null,{"$f":"(Energiepreisberechnung!D28)","v":5.5E-2},"€/kWh"]
["Aktueller Ölpreis",null,null,{"$f":"(Energiepreisberechnung!D30)","v":8.5000000000000006E-2},"€/kWh"]
["Aktueller Strompreis",null,null,{"$f":"(Energiepreisberechnung!D31)","v":0.2},"€/kWh"]
["Gemittelter Wirkungsgrad Ölkessel ",null,null,0.93]
["Gemittelter Wirkungsgrad Gasbrennwertgerät",null,null,1.06]
["Gemittelter Wirkungsgrad GAWP SW",null,null,1.55]
["Elektr. Leistung GAWP SW",null,null,0.47,"kW"]
["Elektr. Leistung Kesselkreispumpe",null,null,0.1,"kW"]
["Elektr. Leistung Umwälzpumpe GAWP",null,null,0.05,"kW"]
[]
["Gesucht:","Investitions- und Betriebskosten während 20 Jahren"]
[]
["1."]
["Errechnung der mittleren Energiepreise binnen 20 Jahren"]
[]
["Gaspreis Anfangsjahr:",null,null,{"$f":"(D1)","v":5.5E-2},"€/kWh"]
["Gaspreis im 20´sten Jahr:",null,null,{"$f":"(Energiepreisberechnung!C22)","v":0.19890901442685968},"€/kWh"]
["Mittlerer Gaspreis während 20 Jahren:",null,null,{"$f":"(Energiepreisberechnung!C24)","v":0.11273760388338561},"€/kWh"]
[]
["Ölpreis Anfangsjahr:",null,null,{"$f":"(D2)","v":8.5000000000000006E-2},"€/kWh"]
["Ölpreis im 20´sten Jahr:",null,null,{"$f":"(Energiepreisberechnung!F22)","v":0.30740484047787403},"€/kWh"]
["Mittlerer Ölpreis während 20 Jahren:",null,null,{"$f":"(Energiepreisberechnung!F24)","v":0.17423084236523231},"€/kWh"]
[]
["Strompreis Anfangsjahr:",null,null,{"$f":"(D3)","v":0.2},"€/kWh"]
["Strompreis im 20´sten Jahr:",null,null,{"$f":"(Energiepreisberechnung!E22)","v":0.72330550700676266},"€/kWh"]
["Mittlerer Strompreis während 20 Jahren:",null,null,{"$f":"(Energiepreisberechnung!E24)","v":0.40995492321231131},"€/kWh"]
[]
["2."]
["Betrachtung ohne Investition (bestehende Kessel bleiben)"]
[]
["2a"]
["Investitionskosten"]
["Investitionskosten gesamt: ",null,null,0,"€",null,null,null,"R_I_ÖL"]
[]
["2b"]
["Betriebskosten Öl"]
["Jahresarbeit Ölkessel",null,null,{"$f":"(Master!D5*Master!D6)","v":80000},"kWh/a","(Leistung x Jahresvollbenutzungsstunden)"]
["Energieverbrauch Ölkessel",null,null,{"$f":"(D37/D4)","v":86021.505376344081},"kWh/a","(Wirkungsgrad berücksichtigt)",null,null,"R_B_ÖL"]
["Kosten Öl ",null,null,{"$f":"(D38*D22)","v":14987.599343245789},"€/a"]
["Wartungskosten Ölkessel",null,null,300,"€/a",null,null,null,"R_B_WART_ÖL"]
["Stromverbrauch 1 Stück Kesselkreispumpe",null,null,{"$f":"(Master!D6*D8)","v":200},"kWh/a",null,null,null,"R_B_STROM_ÖL"]
["Stromkosten 1 Stück Kesselkreispumpe",null,null,{"$f":"(D41*D26)","v":81.990984642462266},"€/a","(Stromverbrauch x mittlerer Strompreis)"]
[]
["Betriebskosten pro Jahr gesamt:",null,null,{"$f":"SUM(D39:D40)+D42","v":15369.590327888251},"€/a"]
[null,null,null,null,null,null,null,null,null,null,null,"Negative Werte sollen gleich Null gesetzt werden"]
["3.",null,null,null,null,null,null,null,null,null,null,{"$f":"(Master!D5-D59)","v":0}]
["Betrachtung für drei GAWP 40 SW (120 kW) sowie Spitzenlastkessel"]
[null,null,null,null,null,null,null,null,null,null,null,"Wärmepumpe soll nur die Anlagenheizlast erbringen, welche erforderlich ist"]
["3a",null,null,null,null,null,null,null,null,null,null,{"$f":"IF(Master!D5<120,Master!D5,120)","v":40}]
["Investitionskosten"]
["GAWP + Zubehör",null,null,{"$f":"IF(Master!T12=TRUE,25000, (IF(Master!T13=TRUE,45000, (IF(Master!T14=TRUE,65000,\"\")))))","v":""},"€",null,null,null,null,null,null,"Deckungsrate GAWP"]
["Förderung BAFA",null,null,{"$f":"IF(Master!$T$12=TRUE,(2400+100*30), (IF(Master!$T$13=TRUE,(2400+100*70), (IF(Master!$T$14=TRUE,(2400+100*110),\"\")))))","v":""},"€"]
[{"$f":"IF(AND(Master!D5>29,Master!D5<55),Spitzenlastkessel!C4,(IF(AND(Master!D5>54,Master!D5<65),Spitzenlastkessel!C5,(IF(AND(Master!D5>64,Master!D5<85),Spitzenlastkessel!C6,(IF(AND(Master!D5>84,Master!D5<110),Spitzenlastkessel!C7,(IF(AND(Master!D5>109,Master!D5<135),Spitzenlastkessel!C8,(IF(AND(Master!D5>134,Master!D5<150),Spitzenlastkessel!C9,(IF(AND(Master!D5>149,Master!D5<200),Spitzenlastkessel!C10,(IF(AND(Master!D5>199,Master!D5<240),Spitzenlastkessel!C11,(IF(AND(Master!D5>239,Master!D5<300),Spitzenlastkessel!C12,(IF(AND(Master!D5>299,Master!D5<370),Spitzenlastkessel!C13,(IF(AND(Master!D5>369,Master!D5<450),Spitzenlastkessel!C14,(IF(AND(Master!D5>449,Master!D5<520),Spitzenlastkessel!C15,\"Anlagenheizlast zu groß\")))))))))))))))))))))))","v":"Spitzenlastkessel GMR 3035 (35 kW)"},null,null,{"$f":"IF(AND(Master!D5>29,Master!D5<55),Spitzenlastkessel!E4,(IF(AND(Master!D5>54,Master!D5<65),Spitzenlastkessel!E5,(IF(AND(Master!D5>64,Master!D5<85),Spitzenlastkessel!E6,(IF(AND(Master!D5>84,Master!D5<110),Spitzenlastkessel!E7,(IF(AND(Master!D5>109,Master!D5<135),Spitzenlastkessel!E8,(IF(AND(Master!D5>134,Master!D5<150),Spitzenlastkessel!E9,(IF(AND(Master!D5>149,Master!D5<200),Spitzenlastkessel!E10,(IF(AND(Master!D5>199,Master!D5<240),Spitzenlastkessel!E11,(IF(AND(Master!D5>239,Master!D5<300),Spitzenlastkessel!E12,(IF(AND(Master!D5>299,Master!D5<370),Spitzenlastkessel!E13,(IF(AND(Master!D5>369,Master!D5<450),Spitzenlastkessel!E14,(IF(AND(Master!D5>449,Master!D5<520),Spitzenlastkessel!E15,\"Anlagenheizlast zu groß\")))))))))))))))))))))))","v":3600},"€","(gewählt)",null,null,null,null,null,{"$f":"(D58+D59)","v":40},"Max Leistung BW plus Leistung GAWP"]
["Investitionskosten gesamt: ",null,null,{"$f":"(D51+D53-D52)","v":{"$error":"#VALUE!"}},"€",null,null,null,"N_I_GAWP_u_BW",null,null,{"$f":"(100/L53)*D59","v":100},"Prozentuale Anlagenheizlast von GAWP"]
[null,null,null,null,null,null,null,null,null,null,null,{"$f":"MROUND(L54,5)","v":100},"Gerundet",null,null,null,"Prozentuale \nAnlagen-\nheizlast \nder GAWP"]
["3b",null,null,null,null,null,null,null,null,null,null,{"$f":"VLOOKUP(L55,Q59:R86,2)","v":100},"Deckungsrate GAWP",null,null,null,null,"Deckungs-\nrate"]
["Betriebskosten"]
["Max. Leistung Brennwertgerät",null,null,{"$f":"IF(L46<0,0,(Master!D5-D59))","v":0},"kW"]
["Leistung 3 x GAWP",null,null,{"$f":"(L49)","v":40},"kW",null,null,null,null,null,null,null,null,null,null,null,0,0]
[null,null,null,null,null,null,null,null,null,null,null,null,null,null,null,null,5,8]
["Deckungsrate Brennwertgerät",null,null,{"$f":"(100-D62)","v":0},"%","(Ergibt sich aus Leistungsverhältnis Brennwertgerät/GAWP)",null,null,null,null,null,null,null,null,null,null,10,15]
["Deckungsrate 3 x GAWP",null,null,{"$f":"VLOOKUP(L55,Q59:R86,2)","v":100},"%","(Ergibt sich aus Leistungsverhältnis Brennwertgerät/GAWP)",null,null,null,null,null,null,null,null,null,null,15,25]
[null,null,null,null,null,null,null,null,null,null,null,null,null,null,null,null,20,33]
["Jahresarbeit Gas-Brennwertgerät",null,null,{"$f":"(D37*(D61/100))","v":0},"kWh/a","(Deckungsrate berücksichtigt)"]
["Jahresarbeit 3 x GAWP",null,null,{"$f":"(D37*(D62/100))","v":80000},"kWh/a","(Deckungsrate berücksichtigt)",null,null,null,null,null,null,null,null,null,null,25,41]
[null,null,null,null,null,null,null,null,null,null,null,null,null,null,null,null,30,50]
["Vollbenutzungsstunden Gas-Brennwertgerät",null,null,{"$f":"IF(D58=0,0,(D64/D58))","v":0},"h","(ergibt sich aus Jahresarbeit/Leistung)"]
["Vollbenutzungsstunden 3 x GAWP",null,null,{"$f":"(D65/D59)","v":2000},"h","(ergibt sich aus Jahresarbeit/Leistung)",null,null,null,null,null,null,null,null,null,null,35,58]
[null,null,null,null,null,null,null,null,null,null,null,null,null,null,null,null,40,67]
["Gasverbrauch Gas-Brennwertgerät",null,null,{"$f":"(D64/D5)","v":0},"kWh/a","(ergibt sich aus Jahresarbeit/Wirkungsgrad)",null,null,"N_B_GAS_BW"]
["Gasverbrauch 3 x GAWP",null,null,{"$f":"(D65/D6)","v":51612.903225806447},"kWh/a","(ergibt sich aus Jahresarbeit/Wirkungsgrad)",null,null,"N_B_GAS_GAWP",null,null,null,null,null,null,null,45,75]
[null,null,null,null,null,null,null,null,null,null,null,null,null,null,null,null,50,80]
["Kosten Gasverbrauch Gas-Brennwertgerät",null,null,{"$f":"(D70*D18)","v":0},"€/a","(ergibt sich aus Gasverbrauch x mittlerer Gaspreis)"]
["Kosten Gasverbrauch 3 x GAWP",null,null,{"$f":"(D71*D18)","v":5818.7150391424821},"€/a","(ergibt sich aus Gasverbrauch x mittlerer Gaspreis)",null,null,null,null,null,null,null,null,null,null,55,83]
[null,null,null,null,null,null,null,null,null,null,null,null,null,null,null,null,60,87]
["Wartungskosten Gas-Brennwertgerät",null,null,300,"€/a",null,null,null,"N_B_WART_BW"]
["Wartungskosten 3 x GAWP",null,null,700,"€/a",null,null,null,"N_B_WART_GAWP",null,null,null,null,null,null,null,65,90]
[null,null,null,null,null,null,null,null,null,null,null,null,null,null,null,null,70,92]
["Stromverbrauch 3 x GAWP",null,null,{"$f":"(D68*D7)*3","v":2820},"kWh/a",null,null,null,"N_B_STROM_LÜ_GAWP",null,null,null,null,null,null,null,75,94]
["Stromkosten 3x GAWP",null,null,{"$f":"(D79*D26)","v":1156.0728834587178},"€/a","(Stromverbrauch x mittlerer Strompreis)",null,null,null,null,null,null,null,null,null,null,80,96]
["Stromverbrauch Gas-Brennwertgerät",null,null,{"$f":"(D67*D8)","v":0},"kWh/a",null,null,null,"N_B_STROM_BW"]
["Stromkosten Gas-Brennwertgerät",null,null,{"$f":"(D81*D26)","v":0},"€/a","(Stromverbrauch x mittlerer Strompreis)"]
["Stromverbrauch 6 x Umwälzpumpe GAWP",null,null,{"$f":"((D68)*D9*6)","v":600},"kWh/a",null,null,null,"N_B_STROM_PU_GAWP",null,null,null,null,null,null,null,85,97]
["Stromkosten 6 x Umwälzpumpe GAWP",null,null,{"$f":"(D83*D26)","v":245.97295392738678},"€/a","(Stromverbrauch x mittlerer Strompreis)",null,null,null,null,null,null,null,null,null,null,90,98]
[null,null,null,null,null,null,null,null,null,null,null,null,null,null,null,null,95,99]
["Betriebskosten pro Jahr gesamt:",null,null,{"$f":"SUM(D73:D77)+D84+D80+D82","v":8220.7608765285859},"€/a",null,null,null,null,null,null,null,null,null,null,null,100,100]
[]
["FAZIT:"]
["Mittlere Energieeinsparung pro Jahr bei Einsatz"]
["von drei GAWP SW und Gas-Brennwertgerät"]
["gegenüber bestehenden Betriebskosten",null,null,{"$f":"(D44-D86)","v":7148.8294513596647},"€/a"]
[]
["Differenz Investitionskosten:",null,null,{"$f":"(D54-D33)","v":{"$error":"#VALUE!"}},"€"]
[]
["Für einen auf 20 Jahre gemittelten Engergiepreis"]
["ergibt sich eine Amortisationszeit von: ",null,null,{"$f":"IF((D93/D91)<0,\"sofort\",(D93/D91))","v":{"$error":"#VALUE!"}},{"$f":"IF((D93/D91)<0,\"\",\"Jahren\")","v":{"$error":"#VALUE!"}}]

{"sheet":"SW bival PL","index":20,"n_rows":95,"n_cols":18,"rows_kept":95,"cut":false,"hidden":false,"merged":[[53,16,56,16],[54,17,56,17]]}
["Aktueller Gaspreis",null,null,{"$f":"(Energiepreisberechnung!D28)","v":5.5E-2},"€/kWh"]
["Aktueller Pelletpreis",null,null,{"$f":"(Energiepreisberechnung!D32)","v":0.05},"€/kWh"]
["Aktueller Strompreis",null,null,{"$f":"(Energiepreisberechnung!D31)","v":0.2},"€/kWh"]
["Gemittelter Wirkungsgrad Gasbrennwertgerät",null,null,1.06]
["Gemittelter Wirkungsgrad Pelletkessel",null,null,0.93]
["Gemittelter Wirkungsgrad GAWP SW",null,null,1.55]
["Elektr. Leistung GAWP SW",null,null,0.47,"kW"]
["Elektr. Leistung Kesselkreispumpe",null,null,0.05,"kW"]
[]
["Gesucht:","Investitions- und Betriebskosten während 20 Jahren"]
[]
["1."]
["Errechnung der mittleren Energiepreise binnen 20 Jahren"]
[]
["Gaspreis Anfangsjahr:",null,null,{"$f":"(D1)","v":5.5E-2},"€/kWh"]
["Gaspreis im 20´sten Jahr:",null,null,{"$f":"(Energiepreisberechnung!C22)","v":0.19890901442685968},"€/kWh"]
["Mittlerer Gaspreis während 20 Jahren:",null,null,{"$f":"(Energiepreisberechnung!C24)","v":0.11273760388338561},"€/kWh"]
[]
["Pelletpreis Anfangsjahr:",null,null,{"$f":"(D2)","v":0.05},"€/kWh"]
["Pelletpreis im 20´sten Jahr:",null,null,{"$f":"(Energiepreisberechnung!G22)","v":0.18082637675169067},"€/kWh"]
["Mittlerer Pelletpreis während 20 Jahren:",null,null,{"$f":"(Energiepreisberechnung!G24)","v":0.10248873080307783},"€/kWh"]
[]
["Strompreis Anfangsjahr:",null,null,{"$f":"(D3)","v":0.2},"€/kWh"]
["Strompreis im 20´sten Jahr:",null,null,{"$f":"(Energiepreisberechnung!E22)","v":0.72330550700676266},"€/kWh"]
["Mittlerer Strompreis während 20 Jahren:",null,null,{"$f":"(Energiepreisberechnung!E24)","v":0.40995492321231131},"€/kWh"]
[]
["2."]
["Betrachtung für einen neuen Pelletkessel + Silo",null,null,{"$f":"(Master!D5)","v":40},"kW"]
[]
["2a"]
["Investitionskosten",null,null,{"$f":"(Master!D8)","v":5000},"€"]
["Investitionskosten gesamt: ",null,null,{"$f":"(D31)","v":5000},"€",null,null,null,"R_I_PL"]
[]
["2b"]
["Betriebskosten Pelletkessel"]
["Jahresarbeit Pelletkessel",null,null,{"$f":"(Master!D5*Master!D6)","v":80000},"kWh/a","(Leistung x Jahresvollbenutzungsstunden)"]
["Energieverbrauch Pelletkessel",null,null,{"$f":"(D36/D5)","v":86021.505376344081},"kWh/a","(Wirkungsgrad berücksichtigt)",null,null,"R_B_PL"]
["Kosten Pellets",null,null,{"$f":"(D37*D21)","v":8816.2349077916406},"€/a"]
["Wartungskosten Pelletkessel",null,null,500,"€/a",null,null,null,"R_B_WART_PL"]
["Stromverbrauch 1 Stück Kesselkreispumpe",null,null,{"$f":"(Master!D6*D8)","v":100},"kWh/a",null,null,null,"R_B_STROM_PL"]
["Stromkosten 1 Stück Kesselkreispumpe",null,null,{"$f":"(D40*D25)","v":40.995492321231133},"€/a","(Stromverbrauch x mittlerer Strompreis)"]
[]
["Betriebskosten pro Jahr gesamt:",null,null,{"$f":"SUM(D38:D39)+D41","v":9357.2304001128723},"€/a"]
[null,null,null,null,null,null,null,null,null,null,null,"Negative Werte sollen gleich Null gesetzt werden"]
["3.",null,null,null,null,null,null,null,null,null,null,{"$f":"(Master!D5-D58)","v":0}]
["Betrachtung für eine GAWP 40 SW (40 kW) sowie Spitzenlastkessel"]
[null,null,null,null,null,null,null,null,null,null,null,"Wärmepumpe soll nur die Anlagenheizlast erbringen, welche erforderlich ist"]
["3a",null,null,null,null,null,null,null,null,null,null,{"$f":"IF(Master!D5<40,Master!D5,40)","v":40}]
["Investitionskosten"]
["GAWP + Zubehör",null,null,{"$f":"IF(Master!T12=TRUE,25000, (IF(Master!T13=TRUE,45000, (IF(Master!T14=TRUE,65000,\"\")))))","v":""},"€",null,null,null,null,null,null,"Deckungsrate GAWP"]
["Förderung BAFA",null,null,{"$f":"IF(Master!$T$12=TRUE,(2400+100*30), (IF(Master!$T$13=TRUE,(2400+100*70), (IF(Master!$T$14=TRUE,(2400+100*110),\"\")))))","v":""},"€",null,null,null,null,null,null,{"$f":"(D57+D58)","v":40},"Max Leistung BW plus Leistung GAWP"]
[{"$f":"IF(AND(Master!D5>29,Master!D5<55),Spitzenlastkessel!C4,(IF(AND(Master!D5>54,Master!D5<65),Spitzenlastkessel!C5,(IF(AND(Master!D5>64,Master!D5<85),Spitzenlastkessel!C6,(IF(AND(Master!D5>84,Master!D5<110),Spitzenlastkessel!C7,(IF(AND(Master!D5>109,Master!D5<135),Spitzenlastkessel!C8,(IF(AND(Master!D5>134,Master!D5<150),Spitzenlastkessel!C9,(IF(AND(Master!D5>149,Master!D5<200),Spitzenlastkessel!C10,(IF(AND(Master!D5>199,Master!D5<240),Spitzenlastkessel!C11,(IF(AND(Master!D5>239,Master!D5<300),Spitzenlastkessel!C12,(IF(AND(Master!D5>299,Master!D5<370),Spitzenlastkessel!C13,(IF(AND(Master!D5>369,Master!D5<450),Spitzenlastkessel!C14,(IF(AND(Master!D5>449,Master!D5<520),Spitzenlastkessel!C15,\"Anlagenheizlast zu groß\")))))))))))))))))))))))","v":"Spitzenlastkessel GMR 3035 (35 kW)"},null,null,{"$f":"IF(AND(Master!D5>29,Master!D5<55),Spitzenlastkessel!E4,(IF(AND(Master!D5>54,Master!D5<65),Spitzenlastkessel!E5,(IF(AND(Master!D5>64,Master!D5<85),Spitzenlastkessel!E6,(IF(AND(Master!D5>84,Master!D5<110),Spitzenlastkessel!E7,(IF(AND(Master!D5>109,Master!D5<135),Spitzenlastkessel!E8,(IF(AND(Master!D5>134,Master!D5<150),Spitzenlastkessel!E9,(IF(AND(Master!D5>149,Master!D5<200),Spitzenlastkessel!E10,(IF(AND(Master!D5>199,Master!D5<240),Spitzenlastkessel!E11,(IF(AND(Master!D5>239,Master!D5<300),Spitzenlastkessel!E12,(IF(AND(Master!D5>299,Master!D5<370),Spitzenlastkessel!E13,(IF(AND(Master!D5>369,Master!D5<450),Spitzenlastkessel!E14,(IF(AND(Master!D5>449,Master!D5<520),Spitzenlastkessel!E15,\"Anlagenheizlast zu groß\")))))))))))))))))))))))","v":3600},"€","(gewählt)",null,null,null,null,null,{"$f":"(100/L51)*D58","v":100},"Prozentuale Anlagenheizlast von GAWP"]
["Investitionskosten gesamt: ",null,null,{"$f":"(D50+D52-D51)","v":{"$error":"#VALUE!"}},"€",null,null,null,"N_I_GAWP_u_BW",null,null,{"$f":"MROUND(L52,5)","v":100},"Gerundet"]
[null,null,null,null,null,null,null,null,null,null,null,null,null,null,null,null,"Prozentuale \nAnlagen-\nheizlast \nder GAWP"]
["3b",null,null,null,null,null,null,null,null,null,null,{"$f":"VLOOKUP(L53,Q58:R85,2)","v":100},"Deckungsrate GAWP",null,null,null,null,"Deckungs-\nrate"]
["Betriebskosten"]
["Max. Leistung Brennwertgerät",null,null,{"$f":"IF(L45<0,0,(Master!D5-D58))","v":0},"kW"]
["Leistung GAWP",null,null,{"$f":"(L48)","v":40},"kW",null,null,null,null,null,null,null,null,null,null,null,0,0]
[null,null,null,null,null,null,null,null,null,null,null,null,null,null,null,null,5,8]
["Deckungsrate Brennwertgerät",null,null,{"$f":"(100-D61)","v":0},"%","(Ergibt sich aus Leistungsverhältnis Brennwertgerät/GAWP)",null,null,null,null,null,null,null,null,null,null,10,15]
["Deckungsrate GAWP",null,null,{"$f":"VLOOKUP(L53,Q58:R85,2)","v":100},"%","(Ergibt sich aus Leistungsverhältnis Brennwertgerät/GAWP)",null,null,null,null,null,null,null,null,null,null,15,25]
[null,null,null,null,null,null,null,null,null,null,null,null,null,null,null,null,20,33]
["Jahresarbeit Gas-Brennwertgerät",null,null,{"$f":"(D36*(D60/100))","v":0},"kWh/a","(Deckungsrate berücksichtigt)"]
["Jahresarbeit GAWP",null,null,{"$f":"(D36*(D61/100))","v":80000},"kWh/a","(Deckungsrate berücksichtigt)",null,null,null,null,null,null,null,null,null,null,25,41]
[null,null,null,null,null,null,null,null,null,null,null,null,null,null,null,null,30,50]
["Vollbenutzungsstunden Gas-Brennwertgerät",null,null,{"$f":"IF(D57=0,0,(D63/D57))","v":0},"h","(ergibt sich aus Jahresarbeit/Leistung)"]
["Vollbenutzungsstunden GAWP",null,null,{"$f":"(D64/D58)","v":2000},"h","(ergibt sich aus Jahresarbeit/Leistung)",null,null,null,null,null,null,null,null,null,null,35,58]
[null,null,null,null,null,null,null,null,null,null,null,null,null,null,null,null,40,67]
["Gasverbrauch Gas-Brennwertgerät",null,null,{"$f":"(D63/D4)","v":0},"kWh/a","(ergibt sich aus Jahresarbeit/Wirkungsgrad)",null,null,"N_B_GAS_BW"]
["Gasverbrauch GAWP",null,null,{"$f":"(D64/D6)","v":51612.903225806447},"kWh/a","(ergibt sich aus Jahresarbeit/Wirkungsgrad)",null,null,"N_B_GAS_GAWP",null,null,null,null,null,null,null,45,75]
[null,null,null,null,null,null,null,null,null,null,null,null,null,null,null,null,50,80]
["Kosten Gasverbrauch Gas-Brennwertgerät",null,null,{"$f":"(D69*D17)","v":0},"€/a","(ergibt sich aus Gasverbrauch x mittlerer Gaspreis)"]
["Kosten Gasverbrauch GAWP",null,null,{"$f":"(D70*D17)","v":5818.7150391424821},"€/a","(ergibt sich aus Gasverbrauch x mittlerer Gaspreis)",null,null,null,null,null,null,null,null,null,null,55,83]
[null,null,null,null,null,null,null,null,null,null,null,null,null,null,null,null,60,87]
["Wartungskosten Gas-Brennwertgerät",null,null,300,"€/a",null,null,null,"N_B_WART_BW"]
["Wartungskosten GAWP",null,null,300,"€/a",null,null,null,"N_B_WART_GAWP",null,null,null,null,null,null,null,65,90]
[null,null,null,null,null,null,null,null,null,null,null,null,null,null,null,null,70,92]
["Stromverbrauch GAWP",null,null,{"$f":"(D67*D7)","v":940},"kWh/a",null,null,null,"N_B_STROM_LÜ_GAWP",null,null,null,null,null,null,null,75,94]
["Stromkosten GAWP",null,null,{"$f":"(D78*D25)","v":385.35762781957266},"€/a","(Stromverbrauch x mittlerer Strompreis)",null,null,null,null,null,null,null,null,null,null,80,96]
["Stromverbrauch Gas-Brennwertgerät",null,null,{"$f":"(D66*D8)","v":0},"kWh/a",null,null,null,"N_B_STROM_BW"]
["Stromkosten Gas-Brennwertgerät",null,null,{"$f":"(D80*D25)","v":0},"€/a","(Stromverbrauch x mittlerer Strompreis)"]
["Stromverbrauch 2 x Umwälzpumpe GAWP",null,null,{"$f":"((D67)*D8*2)","v":200},"kWh/a",null,null,null,"N_B_STROM_PU_GAWP",null,null,null,null,null,null,null,85,97]
["Stromkosten 2 x Umwälzpumpe GAWP",null,null,{"$f":"(D82*D25)","v":81.990984642462266},"€/a","(Stromverbrauch x mittlerer Strompreis)",null,null,null,null,null,null,null,null,null,null,90,98]
[null,null,null,null,null,null,null,null,null,null,null,null,null,null,null,null,95,99]
["Betriebskosten pro Jahr gesamt:",null,null,{"$f":"SUM(D72:D76)+D83+D79+D81","v":6886.063651604517},"€/a",null,null,null,null,null,null,null,null,null,null,null,100,100]
[]
["FAZIT:"]
["Mittlere Energieeinsparung pro Jahr bei Einsatz"]
["von einer GAWP SW und Gas-Brennwertgerät"]
["gegenüber den Betriebskosten eines Pelletkessels:",null,null,{"$f":"(D43-D85)","v":2471.1667485083553},"€/a"]
[]
["Differenz Investitionskosten:",null,null,{"$f":"(D53-D32)","v":{"$error":"#VALUE!"}},"€"]
[]
["Für einen auf 20 Jahre gemittelten Engergiepreis"]
["ergibt sich eine Amortisationszeit von: ",null,null,{"$f":"IF((D92/D90)<0,\"sofort\",(D92/D90))","v":{"$error":"#VALUE!"}},{"$f":"IF((D92/D90)<0,\"\",\"Jahren\")","v":{"$error":"#VALUE!"}}]

{"sheet":"SW2 bival PL","index":21,"n_rows":96,"n_cols":18,"rows_kept":96,"cut":false,"hidden":false,"merged":[[54,16,57,16],[55,17,57,17]]}
["Aktueller Gaspreis",null,null,{"$f":"(Energiepreisberechnung!D28)","v":5.5E-2},"€/kWh"]
["Aktueller Pelletpreis",null,null,{"$f":"(Energiepreisberechnung!D32)","v":0.05},"€/kWh"]
["Aktueller Strompreis",null,null,{"$f":"(Energiepreisberechnung!D31)","v":0.2},"€/kWh"]
["Gemittelter Wirkungsgrad Gasbrennwertgerät",null,null,1.06]
["Gemittelter Wirkungsgrad Pelletkessel",null,null,0.93]
["Gemittelter Wirkungsgrad GAWP SW",null,null,1.55]
["Elektr. Leistung GAWP SW",null,null,0.47,"kW"]
["Elektr. Leistung Kesselkreispumpe",null,null,0.06,"kW"]
["Elektr. Leistung Umwälzpumpe GAWP",null,null,0.05,"kW"]
[]
["Gesucht:","Investitions- und Betriebskosten während 20 Jahren"]
[]
["1."]
["Errechnung der mittleren Energiepreise binnen 20 Jahren"]
[]
["Gaspreis Anfangsjahr:",null,null,{"$f":"(D1)","v":5.5E-2},"€/kWh"]
["Gaspreis im 20´sten Jahr:",null,null,{"$f":"(Energiepreisberechnung!C22)","v":0.19890901442685968},"€/kWh"]
["Mittlerer Gaspreis während 20 Jahren:",null,null,{"$f":"(Energiepreisberechnung!C24)","v":0.11273760388338561},"€/kWh"]
[]
["Pelletpreis Anfangsjahr:",null,null,{"$f":"(D2)","v":0.05},"€/kWh"]
["Pelletpreis im 20´sten Jahr:",null,null,{"$f":"(Energiepreisberechnung!G22)","v":0.18082637675169067},"€/kWh"]
["Mittlerer Pelletpreis während 20 Jahren:",null,null,{"$f":"(Energiepreisberechnung!G24)","v":0.10248873080307783},"€/kWh"]
[]
["Strompreis Anfangsjahr:",null,null,{"$f":"(D3)","v":0.2},"€/kWh"]
["Strompreis im 20´sten Jahr:",null,null,{"$f":"(Energiepreisberechnung!E22)","v":0.72330550700676266},"€/kWh"]
["Mittlerer Strompreis während 20 Jahren:",null,null,{"$f":"(Energiepreisberechnung!E24)","v":0.40995492321231131},"€/kWh"]
[]
["2."]
["Betrachtung für einen neuen Pelletkessel + Silo",null,null,{"$f":"(Master!D5)","v":40},"kW"]
[]
["2a"]
["Investitionskosten",null,null,{"$f":"(Master!D8)","v":5000},"€"]
["Investitionskosten gesamt: ",null,null,{"$f":"(D32)","v":5000},"€",null,null,null,"R_I_PL"]
[]
["2b"]
["Betriebskosten Pelletkessel"]
["Jahresarbeit Pelletkessel",null,null,{"$f":"(Master!D5*Master!D6)","v":80000},"kWh/a","(Leistung x Jahresvollbenutzungsstunden)"]
["Energieverbrauch Pelletkessel",null,null,{"$f":"(D37/D5)","v":86021.505376344081},"kWh/a","(Wirkungsgrad berücksichtigt)",null,null,"R_B_PL"]
["Kosten Pellets",null,null,{"$f":"(D38*D22)","v":8816.2349077916406},"€/a"]
["Wartungskosten Pelletkessel",null,null,500,"€/a",null,null,null,"R_B_WART_PL"]
["Stromverbrauch 1 Stück Kesselkreispumpe",null,null,{"$f":"(Master!D6*D8)","v":120},"kWh/a",null,null,null,"R_B_STROM_PL"]
["Stromkosten 1 Stück Kesselkreispumpe",null,null,{"$f":"(D41*D26)","v":49.194590785477359},"€/a","(Stromverbrauch x mittlerer Strompreis)"]
[]
["Betriebskosten pro Jahr gesamt:",null,null,{"$f":"SUM(D39:D40)+D42","v":9365.4294985771176},"€/a"]
[null,null,null,null,null,null,null,null,null,null,null,"Negative Werte sollen gleich Null gesetzt werden"]
["3.",null,null,null,null,null,null,null,null,null,null,{"$f":"(Master!D5-D59)","v":0}]
["Betrachtung für zwei GAWP 40 SW (80 kW) sowie Spitzenlastkessel"]
[null,null,null,null,null,null,null,null,null,null,null,"Wärmepumpe soll nur die Anlagenheizlast erbringen, welche erforderlich ist"]
["3a",null,null,null,null,null,null,null,null,null,null,{"$f":"IF(Master!D5<80,Master!D5,80)","v":40}]
["Investitionskosten"]
["2 x GAWP + Zubehör",null,null,{"$f":"IF(Master!T12=TRUE,25000, (IF(Master!T13=TRUE,45000, (IF(Master!T14=TRUE,65000,\"\")))))","v":""},"€",null,null,null,null,null,null,"Deckungsrate GAWP"]
["Förderung BAFA",null,null,{"$f":"IF(Master!$T$12=TRUE,(2400+100*30), (IF(Master!$T$13=TRUE,(2400+100*70), (IF(Master!$T$14=TRUE,(2400+100*110),\"\")))))","v":""},"€",null,null,null,null,null,null,{"$f":"(D58+D59)","v":40},"Max Leistung BW plus Leistung GAWP"]
[{"$f":"IF(AND(Master!D5>29,Master!D5<55),Spitzenlastkessel!C4,(IF(AND(Master!D5>54,Master!D5<65),Spitzenlastkessel!C5,(IF(AND(Master!D5>64,Master!D5<85),Spitzenlastkessel!C6,(IF(AND(Master!D5>84,Master!D5<110),Spitzenlastkessel!C7,(IF(AND(Master!D5>109,Master!D5<135),Spitzenlastkessel!C8,(IF(AND(Master!D5>134,Master!D5<150),Spitzenlastkessel!C9,(IF(AND(Master!D5>149,Master!D5<200),Spitzenlastkessel!C10,(IF(AND(Master!D5>199,Master!D5<240),Spitzenlastkessel!C11,(IF(AND(Master!D5>239,Master!D5<300),Spitzenlastkessel!C12,(IF(AND(Master!D5>299,Master!D5<370),Spitzenlastkessel!C13,(IF(AND(Master!D5>369,Master!D5<450),Spitzenlastkessel!C14,(IF(AND(Master!D5>449,Master!D5<520),Spitzenlastkessel!C15,\"Anlagenheizlast zu groß\")))))))))))))))))))))))","v":"Spitzenlastkessel GMR 3035 (35 kW)"},null,null,{"$f":"IF(AND(Master!D5>29,Master!D5<55),Spitzenlastkessel!E4,(IF(AND(Master!D5>54,Master!D5<65),Spitzenlastkessel!E5,(IF(AND(Master!D5>64,Master!D5<85),Spitzenlastkessel!E6,(IF(AND(Master!D5>84,Master!D5<110),Spitzenlastkessel!E7,(IF(AND(Master!D5>109,Master!D5<135),Spitzenlastkessel!E8,(IF(AND(Master!D5>134,Master!D5<150),Spitzenlastkessel!E9,(IF(AND(Master!D5>149,Master!D5<200),Spitzenlastkessel!E10,(IF(AND(Master!D5>199,Master!D5<240),Spitzenlastkessel!E11,(IF(AND(Master!D5>239,Master!D5<300),Spitzenlastkessel!E12,(IF(AND(Master!D5>299,Master!D5<370),Spitzenlastkessel!E13,(IF(AND(Master!D5>369,Master!D5<450),Spitzenlastkessel!E14,(IF(AND(Master!D5>449,Master!D5<520),Spitzenlastkessel!E15,\"Anlagenheizlast zu groß\")))))))))))))))))))))))","v":3600},"€","(gewählt)",null,null,null,null,null,{"$f":"(100/L52)*D59","v":100},"Prozentuale Anlagenheizlast von GAWP"]
["Investitionskosten gesamt: ",null,null,{"$f":"(D51+D53-D52)","v":{"$error":"#VALUE!"}},"€",null,null,null,"N_I_GAWP_u_BW",null,null,{"$f":"MROUND(L53,5)","v":100},"Gerundet"]
[null,null,null,null,null,null,null,null,null,null,null,null,null,null,null,null,"Prozentuale \nAnlagen-\nheizlast \nder GAWP"]
["3b",null,null,null,null,null,null,null,null,null,null,{"$f":"VLOOKUP(L54,Q59:R86,2)","v":100},"Deckungsrate GAWP",null,null,null,null,"Deckungs-\nrate"]
["Betriebskosten"]
["Max. Leistung Brennwertgerät",null,null,{"$f":"IF(L46<0,0,(Master!D5-D59))","v":0},"kW"]
["Leistung 2 x GAWP",null,null,{"$f":"(L49)","v":40},"kW",null,null,null,null,null,null,null,null,null,null,null,0,0]
[null,null,null,null,null,null,null,null,null,null,null,null,null,null,null,null,5,8]
["Deckungsrate Brennwertgerät",null,null,{"$f":"(100-D62)","v":0},"%","(Ergibt sich aus Leistungsverhältnis Brennwertgerät/GAWP)",null,null,null,null,null,null,null,null,null,null,10,15]
["Deckungsrate 2 x GAWP",null,null,{"$f":"VLOOKUP(L54,Q59:R86,2)","v":100},"%","(Ergibt sich aus Leistungsverhältnis Brennwertgerät/GAWP)",null,null,null,null,null,null,null,null,null,null,15,25]
[null,null,null,null,null,null,null,null,null,null,null,null,null,null,null,null,20,33]
["Jahresarbeit Gas-Brennwertgerät",null,null,{"$f":"(D37*(D61/100))","v":0},"kWh/a","(Deckungsrate berücksichtigt)"]
["Jahresarbeit 2 x GAWP",null,null,{"$f":"(D37*(D62/100))","v":80000},"kWh/a","(Deckungsrate berücksichtigt)",null,null,null,null,null,null,null,null,null,null,25,41]
[null,null,null,null,null,null,null,null,null,null,null,null,null,null,null,null,30,50]
["Vollbenutzungsstunden Gas-Brennwertgerät",null,null,{"$f":"IF(D58=0,0,(D64/D58))","v":0},"h","(ergibt sich aus Jahresarbeit/Leistung)"]
["Vollbenutzungsstunden 2 x GAWP",null,null,{"$f":"(D65/D59)","v":2000},"h","(ergibt sich aus Jahresarbeit/Leistung)",null,null,null,null,null,null,null,null,null,null,35,58]
[null,null,null,null,null,null,null,null,null,null,null,null,null,null,null,null,40,67]
["Gasverbrauch Gas-Brennwertgerät",null,null,{"$f":"(D64/D4)","v":0},"kWh/a","(ergibt sich aus Jahresarbeit/Wirkungsgrad)",null,null,"N_B_GAS_BW"]
["Gasverbrauch 2 x GAWP",null,null,{"$f":"(D65/D6)","v":51612.903225806447},"kWh/a","(ergibt sich aus Jahresarbeit/Wirkungsgrad)",null,null,"N_B_GAS_GAWP",null,null,null,null,null,null,null,45,75]
[null,null,null,null,null,null,null,null,null,null,null,null,null,null,null,null,50,80]
["Kosten Gasverbrauch Gas-Brennwertgerät",null,null,{"$f":"(D70*D18)","v":0},"€/a","(ergibt sich aus Gasverbrauch x mittlerer Gaspreis)"]
["Kosten Gasverbrauch 2 x GAWP",null,null,{"$f":"(D71*D18)","v":5818.7150391424821},"€/a","(ergibt sich aus Gasverbrauch x mittlerer Gaspreis)",null,null,null,null,null,null,null,null,null,null,55,83]
[null,null,null,null,null,null,null,null,null,null,null,null,null,null,null,null,60,87]
["Wartungskosten Gas-Brennwertgerät",null,null,300,"€/a",null,null,null,"N_B_WART_BW"]
["Wartungskosten 2 x GAWP",null,null,500,"€/a",null,null,null,"N_B_WART_GAWP",null,null,null,null,null,null,null,65,90]
[null,null,null,null,null,null,null,null,null,null,null,null,null,null,null,null,70,92]
["Stromverbrauch 2 x GAWP",null,null,{"$f":"(D68*D7)*2","v":1880},"kWh/a",null,null,null,"N_B_STROM_LÜ_GAWP",null,null,null,null,null,null,null,75,94]
["Stromkosten 2 x GAWP",null,null,{"$f":"(D79*D26)","v":770.71525563914531},"€/a","(Stromverbrauch x mittlerer Strompreis)",null,null,null,null,null,null,null,null,null,null,80,96]
["Stromverbrauch Gas-Brennwertgerät",null,null,{"$f":"(D67*D8)","v":0},"kWh/a",null,null,null,"N_B_STROM_BW"]
["Stromkosten Gas-Brennwertgerät",null,null,{"$f":"(D81*D26)","v":0},"€/a","(Stromverbrauch x mittlerer Strompreis)"]
["Stromverbrauch 4 x Umwälzpumpe GAWP",null,null,{"$f":"((D68)*D9*4)","v":400},"kWh/a",null,null,null,"N_B_STROM_PU_GAWP",null,null,null,null,null,null,null,85,97]
["Stromkosten 4 x Umwälzpumpe GAWP",null,null,{"$f":"(D83*D26)","v":163.98196928492453},"€/a","(Stromverbrauch x mittlerer Strompreis)",null,null,null,null,null,null,null,null,null,null,90,98]
[null,null,null,null,null,null,null,null,null,null,null,null,null,null,null,null,95,99]
["Betriebskosten pro Jahr gesamt:",null,null,{"$f":"SUM(D73:D77)+D84+D80+D82","v":7553.4122640665519},"€/a",null,null,null,null,null,null,null,null,null,null,null,100,100]
[]
["FAZIT:"]
["Mittlere Energieeinsparung pro Jahr bei Einsatz"]
["von zwei GAWP SW und Gas-Brennwertgerät"]
["gegenüber den Betriebskosten eines Pelletkessels:",null,null,{"$f":"(D44-D86)","v":1812.0172345105657},"€/a"]
[]
["Differenz Investitionskosten:",null,null,{"$f":"(D54-D33)","v":{"$error":"#VALUE!"}},"€"]
[]
["Für einen auf 20 Jahre gemittelten Engergiepreis"]
["ergibt sich eine Amortisationszeit von: ",null,null,{"$f":"IF((D93/D91)<0,\"sofort\",(D93/D91))","v":{"$error":"#VALUE!"}},{"$f":"IF((D93/D91)<0,\"\",\"Jahren\")","v":{"$error":"#VALUE!"}}]

{"sheet":"SW3 bival PL","index":22,"n_rows":96,"n_cols":18,"rows_kept":96,"cut":false,"hidden":false,"merged":[[54,16,57,16],[55,17,57,17]]}
["Aktueller Gaspreis",null,null,{"$f":"(Energiepreisberechnung!D28)","v":5.5E-2},"€/kWh"]
["Aktueller Pelletpreis",null,null,{"$f":"(Energiepreisberechnung!D32)","v":0.05},"€/kWh"]
["Aktueller Strompreis",null,null,{"$f":"(Energiepreisberechnung!D31)","v":0.2},"€/kWh"]
["Gemittelter Wirkungsgrad Gasbrennwertgerät",null,null,1.06]
["Gemittelter Wirkungsgrad Pelletkessel",null,null,0.93]
["Gemittelter Wirkungsgrad GAWP SW",null,null,1.55]
["Elektr. Leistung GAWP SW",null,null,0.47,"kW"]
["Elektr. Leistung Kesselkreispumpe",null,null,0.1,"kW"]
["Elektr. Leistung Umwälzpumpe GAWP",null,null,0.05,"kW"]
[]
["Gesucht:","Investitions- und Betriebskosten während 20 Jahren"]
[]
["1."]
["Errechnung der mittleren Energiepreise binnen 20 Jahren"]
[]
["Gaspreis Anfangsjahr:",null,null,{"$f":"(D1)","v":5.5E-2},"€/kWh"]
["Gaspreis im 20´sten Jahr:",null,null,{"$f":"(Energiepreisberechnung!C22)","v":0.19890901442685968},"€/kWh"]
["Mittlerer Gaspreis während 20 Jahren:",null,null,{"$f":"(Energiepreisberechnung!C24)","v":0.11273760388338561},"€/kWh"]
[]
["Pelletpreis Anfangsjahr:",null,null,{"$f":"(D2)","v":0.05},"€/kWh"]
["Pelletpreis im 20´sten Jahr:",null,null,{"$f":"(Energiepreisberechnung!G22)","v":0.18082637675169067},"€/kWh"]
["Mittlerer Pelletpreis während 20 Jahren:",null,null,{"$f":"(Energiepreisberechnung!G24)","v":0.10248873080307783},"€/kWh"]
[]
["Strompreis Anfangsjahr:",null,null,{"$f":"(D3)","v":0.2},"€/kWh"]
["Strompreis im 20´sten Jahr:",null,null,{"$f":"(Energiepreisberechnung!E22)","v":0.72330550700676266},"€/kWh"]
["Mittlerer Strompreis während 20 Jahren:",null,null,{"$f":"(Energiepreisberechnung!E24)","v":0.40995492321231131},"€/kWh"]
[]
["2."]
["Betrachtung für einen neuen Pelletkessel + Silo",null,null,{"$f":"(Master!D5)","v":40},"kW"]
[]
["2a"]
["Investitionskosten",null,null,{"$f":"(Master!D8)","v":5000},"€"]
["Investitionskosten gesamt: ",null,null,{"$f":"(D32)","v":5000},"€",null,null,null,"R_I_PL"]
[]
["2b"]
["Betriebskosten Pelletkessel"]
["Jahresarbeit Pelletkessel",null,null,{"$f":"(Master!D5*Master!D6)","v":80000},"kWh/a","(Leistung x Jahresvollbenutzungsstunden)"]
["Energieverbrauch Pelletkessel",null,null,{"$f":"(D37/D5)","v":86021.505376344081},"kWh/a","(Wirkungsgrad berücksichtigt)",null,null,"R_B_PL"]
["Kosten Pellets",null,null,{"$f":"(D38*D22)","v":8816.2349077916406},"€/a"]
["Wartungskosten Pelletkessel",null,null,500,"€/a",null,null,null,"R_B_WART_PL"]
["Stromverbrauch 1 Stück Kesselkreispumpe",null,null,{"$f":"(Master!D6*D8)","v":200},"kWh/a",null,null,null,"R_B_STROM_PL"]
["Stromkosten 1 Stück Kesselkreispumpe",null,null,{"$f":"(D41*D26)","v":81.990984642462266},"€/a","(Stromverbrauch x mittlerer Strompreis)"]
[]
["Betriebskosten pro Jahr gesamt:",null,null,{"$f":"SUM(D39:D40)+D42","v":9398.2258924341022},"€/a"]
[null,null,null,null,null,null,null,null,null,null,null,"Negative Werte sollen gleich Null gesetzt werden"]
["3.",null,null,null,null,null,null,null,null,null,null,{"$f":"(Master!D5-D59)","v":0}]
["Betrachtung für drei GAWP 40 SW (120 kW) sowie Spitzenlastkessel"]
[null,null,null,null,null,null,null,null,null,null,null,"Wärmepumpe soll nur die Anlagenheizlast erbringen, welche erforderlich ist"]
["3a",null,null,null,null,null,null,null,null,null,null,{"$f":"IF(Master!D5<120,Master!D5,120)","v":40}]
["Investitionskosten"]
["3 x GAWP + Zubehör",null,null,{"$f":"IF(Master!T12=TRUE,25000, (IF(Master!T13=TRUE,45000, (IF(Master!T14=TRUE,65000,\"\")))))","v":""},"€",null,null,null,null,null,null,"Deckungsrate GAWP"]
["Förderung BAFA",null,null,{"$f":"IF(Master!$T$12=TRUE,(2400+100*30), (IF(Master!$T$13=TRUE,(2400+100*70), (IF(Master!$T$14=TRUE,(2400+100*110),\"\")))))","v":""},"€",null,null,null,null,null,null,{"$f":"(D58+D59)","v":40},"Max Leistung BW plus Leistung GAWP"]
[{"$f":"IF(AND(Master!D5>29,Master!D5<55),Spitzenlastkessel!C4,(IF(AND(Master!D5>54,Master!D5<65),Spitzenlastkessel!C5,(IF(AND(Master!D5>64,Master!D5<85),Spitzenlastkessel!C6,(IF(AND(Master!D5>84,Master!D5<110),Spitzenlastkessel!C7,(IF(AND(Master!D5>109,Master!D5<135),Spitzenlastkessel!C8,(IF(AND(Master!D5>134,Master!D5<150),Spitzenlastkessel!C9,(IF(AND(Master!D5>149,Master!D5<200),Spitzenlastkessel!C10,(IF(AND(Master!D5>199,Master!D5<240),Spitzenlastkessel!C11,(IF(AND(Master!D5>239,Master!D5<300),Spitzenlastkessel!C12,(IF(AND(Master!D5>299,Master!D5<370),Spitzenlastkessel!C13,(IF(AND(Master!D5>369,Master!D5<450),Spitzenlastkessel!C14,(IF(AND(Master!D5>449,Master!D5<520),Spitzenlastkessel!C15,\"Anlagenheizlast zu groß\")))))))))))))))))))))))","v":"Spitzenlastkessel GMR 3035 (35 kW)"},null,null,{"$f":"IF(AND(Master!D5>29,Master!D5<55),Spitzenlastkessel!E4,(IF(AND(Master!D5>54,Master!D5<65),Spitzenlastkessel!E5,(IF(AND(Master!D5>64,Master!D5<85),Spitzenlastkessel!E6,(IF(AND(Master!D5>84,Master!D5<110),Spitzenlastkessel!E7,(IF(AND(Master!D5>109,Master!D5<135),Spitzenlastkessel!E8,(IF(AND(Master!D5>134,Master!D5<150),Spitzenlastkessel!E9,(IF(AND(Master!D5>149,Master!D5<200),Spitzenlastkessel!E10,(IF(AND(Master!D5>199,Master!D5<240),Spitzenlastkessel!E11,(IF(AND(Master!D5>239,Master!D5<300),Spitzenlastkessel!E12,(IF(AND(Master!D5>299,Master!D5<370),Spitzenlastkessel!E13,(IF(AND(Master!D5>369,Master!D5<450),Spitzenlastkessel!E14,(IF(AND(Master!D5>449,Master!D5<520),Spitzenlastkessel!E15,\"Anlagenheizlast zu groß\")))))))))))))))))))))))","v":3600},"€","(gewählt)",null,null,null,null,null,{"$f":"(100/L52)*D59","v":100},"Prozentuale Anlagenheizlast von GAWP"]
["Investitionskosten gesamt: ",null,null,{"$f":"(D51+D53-D52)","v":{"$error":"#VALUE!"}},"€",null,null,null,"N_I_GAWP_u_BW",null,null,{"$f":"MROUND(L53,5)","v":100},"Gerundet"]
[null,null,null,null,null,null,null,null,null,null,null,null,null,null,null,null,"Prozentuale \nAnlagen-\nheizlast \nder GAWP"]
["3b",null,null,null,null,null,null,null,null,null,null,{"$f":"VLOOKUP(L54,Q59:R86,2)","v":100},"Deckungsrate GAWP",null,null,null,null,"Deckungs-\nrate"]
["Betriebskosten"]
["Max. Leistung Brennwertgerät",null,null,{"$f":"IF(L46<0,0,(Master!D5-D59))","v":0},"kW"]
["Leistung 3 x GAWP",null,null,{"$f":"(L49)","v":40},"kW",null,null,null,null,null,null,null,null,null,null,null,0,0]
[null,null,null,null,null,null,null,null,null,null,null,null,null,null,null,null,5,8]
["Deckungsrate Brennwertgerät",null,null,{"$f":"(100-D62)","v":0},"%","(Ergibt sich aus Leistungsverhältnis Brennwertgerät/GAWP)",null,null,null,null,null,null,null,null,null,null,10,15]
["Deckungsrate 3 x GAWP",null,null,{"$f":"VLOOKUP(L54,Q59:R86,2)","v":100},"%","(Ergibt sich aus Leistungsverhältnis Brennwertgerät/GAWP)",null,null,null,null,null,null,null,null,null,null,15,25]
[null,null,null,null,null,null,null,null,null,null,null,null,null,null,null,null,20,33]
["Jahresarbeit Gas-Brennwertgerät",null,null,{"$f":"(D37*(D61/100))","v":0},"kWh/a","(Deckungsrate berücksichtigt)"]
["Jahresarbeit 3 x GAWP",null,null,{"$f":"(D37*(D62/100))","v":80000},"kWh/a","(Deckungsrate berücksichtigt)",null,null,null,null,null,null,null,null,null,null,25,41]
[null,null,null,null,null,null,null,null,null,null,null,null,null,null,null,null,30,50]
["Vollbenutzungsstunden Gas-Brennwertgerät",null,null,{"$f":"IF(D58=0,0,(D64/D58))","v":0},"h","(ergibt sich aus Jahresarbeit/Leistung)"]
["Vollbenutzungsstunden 3 x GAWP",null,null,{"$f":"(D65/D59)","v":2000},"h","(ergibt sich aus Jahresarbeit/Leistung)",null,null,null,null,null,null,null,null,null,null,35,58]
[null,null,null,null,null,null,null,null,null,null,null,null,null,null,null,null,40,67]
["Gasverbrauch Gas-Brennwertgerät",null,null,{"$f":"(D64/D4)","v":0},"kWh/a","(ergibt sich aus Jahresarbeit/Wirkungsgrad)",null,null,"N_B_GAS_BW"]
["Gasverbrauch 3 x GAWP",null,null,{"$f":"(D65/D6)","v":51612.903225806447},"kWh/a","(ergibt sich aus Jahresarbeit/Wirkungsgrad)",null,null,"N_B_GAS_GAWP",null,null,null,null,null,null,null,45,75]
[null,null,null,null,null,null,null,null,null,null,null,null,null,null,null,null,50,80]
["Kosten Gasverbrauch Gas-Brennwertgerät",null,null,{"$f":"(D70*D18)","v":0},"€/a","(ergibt sich aus Gasverbrauch x mittlerer Gaspreis)"]
["Kosten Gasverbrauch 3 x GAWP",null,null,{"$f":"(D71*D18)","v":5818.7150391424821},"€/a","(ergibt sich aus Gasverbrauch x mittlerer Gaspreis)",null,null,null,null,null,null,null,null,null,null,55,83]
[null,null,null,null,null,null,null,null,null,null,null,null,null,null,null,null,60,87]
["Wartungskosten Gas-Brennwertgerät",null,null,300,"€/a",null,null,null,"N_B_WART_BW"]
["Wartungskosten 3 x GAWP",null,null,700,"€/a",null,null,null,"N_B_WART_GAWP",null,null,null,null,null,null,null,65,90]
[null,null,null,null,null,null,null,null,null,null,null,null,null,null,null,null,70,92]
["Stromverbrauch 3 x GAWP",null,null,{"$f":"(D68*D7)*3","v":2820},"kWh/a",null,null,null,"N_B_STROM_LÜ_GAWP",null,null,null,null,null,null,null,75,94]
["Stromkosten 3 x GAWP",null,null,{"$f":"(D79*D26)","v":1156.0728834587178},"€/a","(Stromverbrauch x mittlerer Strompreis)",null,null,null,null,null,null,null,null,null,null,80,96]
["Stromverbrauch Gas-Brennwertgerät",null,null,{"$f":"(D67*D8)","v":0},"kWh/a",null,null,null,"N_B_STROM_BW"]
["Stromkosten Gas-Brennwertgerät",null,null,{"$f":"(D81*D26)","v":0},"€/a","(Stromverbrauch x mittlerer Strompreis)"]
["Stromverbrauch 6 x Umwälzpumpe GAWP",null,null,{"$f":"((D68)*D9*6)","v":600},"kWh/a",null,null,null,"N_B_STROM_PU_GAWP",null,null,null,null,null,null,null,85,97]
["Stromkosten 6 x Umwälzpumpe GAWP",null,null,{"$f":"(D83*D26)","v":245.97295392738678},"€/a","(Stromverbrauch x mittlerer Strompreis)",null,null,null,null,null,null,null,null,null,null,90,98]
[null,null,null,null,null,null,null,null,null,null,null,null,null,null,null,null,95,99]
["Betriebskosten pro Jahr gesamt:",null,null,{"$f":"SUM(D73:D77)+D84+D80+D82","v":8220.7608765285859},"€/a",null,null,null,null,null,null,null,null,null,null,null,100,100]
[]
["FAZIT:"]
["Mittlere Energieeinsparung pro Jahr bei Einsatz"]
["von drei GAWP SW und Gas-Brennwertgerät"]
["gegenüber den Betriebskosten eines Pelletkessels:",null,null,{"$f":"(D44-D86)","v":1177.4650159055163},"€/a"]
[]
["Differenz Investitionskosten:",null,null,{"$f":"(D54-D33)","v":{"$error":"#VALUE!"}},"€"]
[]
["Für einen auf 20 Jahre gemittelten Engergiepreis"]
["ergibt sich eine Amortisationszeit von: ",null,null,{"$f":"IF((D93/D91)<0,\"sofort\",(D93/D91))","v":{"$error":"#VALUE!"}},{"$f":"IF((D93/D91)<0,\"\",\"Jahren\")","v":{"$error":"#VALUE!"}}]

{"sheet":"SW mono PL","index":23,"n_rows":81,"n_cols":9,"rows_kept":81,"cut":false,"hidden":false,"merged":[]}
["Aktueller Gaspreis",null,null,{"$f":"(Energiepreisberechnung!D28)","v":5.5E-2},"€/kWh"]
["Aktueller Pelletpreis",null,null,{"$f":"(Energiepreisberechnung!D32)","v":0.05},"€/kWh"]
["Aktueller Strompreis",null,null,{"$f":"(Energiepreisberechnung!D31)","v":0.2},"€/kWh"]
["Gemittelter Wirkungsgrad Pelletkessel",null,null,0.93]
["Gemittelter Wirkungsgrad GAWP SW",null,null,1.55]
["Elektr. Leistung GAWP SW",null,null,0.47,"kW"]
["Elektr. Leistung Kesselkreispumpe",null,null,0.05,"kW"]
[]
["Gesucht:","Investitions- und Betriebskosten während 20 Jahren"]
[]
["1."]
["Errechnung der mittleren Energiepreise binnen 20 Jahren"]
[]
["Gaspreis Anfangsjahr:",null,null,{"$f":"(D1)","v":5.5E-2},"€/kWh"]
["Gaspreis im 20´sten Jahr:",null,null,{"$f":"(Energiepreisberechnung!C22)","v":0.19890901442685968},"€/kWh"]
["Mittlerer Gaspreis während 20 Jahren:",null,null,{"$f":"(Energiepreisberechnung!C24)","v":0.11273760388338561},"€/kWh"]
[]
["Pelletpreis Anfangsjahr:",null,null,{"$f":"(D2)","v":0.05},"€/kWh"]
["Pelletpreis im 20´sten Jahr:",null,null,{"$f":"(Energiepreisberechnung!G22)","v":0.18082637675169067},"€/kWh"]
["Mittlerer Pelletpreis während 20 Jahren:",null,null,{"$f":"(Energiepreisberechnung!G24)","v":0.10248873080307783},"€/kWh"]
[]
["Strompreis Anfangsjahr:",null,null,{"$f":"(D3)","v":0.2},"€/kWh"]
["Strompreis im 20´sten Jahr:",null,null,{"$f":"(Energiepreisberechnung!E22)","v":0.72330550700676266},"€/kWh"]
["Mittlerer Strompreis während 20 Jahren:",null,null,{"$f":"(Energiepreisberechnung!E24)","v":0.40995492321231131},"€/kWh"]
[]
["2."]
["Betrachtung für einen neuen Pelletkessel + Silo",null,null,{"$f":"(Master!D5)","v":40},"kW"]
[]
["2a"]
["Investitionskosten",null,null,{"$f":"(Master!D8)","v":5000},"€"]
["Investitionskosten gesamt: ",null,null,{"$f":"(D30)","v":5000},"€",null,null,null,"R_I_PL"]
[]
["2b"]
["Betriebskosten Pelletkessel"]
["Jahresarbeit Pelletkessel",null,null,{"$f":"(Master!D5*Master!D6)","v":80000},"kWh/a","(Leistung x Jahresvollbenutzungsstunden)"]
["Energieverbrauch Pelletkessel",null,null,{"$f":"(D35/D4)","v":86021.505376344081},"kWh/a","(Wirkungsgrad berücksichtigt)",null,null,"R_B_PL"]
["Kosten Pellets",null,null,{"$f":"(D36*D20)","v":8816.2349077916406},"€/a"]
["Wartungskosten Pelletkessel",null,null,500,"€/a",null,null,null,"R_B_WART_PL"]
["Stromverbrauch 1 Stück Kesselkreispumpe",null,null,{"$f":"(Master!D6*D7)","v":100},"kWh/a",null,null,null,"R_B_STROM_PL"]
["Stromkosten 1 Stück Kesselkreispumpe",null,null,{"$f":"(D39*D24)","v":40.995492321231133},"€/a","(Stromverbrauch x mittlerer Strompreis)"]
[]
["Betriebskosten pro Jahr gesamt:",null,null,{"$f":"SUM(D37:D38)+D40","v":9357.2304001128723},"€/a"]
[]
["3."]
["Betrachtung für eine GAWP 40 SW (40 kW) monovalent"]
[]
["3a"]
["Investitionskosten"]
["GAWP + Zubehör",null,null,{"$f":"IF(Master!T9=TRUE,25000, (IF(Master!T10=TRUE,45000, (IF(Master!T11=TRUE,65000,\"\")))))","v":45000},"€"]
["Förderung BAFA",null,null,{"$f":"IF(Master!$T$9=TRUE,(2400+100*30), (IF(Master!$T$10=TRUE,(2400+100*70), (IF(Master!$T$11=TRUE,(2400+100*110),\"\")))))","v":9400},"€"]
["Investitionskosten gesamt: ",null,null,{"$f":"(D49-D50)","v":35600},"€",null,null,null,"N_I_GAWP_u_BW"]
[]
["3b"]
["Betriebskosten"]
["Leistung GAWP",null,null,{"$f":"(Master!D5)","v":40},"kW"]
["Jahresarbeit GAWP",null,null,{"$f":"(D35)","v":80000},"kWh/a","(ergibt sich aus Deckungsrate = 100%)"]
[]
["Vollbenutzungsstunden GAWP",null,null,{"$f":"(D56/D55)","v":2000},"h","(ergibt sich aus Jahresarbeit/Leistung)"]
[]
["Gasverbrauch GAWP",null,null,{"$f":"(D56/D5)","v":51612.903225806447},"kWh/a","(ergibt sich aus Jahresarbeit/Wirkungsgrad)",null,null,"N_B_GAS_GAWP"]
[]
["Kosten Gasverbrauch GAWP",null,null,{"$f":"(D60*D16)","v":5818.7150391424821},"€/a","(ergibt sich aus Gasverbrauch x mittlerer Gaspreis)"]
[]
["Wartungskosten GAWP",null,null,300,"€/a",null,null,null,"N_B_WART_GAWP"]
[]
["Stromverbrauch GAWP",null,null,{"$f":"(D58*D6)","v":940},"kWh/a",null,null,null,"N_B_STROM_LÜ_GAWP"]
["Stromkosten GAWP",null,null,{"$f":"(D66*D24)","v":385.35762781957266},"€/a","(Stromverbrauch x mittlerer Strompreis)"]
["Stromverbrauch 2 x Umwälzpumpe GAWP",null,null,{"$f":"((D58)*D7*2)","v":200},"kWh/a",null,null,null,"N_B_STROM_PU_GAWP"]
["Stromkosten 2 x Umwälzpumpe GAWP",null,null,{"$f":"(D68*D24)","v":81.990984642462266},"€/a","(Stromverbrauch x mittlerer Strompreis)"]
[]
["Betriebskosten pro Jahr gesamt:",null,null,{"$f":"SUM(D62:D64)+D69+D67","v":6586.063651604517},"€/a"]
[]
["FAZIT:"]
["Mittlere Energieeinsparung pro Jahr bei Einsatz"]
["von einer monovalenten GAWP SW gegenüber"]
["den Betriebskosten eines Pelletkessels",null,null,{"$f":"(D42-D71)","v":2771.1667485083553},"€/a"]
[]
["Differenz Investitionskosten:",null,null,{"$f":"(D51-D31)","v":30600},"€"]
[]
["Für einen auf 20 Jahre gemittelten Engergiepreis"]
["ergibt sich eine Amortisationszeit von: ",null,null,{"$f":"IF((D78/D76)<0,\"sofort\",(D78/D76))","v":11.042280301779442},{"$f":"IF((D78/D76)<0,\"\",\"Jahren\")","v":"Jahren"}]

{"sheet":"SW2 mono PL","index":24,"n_rows":82,"n_cols":9,"rows_kept":82,"cut":false,"hidden":false,"merged":[]}
["Aktueller Gaspreis",null,null,{"$f":"(Energiepreisberechnung!D28)","v":5.5E-2},"€/kWh"]
["Aktueller Pelletpreis",null,null,{"$f":"(Energiepreisberechnung!D32)","v":0.05},"€/kWh"]
["Aktueller Strompreis",null,null,{"$f":"(Energiepreisberechnung!D31)","v":0.2},"€/kWh"]
["Gemittelter Wirkungsgrad Pelletkessel",null,null,0.93]
["Gemittelter Wirkungsgrad GAWP SW",null,null,1.55]
["Elektr. Leistung GAWP SW",null,null,0.47,"kW"]
["Elektr. Leistung Kesselkreispumpe",null,null,0.06,"kW"]
["Elektr. Leistung Umwälzpumpe GAWP",null,null,0.05,"kW"]
[]
["Gesucht:","Investitions- und Betriebskosten während 20 Jahren"]
[]
["1."]
["Errechnung der mittleren Energiepreise binnen 20 Jahren"]
[]
["Gaspreis Anfangsjahr:",null,null,{"$f":"(D1)","v":5.5E-2},"€/kWh"]
["Gaspreis im 20´sten Jahr:",null,null,{"$f":"(Energiepreisberechnung!C22)","v":0.19890901442685968},"€/kWh"]
["Mittlerer Gaspreis während 20 Jahren:",null,null,{"$f":"(Energiepreisberechnung!C24)","v":0.11273760388338561},"€/kWh"]
[]
["Pelletpreis Anfangsjahr:",null,null,{"$f":"(D2)","v":0.05},"€/kWh"]
["Pelletpreis im 20´sten Jahr:",null,null,{"$f":"(Energiepreisberechnung!G22)","v":0.18082637675169067},"€/kWh"]
["Mittlerer Pelletpreis während 20 Jahren:",null,null,{"$f":"(Energiepreisberechnung!G24)","v":0.10248873080307783},"€/kWh"]
[]
["Strompreis Anfangsjahr:",null,null,{"$f":"(D3)","v":0.2},"€/kWh"]
["Strompreis im 20´sten Jahr:",null,null,{"$f":"(Energiepreisberechnung!E22)","v":0.72330550700676266},"€/kWh"]
["Mittlerer Strompreis während 20 Jahren:",null,null,{"$f":"(Energiepreisberechnung!E24)","v":0.40995492321231131},"€/kWh"]
[]
["2."]
["Betrachtung für einen neuen Pelletkessel + Silo",null,null,{"$f":"(Master!D5)","v":40},"kW"]
[]
["2a"]
["Investitionskosten",null,null,{"$f":"(Master!D8)","v":5000},"€"]
["Investitionskosten gesamt: ",null,null,{"$f":"(D31)","v":5000},"€",null,null,null,"R_I_PL"]
[]
["2b"]
["Betriebskosten Pelletkessel"]
["Jahresarbeit Pelletkessel",null,null,{"$f":"(Master!D5*Master!D6)","v":80000},"kWh/a","(Leistung x Jahresvollbenutzungsstunden)"]
["Energieverbrauch Pelletkessel",null,null,{"$f":"(D36/D4)","v":86021.505376344081},"kWh/a","(Wirkungsgrad berücksichtigt)",null,null,"R_B_PL"]
["Kosten Pellets",null,null,{"$f":"(D37*D21)","v":8816.2349077916406},"€/a"]
["Wartungskosten Pelletkessel",null,null,500,"€/a",null,null,null,"R_B_WART_PL"]
["Stromverbrauch 1 Stück Kesselkreispumpe",null,null,{"$f":"(Master!D6*D7)","v":120},"kWh/a",null,null,null,"R_B_STROM_PL"]
["Stromkosten 1 Stück Kesselkreispumpe",null,null,{"$f":"(D40*D25)","v":49.194590785477359},"€/a","(Stromverbrauch x mittlerer Strompreis)"]
[]
["Betriebskosten pro Jahr gesamt:",null,null,{"$f":"SUM(D38:D39)+D41","v":9365.4294985771176},"€/a"]
[]
["3."]
["Betrachtung für zwei GAWP 40 SW (80 kW) monovalent"]
[]
["3a"]
["Investitionskosten"]
["2 x GAWP + Zubehör",null,null,{"$f":"IF(Master!T9=TRUE,25000, (IF(Master!T10=TRUE,45000, (IF(Master!T11=TRUE,65000,\"\")))))","v":45000},"€"]
["Förderung BAFA",null,null,{"$f":"IF(Master!$T$9=TRUE,(2400+100*30), (IF(Master!$T$10=TRUE,(2400+100*70), (IF(Master!$T$11=TRUE,(2400+100*110),\"\")))))","v":9400},"€"]
["Investitionskosten gesamt: ",null,null,{"$f":"(D50-D51)","v":35600},"€",null,null,null,"N_I_GAWP_u_BW"]
[]
["3b"]
["Betriebskosten"]
["Leistung 2 x GAWP",null,null,{"$f":"(Master!D5)","v":40},"kW"]
["Jahresarbeit 2 x GAWP",null,null,{"$f":"(D36)","v":80000},"kWh/a","(ergibt sich aus Deckungsrate = 100%)"]
[]
["Vollbenutzungsstunden 2 x GAWP",null,null,{"$f":"(D57/D56)","v":2000},"h","(ergibt sich aus Jahresarbeit/Leistung)"]
[]
["Gasverbrauch 2 x GAWP",null,null,{"$f":"(D57/D5)","v":51612.903225806447},"kWh/a","(ergibt sich aus Jahresarbeit/Wirkungsgrad)",null,null,"N_B_GAS_GAWP"]
[]
["Kosten Gasverbrauch 2 x GAWP",null,null,{"$f":"(D61*D17)","v":5818.7150391424821},"€/a","(ergibt sich aus Gasverbrauch x mittlerer Gaspreis)"]
[]
["Wartungskosten 2 x GAWP",null,null,500,"€/a",null,null,null,"N_B_WART_GAWP"]
[]
["Stromverbrauch 2 x GAWP",null,null,{"$f":"(D59*D6)*2","v":1880},"kWh/a",null,null,null,"N_B_STROM_LÜ_GAWP"]
["Stromkosten 2 x GAWP",null,null,{"$f":"(D67*D25)","v":770.71525563914531},"€/a","(Stromverbrauch x mittlerer Strompreis)"]
["Stromverbrauch 4 x Umwälzpumpe GAWP",null,null,{"$f":"((D59)*D8*4)","v":400},"kWh/a",null,null,null,"N_B_STROM_PU_GAWP"]
["Stromkosten 4 x Umwälzpumpe GAWP",null,null,{"$f":"(D69*D25)","v":163.98196928492453},"€/a","(Stromverbrauch x mittlerer Strompreis)"]
[]
["Betriebskosten pro Jahr gesamt:",null,null,{"$f":"SUM(D63:D65)+D70+D68","v":7253.4122640665519},"€/a"]
[]
["FAZIT:"]
["Mittlere Energieeinsparung pro Jahr bei Einsatz"]
["von zwei monovalenten GAWP SW gegenüber"]
["den Betriebskosten eines Pelletkessels",null,null,{"$f":"(D43-D72)","v":2112.0172345105657},"€/a"]
[]
["Differenz Investitionskosten:",null,null,{"$f":"(D52-D32)","v":30600},"€"]
[]
["Für einen auf 20 Jahre gemittelten Engergiepreis"]
["ergibt sich eine Amortisationszeit von: ",null,null,{"$f":"IF((D79/D77)<0,\"sofort\",(D79/D77))","v":14.48851813327706},{"$f":"IF((D79/D77)<0,\"\",\"Jahren\")","v":"Jahren"}]

{"sheet":"SW3 mono PL","index":25,"n_rows":82,"n_cols":9,"rows_kept":82,"cut":false,"hidden":false,"merged":[]}
["Aktueller Gaspreis",null,null,{"$f":"(Energiepreisberechnung!D28)","v":5.5E-2},"€/kWh"]
["Aktueller Pelletpreis",null,null,{"$f":"(Energiepreisberechnung!D32)","v":0.05},"€/kWh"]
["Aktueller Strompreis",null,null,{"$f":"(Energiepreisberechnung!D31)","v":0.2},"€/kWh"]
["Gemittelter Wirkungsgrad Pelletkessel",null,null,0.93]
["Gemittelter Wirkungsgrad GAWP SW",null,null,1.55]
["Elektr. Leistung GAWP SW",null,null,0.47,"kW"]
["Elektr. Leistung Kesselkreispumpe",null,null,0.1,"kW"]
["Elektr. Leistung Umwälzpumpe GAWP",null,null,0.05,"kW"]
[]
["Gesucht:","Investitions- und Betriebskosten während 20 Jahren"]
[]
["1."]
["Errechnung der mittleren Energiepreise binnen 20 Jahren"]
[]
["Gaspreis Anfangsjahr:",null,null,{"$f":"(D1)","v":5.5E-2},"€/kWh"]
["Gaspreis im 20´sten Jahr:",null,null,{"$f":"(Energiepreisberechnung!C22)","v":0.19890901442685968},"€/kWh"]
["Mittlerer Gaspreis während 20 Jahren:",null,null,{"$f":"(Energiepreisberechnung!C24)","v":0.11273760388338561},"€/kWh"]
[]
["Pelletpreis Anfangsjahr:",null,null,{"$f":"(D2)","v":0.05},"€/kWh"]
["Pelletpreis im 20´sten Jahr:",null,null,{"$f":"(Energiepreisberechnung!G22)","v":0.18082637675169067},"€/kWh"]
["Mittlerer Pelletpreis während 20 Jahren:",null,null,{"$f":"(Energiepreisberechnung!G24)","v":0.10248873080307783},"€/kWh"]
[]
["Strompreis Anfangsjahr:",null,null,{"$f":"(D3)","v":0.2},"€/kWh"]
["Strompreis im 20´sten Jahr:",null,null,{"$f":"(Energiepreisberechnung!E22)","v":0.72330550700676266},"€/kWh"]
["Mittlerer Strompreis während 20 Jahren:",null,null,{"$f":"(Energiepreisberechnung!E24)","v":0.40995492321231131},"€/kWh"]
[]
["2."]
["Betrachtung für einen neuen Pelletkessel + Silo",null,null,{"$f":"(Master!D5)","v":40},"kW"]
[]
["2a"]
["Investitionskosten",null,null,{"$f":"(Master!D8)","v":5000},"€"]
["Investitionskosten gesamt: ",null,null,{"$f":"(D31)","v":5000},"€",null,null,null,"R_I_PL"]
[]
["2b"]
["Betriebskosten Pelletkessel"]
["Jahresarbeit Pelletkessel",null,null,{"$f":"(Master!D5*Master!D6)","v":80000},"kWh/a","(Leistung x Jahresvollbenutzungsstunden)"]
["Energieverbrauch Pelletkessel",null,null,{"$f":"(D36/D4)","v":86021.505376344081},"kWh/a","(Wirkungsgrad berücksichtigt)",null,null,"R_B_PL"]
["Kosten Pellets",null,null,{"$f":"(D37*D21)","v":8816.2349077916406},"€/a"]
["Wartungskosten Pelletkessel",null,null,500,"€/a",null,null,null,"R_B_WART_PL"]
["Stromverbrauch 1 Stück Kesselkreispumpe",null,null,{"$f":"(Master!D6*D7)","v":200},"kWh/a",null,null,null,"R_B_STROM_PL"]
["Stromkosten 1 Stück Kesselkreispumpe",null,null,{"$f":"(D40*D25)","v":81.990984642462266},"€/a","(Stromverbrauch x mittlerer Strompreis)"]
[]
["Betriebskosten pro Jahr gesamt:",null,null,{"$f":"SUM(D38:D39)+D41","v":9398.2258924341022},"€/a"]
[]
["3."]
["Betrachtung für drei GAWP 40 SW (120 kW) monovalent"]
[]
["3a"]
["Investitionskosten"]
["3 x GAWP + Zubehör",null,null,{"$f":"IF(Master!$T$9=TRUE,25000, (IF(Master!$T$10=TRUE,45000, (IF(Master!$T$11=TRUE,65000,\"\")))))","v":45000},"€"]
["Förderung BAFA",null,null,{"$f":"IF(Master!$T$9=TRUE,(2400+100*30), (IF(Master!$T$10=TRUE,(2400+100*70), (IF(Master!$T$11=TRUE,(2400+100*110),\"\")))))","v":9400},"€"]
["Investitionskosten gesamt: ",null,null,{"$f":"(D50-D51)","v":35600},"€",null,null,null,"N_I_GAWP_u_BW"]
[]
["3b"]
["Betriebskosten"]
["Leistung 3 x GAWP",null,null,{"$f":"(Master!$D$5)","v":40},"kW"]
["Jahresarbeit 3 x GAWP",null,null,{"$f":"(D36)","v":80000},"kWh/a","(ergibt sich aus Deckungsrate = 100%)"]
[]
["Vollbenutzungsstunden 3 x GAWP",null,null,{"$f":"(D57/D56)","v":2000},"h","(ergibt sich aus Jahresarbeit/Leistung)"]
[]
["Gasverbrauch 3 x GAWP",null,null,{"$f":"(D57/D5)","v":51612.903225806447},"kWh/a","(ergibt sich aus Jahresarbeit/Wirkungsgrad)",null,null,"N_B_GAS_GAWP"]
[]
["Kosten Gasverbrauch 3 x GAWP",null,null,{"$f":"(D61*D17)","v":5818.7150391424821},"€/a","(ergibt sich aus Gasverbrauch x mittlerer Gaspreis)"]
[]
["Wartungskosten 3 x GAWP",null,null,700,"€/a",null,null,null,"N_B_WART_GAWP"]
[]
["Stromverbrauch 3 x GAWP",null,null,{"$f":"(D59*D6)*3","v":2820},"kWh/a",null,null,null,"N_B_STROM_LÜ_GAWP"]
["Stromkosten 3 x GAWP",null,null,{"$f":"(D67*D25)","v":1156.0728834587178},"€/a","(Stromverbrauch x mittlerer Strompreis)"]
["Stromverbrauch 6 x Umwälzpumpe GAWP",null,null,{"$f":"((D59)*D8*6)","v":600},"kWh/a",null,null,null,"N_B_STROM_PU_GAWP"]
["Stromkosten 6 x Umwälzpumpe GAWP",null,null,{"$f":"(D69*D25)","v":245.97295392738678},"€/a","(Stromverbrauch x mittlerer Strompreis)"]
[]
["Betriebskosten pro Jahr gesamt:",null,null,{"$f":"SUM(D63:D65)+D70+D68","v":7920.7608765285868},"€/a"]
[]
["FAZIT:"]
["Mittlere Energieeinsparung pro Jahr bei Einsatz"]
["von drei monovalenten GAWP SW gegenüber"]
["den Betriebskosten eines Pelletkessels",null,null,{"$f":"(D43-D72)","v":1477.4650159055154},"€/a"]
[]
["Differenz Investitionskosten:",null,null,{"$f":"(D52-D32)","v":30600},"€"]
[]
["Für einen auf 20 Jahre gemittelten Engergiepreis"]
["ergibt sich eine Amortisationszeit von: ",null,null,{"$f":"IF((D79/D77)<0,\"sofort\",(D79/D77))","v":20.711150294983963},{"$f":"IF((D79/D77)<0,\"\",\"Jahren\")","v":"Jahren"}]

{"sheet":"SW bival GAS","index":26,"n_rows":89,"n_cols":18,"rows_kept":89,"cut":false,"hidden":false,"merged":[[47,16,50,16],[48,17,50,17]]}
["Aktueller Gaspreis",null,null,{"$f":"(Energiepreisberechnung!D28)","v":5.5E-2},"€/kWh"]
["Aktueller Strompreis",null,null,{"$f":"(Energiepreisberechnung!D31)","v":0.2},"€/kWh"]
["Gemittelter Wirkungsgrad Gasbrennwertgerät",null,null,1.06]
["Gemittelter Wirkungsgrad GAWP SW",null,null,1.55]
["Elektr. Leistung GAWP SW",null,null,0.47,"kW"]
["Elektr. Leistung Kesselkreispumpe",null,null,0.05,"kW"]
[]
["Gesucht:","Investitions- und Betriebskosten während 20 Jahren"]
[]
["1."]
["Errechnung der mittleren Energiepreise binnen 20 Jahren"]
[]
["Gaspreis Anfangsjahr:",null,null,{"$f":"(D1)","v":5.5E-2},"€/kWh"]
["Gaspreis im 20´sten Jahr:",null,null,{"$f":"(Energiepreisberechnung!C22)","v":0.19890901442685968},"€/kWh"]
["Mittlerer Gaspreis während 20 Jahren:",null,null,{"$f":"(Energiepreisberechnung!C24)","v":0.11273760388338561},"€/kWh"]
[]
["Strompreis Anfangsjahr:",null,null,{"$f":"(D2)","v":0.2},"€/kWh"]
["Strompreis im 20´sten Jahr:",null,null,{"$f":"(Energiepreisberechnung!E22)","v":0.72330550700676266},"€/kWh"]
["Mittlerer Strompreis während 20 Jahren:",null,null,{"$f":"(Energiepreisberechnung!E24)","v":0.40995492321231131},"€/kWh"]
[]
["2."]
["Betrachtung für ein neues Gasbrennwertgerät",null,null,{"$f":"(Master!D5)","v":40},"kW"]
[]
["2a"]
["Investitionskosten",null,null,{"$f":"(Master!D8)","v":5000},"€"]
["Investitionskosten gesamt: ",null,null,{"$f":"(D25)","v":5000},"€",null,null,null,"R_I_GAS"]
[]
["2b"]
["Betriebskosten Gas-Brennwertgerät"]
["Jahresarbeit Gas-Brennwertgerät",null,null,{"$f":"(Master!D5*Master!D6)","v":80000},"kWh/a","(Leistung x Jahresvollbenutzungsstunden)"]
["Energieverbrauch Gas-Brennwertgerät",null,null,{"$f":"(D30/D3)","v":75471.698113207545},"kWh/a","(Wirkungsgrad berücksichtigt)",null,null,"R_B_GAS"]
["Kosten Gas",null,null,{"$f":"(D31*D15)","v":8508.4984062932526},"€/a"]
["Wartungskosten Gas-Brennwertgerät",null,null,300,"€/a",null,null,null,"R_B_WART_GAS"]
["Stromverbrauch 1 Stück Kesselkreispumpe",null,null,{"$f":"(Master!D6*D6)","v":100},"kWh/a",null,null,null,"R_B_STROM_GAS"]
["Stromkosten 1 Stück Kesselkreispumpe",null,null,{"$f":"(D34*D19)","v":40.995492321231133},"€/a","(Stromverbrauch x mittlerer Strompreis)"]
[]
["Betriebskosten pro Jahr gesamt:",null,null,{"$f":"SUM(D32:D33)+D35","v":8849.4938986144844},"€/a"]
[null,null,null,null,null,null,null,null,null,null,null,"Negative Werte sollen gleich Null gesetzt werden"]
["3.",null,null,null,null,null,null,null,null,null,null,{"$f":"(Master!D5-D52)","v":0}]
["Betrachtung für eine GAWP 40 SW (40 kW) sowie Spitzenlastkessel"]
[null,null,null,null,null,null,null,null,null,null,null,"Wärmepumpe soll nur die Anlagenheizlast erbringen, welche erforderlich ist"]
["3a",null,null,null,null,null,null,null,null,null,null,{"$f":"IF(Master!D5<40,Master!D5,40)","v":40}]
["Investitionskosten"]
["GAWP + Zubehör",null,null,{"$f":"IF(Master!T12=TRUE,25000, (IF(Master!T13=TRUE,45000, (IF(Master!T14=TRUE,65000,\"\")))))","v":""},"€",null,null,null,null,null,null,"Deckungsrate GAWP"]
["Förderung BAFA",null,null,{"$f":"IF(Master!$T$12=TRUE,(2400+100*30), (IF(Master!$T$13=TRUE,(2400+100*70), (IF(Master!$T$14=TRUE,(2400+100*110),\"\")))))","v":""},"€",null,null,null,null,null,null,{"$f":"(D51+D52)","v":40},"Max Leistung BW plus Leistung GAWP"]
[{"$f":"IF(AND(Master!D5>29,Master!D5<55),Spitzenlastkessel!C4,(IF(AND(Master!D5>54,Master!D5<65),Spitzenlastkessel!C5,(IF(AND(Master!D5>64,Master!D5<85),Spitzenlastkessel!C6,(IF(AND(Master!D5>84,Master!D5<110),Spitzenlastkessel!C7,(IF(AND(Master!D5>109,Master!D5<135),Spitzenlastkessel!C8,(IF(AND(Master!D5>134,Master!D5<150),Spitzenlastkessel!C9,(IF(AND(Master!D5>149,Master!D5<200),Spitzenlastkessel!C10,(IF(AND(Master!D5>199,Master!D5<240),Spitzenlastkessel!C11,(IF(AND(Master!D5>239,Master!D5<300),Spitzenlastkessel!C12,(IF(AND(Master!D5>299,Master!D5<370),Spitzenlastkessel!C13,(IF(AND(Master!D5>369,Master!D5<450),Spitzenlastkessel!C14,(IF(AND(Master!D5>449,Master!D5<520),Spitzenlastkessel!C15,\"Anlagenheizlast zu groß\")))))))))))))))))))))))","v":"Spitzenlastkessel GMR 3035 (35 kW)"},null,null,{"$f":"IF(AND(Master!D5>29,Master!D5<55),Spitzenlastkessel!E4,(IF(AND(Master!D5>54,Master!D5<65),Spitzenlastkessel!E5,(IF(AND(Master!D5>64,Master!D5<85),Spitzenlastkessel!E6,(IF(AND(Master!D5>84,Master!D5<110),Spitzenlastkessel!E7,(IF(AND(Master!D5>109,Master!D5<135),Spitzenlastkessel!E8,(IF(AND(Master!D5>134,Master!D5<150),Spitzenlastkessel!E9,(IF(AND(Master!D5>149,Master!D5<200),Spitzenlastkessel!E10,(IF(AND(Master!D5>199,Master!D5<240),Spitzenlastkessel!E11,(IF(AND(Master!D5>239,Master!D5<300),Spitzenlastkessel!E12,(IF(AND(Master!D5>299,Master!D5<370),Spitzenlastkessel!E13,(IF(AND(Master!D5>369,Master!D5<450),Spitzenlastkessel!E14,(IF(AND(Master!D5>449,Master!D5<520),Spitzenlastkessel!E15,\"Anlagenheizlast zu groß\")))))))))))))))))))))))","v":3600},"€","(gewählt)",null,null,null,null,null,{"$f":"(100/L45)*D52","v":100},"Prozentuale Anlagenheizlast von GAWP"]
["Investitionskosten gesamt: ",null,null,{"$f":"(D44+D46-D45)","v":{"$error":"#VALUE!"}},"€",null,null,null,"N_I_GAWP_u_BW",null,null,{"$f":"MROUND(L46,5)","v":100},"Gerundet"]
[null,null,null,null,null,null,null,null,null,null,null,null,null,null,null,null,"Prozentuale \nAnlagen-\nheizlast \nder GAWP"]
["3b",null,null,null,null,null,null,null,null,null,null,{"$f":"VLOOKUP(L47,Q52:R79,2)","v":100},"Deckungsrate GAWP",null,null,null,null,"Deckungs-\nrate"]
["Betriebskosten"]
["Max. Leistung Brennwertgerät",null,null,{"$f":"IF(L39<0,0,(Master!D5-D52))","v":0},"kW"]
["Leistung GAWP",null,null,{"$f":"(L42)","v":40},"kW",null,null,null,null,null,null,null,null,null,null,null,0,0]
[null,null,null,null,null,null,null,null,null,null,null,null,null,null,null,null,5,8]
["Deckungsrate Brennwertgerät",null,null,{"$f":"(100-D55)","v":0},"%","(Ergibt sich aus Leistungsverhältnis Brennwertgerät/GAWP)",null,null,null,null,null,null,null,null,null,null,10,15]
["Deckungsrate GAWP",null,null,{"$f":"VLOOKUP(L47,Q52:R79,2)","v":100},"%","(Ergibt sich aus Leistungsverhältnis Brennwertgerät/GAWP)",null,null,null,null,null,null,null,null,null,null,15,25]
[null,null,null,null,null,null,null,null,null,null,null,null,null,null,null,null,20,33]
["Jahresarbeit Gas-Brennwertgerät",null,null,{"$f":"(D30*(D54/100))","v":0},"kWh/a","(Deckungsrate berücksichtigt)"]
["Jahresarbeit GAWP",null,null,{"$f":"(D30*(D55/100))","v":80000},"kWh/a","(Deckungsrate berücksichtigt)",null,null,null,null,null,null,null,null,null,null,25,41]
[null,null,null,null,null,null,null,null,null,null,null,null,null,null,null,null,30,50]
["Vollbenutzungsstunden Gas-Brennwertgerät",null,null,{"$f":"IF(D51=0,0,(D57/D51))","v":0},"h","(ergibt sich aus Jahresarbeit/Leistung)"]
["Vollbenutzungsstunden GAWP",null,null,{"$f":"(D58/D52)","v":2000},"h","(ergibt sich aus Jahresarbeit/Leistung)",null,null,null,null,null,null,null,null,null,null,35,58]
[null,null,null,null,null,null,null,null,null,null,null,null,null,null,null,null,40,67]
["Gasverbrauch Gas-Brennwertgerät",null,null,{"$f":"(D57/D3)","v":0},"kWh/a","(ergibt sich aus Jahresarbeit/Wirkungsgrad)",null,null,"N_B_GAS_BW"]
["Gasverbrauch GAWP",null,null,{"$f":"(D58/D4)","v":51612.903225806447},"kWh/a","(ergibt sich aus Jahresarbeit/Wirkungsgrad)",null,null,"N_B_GAS_GAWP",null,null,null,null,null,null,null,45,75]
[null,null,null,null,null,null,null,null,null,null,null,null,null,null,null,null,50,80]
["Kosten Gasverbrauch Gas-Brennwertgerät",null,null,{"$f":"(D63*D15)","v":0},"€/a","(ergibt sich aus Gasverbrauch x mittlerer Gaspreis)"]
["Kosten Gasverbrauch GAWP",null,null,{"$f":"(D64*D15)","v":5818.7150391424821},"€/a","(ergibt sich aus Gasverbrauch x mittlerer Gaspreis)",null,null,null,null,null,null,null,null,null,null,55,83]
[null,null,null,null,null,null,null,null,null,null,null,null,null,null,null,null,60,87]
["Wartungskosten Gas-Brennwertgerät",null,null,300,"€/a",null,null,null,"N_B_WART_BW"]
["Wartungskosten GAWP",null,null,300,"€/a",null,null,null,"N_B_WART_GAWP",null,null,null,null,null,null,null,65,90]
[null,null,null,null,null,null,null,null,null,null,null,null,null,null,null,null,70,92]
["Stromverbrauch GAWP",null,null,{"$f":"(D61*D5)","v":940},"kWh/a",null,null,null,"N_B_STROM_LÜ_GAWP",null,null,null,null,null,null,null,75,94]
["Stromkosten GAWP",null,null,{"$f":"(D72*D19)","v":385.35762781957266},"€/a","(Stromverbrauch x mittlerer Strompreis)",null,null,null,null,null,null,null,null,null,null,80,96]
["Stromverbrauch Gas-Brennwertgerät",null,null,{"$f":"(D60*D6)","v":0},"kWh/a",null,null,null,"N_B_STROM_BW"]
["Stromkosten Gas-Brennwertgerät",null,null,{"$f":"(D74*D19)","v":0},"€/a","(Stromverbrauch x mittlerer Strompreis)"]
["Stromverbrauch 2 x Umwälzpumpe GAWP",null,null,{"$f":"((D61)*D6*2)","v":200},"kWh/a",null,null,null,"N_B_STROM_PU_GAWP",null,null,null,null,null,null,null,85,97]
["Stromkosten 2 x Umwälzpumpe GAWP",null,null,{"$f":"(D76*D19)","v":81.990984642462266},"€/a","(Stromverbrauch x mittlerer Strompreis)",null,null,null,null,null,null,null,null,null,null,90,98]
[null,null,null,null,null,null,null,null,null,null,null,null,null,null,null,null,95,99]
["Betriebskosten pro Jahr gesamt:",null,null,{"$f":"SUM(D66:D70)+D77+D73+D75","v":6886.063651604517},"€/a",null,null,null,null,null,null,null,null,null,null,null,100,100]
[]
["FAZIT:"]
["Mittlere Energieeinsparung pro Jahr bei Einsatz"]
["von einer GAWP SW und Gas-Brennwertgerät"]
["gegenüber \"nur Gas-Brennwert\":",null,null,{"$f":"(D37-D79)","v":1963.4302470099674},"€/a"]
[]
["Differenz Investitionskosten:",null,null,{"$f":"(D47-D26)","v":{"$error":"#VALUE!"}},"€"]
[]
["Für einen auf 20 Jahre gemittelten Engergiepreis"]
["ergibt sich eine Amortisationszeit von: ",null,null,{"$f":"IF((D86/D84)<0,\"sofort\",(D86/D84))","v":{"$error":"#VALUE!"}},{"$f":"IF((D86/D84)<0,\"\",\"Jahren\")","v":{"$error":"#VALUE!"}}]

{"sheet":"SW2 bival GAS","index":27,"n_rows":90,"n_cols":18,"rows_kept":90,"cut":false,"hidden":false,"merged":[[48,16,51,16],[49,17,51,17]]}
["Aktueller Gaspreis",null,null,{"$f":"(Energiepreisberechnung!D28)","v":5.5E-2},"€/kWh"]
["Aktueller Strompreis",null,null,{"$f":"(Energiepreisberechnung!D31)","v":0.2},"€/kWh"]
["Gemittelter Wirkungsgrad Gasbrennwertgerät",null,null,1.06]
["Gemittelter Wirkungsgrad GAWP SW",null,null,1.55]
["Elektr. Leistung GAWP SW",null,null,0.47,"kW"]
["Elektr. Leistung Kesselkreispumpe",null,null,0.06,"kW"]
["Elektr. Leistung Umwälzpumpe GAWP",null,null,0.05,"kW"]
[]
["Gesucht:","Investitions- und Betriebskosten während 20 Jahren"]
[]
["1."]
["Errechnung der mittleren Energiepreise binnen 20 Jahren"]
[]
["Gaspreis Anfangsjahr:",null,null,{"$f":"(D1)","v":5.5E-2},"€/kWh"]
["Gaspreis im 20´sten Jahr:",null,null,{"$f":"(Energiepreisberechnung!C22)","v":0.19890901442685968},"€/kWh"]
["Mittlerer Gaspreis während 20 Jahren:",null,null,{"$f":"(Energiepreisberechnung!C24)","v":0.11273760388338561},"€/kWh"]
[]
["Strompreis Anfangsjahr:",null,null,{"$f":"(D2)","v":0.2},"€/kWh"]
["Strompreis im 20´sten Jahr:",null,null,{"$f":"(Energiepreisberechnung!E22)","v":0.72330550700676266},"€/kWh"]
["Mittlerer Strompreis während 20 Jahren:",null,null,{"$f":"(Energiepreisberechnung!E24)","v":0.40995492321231131},"€/kWh"]
[]
["2."]
["Betrachtung für ein neues Gasbrennwertgerät",null,null,{"$f":"(Master!D5)","v":40},"kW"]
[]
["2a"]
["Investitionskosten",null,null,{"$f":"(Master!D8)","v":5000},"€"]
["Investitionskosten gesamt: ",null,null,{"$f":"(D26)","v":5000},"€",null,null,null,"R_I_GAS"]
[]
["2b"]
["Betriebskosten Gas-Brennwertgerät"]
["Jahresarbeit Gas-Brennwertgerät",null,null,{"$f":"(Master!D5*Master!D6)","v":80000},"kWh/a","(Leistung x Jahresvollbenutzungsstunden)"]
["Energieverbrauch Gas-Brennwertgerät",null,null,{"$f":"(D31/D3)","v":75471.698113207545},"kWh/a","(Wirkungsgrad berücksichtigt)",null,null,"R_B_GAS"]
["Kosten Gas",null,null,{"$f":"(D32*D16)","v":8508.4984062932526},"€/a"]
["Wartungskosten Gas-Brennwertgerät",null,null,300,"€/a",null,null,null,"R_B_WART_GAS"]
["Stromverbrauch 1 Stück Kesselkreispumpe",null,null,{"$f":"(Master!D6*D7)","v":100},"kWh/a",null,null,null,"R_B_STROM_GAS"]
["Stromkosten 1 Stück Kesselkreispumpe",null,null,{"$f":"(D35*D20)","v":40.995492321231133},"€/a","(Stromverbrauch x mittlerer Strompreis)"]
[]
["Betriebskosten pro Jahr gesamt:",null,null,{"$f":"SUM(D33:D34)+D36","v":8849.4938986144844},"€/a"]
[null,null,null,null,null,null,null,null,null,null,null,"Negative Werte sollen gleich Null gesetzt werden"]
["3.",null,null,null,null,null,null,null,null,null,null,{"$f":"(Master!D5-D53)","v":0}]
["Betrachtung für zwei GAWP 40 SW (80 kW) sowie Spitzenlastkessel"]
[null,null,null,null,null,null,null,null,null,null,null,"Wärmepumpe soll nur die Anlagenheizlast erbringen, welche erforderlich ist"]
["3a",null,null,null,null,null,null,null,null,null,null,{"$f":"IF(Master!D5<80,Master!D5,80)","v":40}]
["Investitionskosten"]
["2 x GAWP + Zubehör",null,null,{"$f":"IF(Master!T12=TRUE,25000, (IF(Master!T13=TRUE,45000, (IF(Master!T14=TRUE,65000,\"\")))))","v":""},"€",null,null,null,null,null,null,"Deckungsrate GAWP"]
["Förderung BAFA",null,null,{"$f":"IF(Master!$T$12=TRUE,(2400+100*30), (IF(Master!$T$13=TRUE,(2400+100*70), (IF(Master!$T$14=TRUE,(2400+100*110),\"\")))))","v":""},"€",null,null,null,null,null,null,{"$f":"(D52+D53)","v":40},"Max Leistung BW plus Leistung GAWP"]
[{"$f":"IF(AND(Master!D5>29,Master!D5<55),Spitzenlastkessel!C4,(IF(AND(Master!D5>54,Master!D5<65),Spitzenlastkessel!C5,(IF(AND(Master!D5>64,Master!D5<85),Spitzenlastkessel!C6,(IF(AND(Master!D5>84,Master!D5<110),Spitzenlastkessel!C7,(IF(AND(Master!D5>109,Master!D5<135),Spitzenlastkessel!C8,(IF(AND(Master!D5>134,Master!D5<150),Spitzenlastkessel!C9,(IF(AND(Master!D5>149,Master!D5<200),Spitzenlastkessel!C10,(IF(AND(Master!D5>199,Master!D5<240),Spitzenlastkessel!C11,(IF(AND(Master!D5>239,Master!D5<300),Spitzenlastkessel!C12,(IF(AND(Master!D5>299,Master!D5<370),Spitzenlastkessel!C13,(IF(AND(Master!D5>369,Master!D5<450),Spitzenlastkessel!C14,(IF(AND(Master!D5>449,Master!D5<520),Spitzenlastkessel!C15,\"Anlagenheizlast zu groß\")))))))))))))))))))))))","v":"Spitzenlastkessel GMR 3035 (35 kW)"},null,null,{"$f":"IF(AND(Master!D5>29,Master!D5<55),Spitzenlastkessel!E4,(IF(AND(Master!D5>54,Master!D5<65),Spitzenlastkessel!E5,(IF(AND(Master!D5>64,Master!D5<85),Spitzenlastkessel!E6,(IF(AND(Master!D5>84,Master!D5<110),Spitzenlastkessel!E7,(IF(AND(Master!D5>109,Master!D5<135),Spitzenlastkessel!E8,(IF(AND(Master!D5>134,Master!D5<150),Spitzenlastkessel!E9,(IF(AND(Master!D5>149,Master!D5<200),Spitzenlastkessel!E10,(IF(AND(Master!D5>199,Master!D5<240),Spitzenlastkessel!E11,(IF(AND(Master!D5>239,Master!D5<300),Spitzenlastkessel!E12,(IF(AND(Master!D5>299,Master!D5<370),Spitzenlastkessel!E13,(IF(AND(Master!D5>369,Master!D5<450),Spitzenlastkessel!E14,(IF(AND(Master!D5>449,Master!D5<520),Spitzenlastkessel!E15,\"Anlagenheizlast zu groß\")))))))))))))))))))))))","v":3600},"€","(gewählt)",null,null,null,null,null,{"$f":"(100/L46)*D53","v":100},"Prozentuale Anlagenheizlast von GAWP"]
["Investitionskosten gesamt: ",null,null,{"$f":"(D45+D47-D46)","v":{"$error":"#VALUE!"}},"€",null,null,null,"N_I_GAWP_u_BW",null,null,{"$f":"MROUND(L47,5)","v":100},"Gerundet"]
[null,null,null,null,null,null,null,null,null,null,null,null,null,null,null,null,"Prozentuale \nAnlagen-\nheizlast \nder GAWP"]
["3b",null,null,null,null,null,null,null,null,null,null,{"$f":"VLOOKUP(L48,Q53:R80,2)","v":100},"Deckungsrate GAWP",null,null,null,null,"Deckungs-\nrate"]
["Betriebskosten"]
["Max. Leistung Brennwertgerät",null,null,{"$f":"IF(L40<0,0,(Master!D5-D53))","v":0},"kW"]
["Leistung 2 x GAWP",null,null,{"$f":"(L43)","v":40},"kW",null,null,null,null,null,null,null,null,null,null,null,0,0]
[null,null,null,null,null,null,null,null,null,null,null,null,null,null,null,null,5,8]
["Deckungsrate Brennwertgerät",null,null,{"$f":"(100-D56)","v":0},"%","(Ergibt sich aus Leistungsverhältnis Brennwertgerät/GAWP)",null,null,null,null,null,null,null,null,null,null,10,15]
["Deckungsrate 2 x GAWP",null,null,{"$f":"VLOOKUP(L48,Q53:R80,2)","v":100},"%","(Ergibt sich aus Leistungsverhältnis Brennwertgerät/GAWP)",null,null,null,null,null,null,null,null,null,null,15,25]
[null,null,null,null,null,null,null,null,null,null,null,null,null,null,null,null,20,33]
["Jahresarbeit Gas-Brennwertgerät",null,null,{"$f":"(D31*(D55/100))","v":0},"kWh/a","(Deckungsrate berücksichtigt)"]
["Jahresarbeit 2 x GAWP",null,null,{"$f":"(D31*(D56/100))","v":80000},"kWh/a","(Deckungsrate berücksichtigt)",null,null,null,null,null,null,null,null,null,null,25,41]
[null,null,null,null,null,null,null,null,null,null,null,null,null,null,null,null,30,50]
["Vollbenutzungsstunden Gas-Brennwertgerät",null,null,{"$f":"IF(D52=0,0,(D58/D52))","v":0},"h","(ergibt sich aus Jahresarbeit/Leistung)"]
["Vollbenutzungsstunden 2 x GAWP",null,null,{"$f":"(D59/D53)","v":2000},"h","(ergibt sich aus Jahresarbeit/Leistung)",null,null,null,null,null,null,null,null,null,null,35,58]
[null,null,null,null,null,null,null,null,null,null,null,null,null,null,null,null,40,67]
["Gasverbrauch Gas-Brennwertgerät",null,null,{"$f":"(D58/D3)","v":0},"kWh/a","(ergibt sich aus Jahresarbeit/Wirkungsgrad)",null,null,"N_B_GAS_BW"]
["Gasverbrauch 2 x GAWP",null,null,{"$f":"(D59/D4)","v":51612.903225806447},"kWh/a","(ergibt sich aus Jahresarbeit/Wirkungsgrad)",null,null,"N_B_GAS_GAWP",null,null,null,null,null,null,null,45,75]
[null,null,null,null,null,null,null,null,null,null,null,null,null,null,null,null,50,80]
["Kosten Gasverbrauch Gas-Brennwertgerät",null,null,{"$f":"(D64*D16)","v":0},"€/a","(ergibt sich aus Gasverbrauch x mittlerer Gaspreis)"]
["Kosten Gasverbrauch 2 x GAWP",null,null,{"$f":"(D65*D16)","v":5818.7150391424821},"€/a","(ergibt sich aus Gasverbrauch x mittlerer Gaspreis)",null,null,null,null,null,null,null,null,null,null,55,83]
[null,null,null,null,null,null,null,null,null,null,null,null,null,null,null,null,60,87]
["Wartungskosten Gas-Brennwertgerät",null,null,300,"€/a",null,null,null,"N_B_WART_BW"]
["Wartungskosten 2 x GAWP",null,null,500,"€/a",null,null,null,"N_B_WART_GAWP",null,null,null,null,null,null,null,65,90]
[null,null,null,null,null,null,null,null,null,null,null,null,null,null,null,null,70,92]
["Stromverbrauch 2 x GAWP",null,null,{"$f":"(D62*D5)*2","v":1880},"kWh/a",null,null,null,"N_B_STROM_LÜ_GAWP",null,null,null,null,null,null,null,75,94]
["Stromkosten 2 x GAWP",null,null,{"$f":"(D73*D20)","v":770.71525563914531},"€/a","(Stromverbrauch x mittlerer Strompreis)",null,null,null,null,null,null,null,null,null,null,80,96]
["Stromverbrauch Gas-Brennwertgerät",null,null,{"$f":"(D61*D6)","v":0},"kWh/a",null,null,null,"N_B_STROM_BW"]
["Stromkosten Gas-Brennwertgerät",null,null,{"$f":"(D75*D20)","v":0},"€/a","(Stromverbrauch x mittlerer Strompreis)"]
["Stromverbrauch 4 x Umwälzpumpe GAWP",null,null,{"$f":"((D62)*D7*4)","v":400},"kWh/a",null,null,null,"N_B_STROM_PU_GAWP",null,null,null,null,null,null,null,85,97]
["Stromkosten 4 x Umwälzpumpe GAWP",null,null,{"$f":"(D77*D20)","v":163.98196928492453},"€/a","(Stromverbrauch x mittlerer Strompreis)",null,null,null,null,null,null,null,null,null,null,90,98]
[null,null,null,null,null,null,null,null,null,null,null,null,null,null,null,null,95,99]
["Betriebskosten pro Jahr gesamt:",null,null,{"$f":"SUM(D67:D71)+D78+D74+D76","v":7553.4122640665519},"€/a",null,null,null,null,null,null,null,null,null,null,null,100,100]
[]
["FAZIT:"]
["Mittlere Energieeinsparung pro Jahr bei Einsatz"]
["von zwei GAWP SW und Gas-Brennwertgerät"]
["gegenüber \"nur Gas-Brennwert\":",null,null,{"$f":"(D38-D80)","v":1296.0816345479325},"€/a"]
[]
["Differenz Investitionskosten:",null,null,{"$f":"(D48-D27)","v":{"$error":"#VALUE!"}},"€"]
[]
["Für einen auf 20 Jahre gemittelten Engergiepreis"]
["ergibt sich eine Amortisationszeit von: ",null,null,{"$f":"IF((D87/D85)<0,\"sofort\",(D87/D85))","v":{"$error":"#VALUE!"}},{"$f":"IF((D87/D85)<0,\"\",\"Jahren\")","v":{"$error":"#VALUE!"}}]

{"sheet":"SW3 bival GAS","index":28,"n_rows":90,"n_cols":18,"rows_kept":90,"cut":false,"hidden":false,"merged":[[48,16,51,16],[49,17,51,17]]}
["Aktueller Gaspreis",null,null,{"$f":"(Energiepreisberechnung!D28)","v":5.5E-2},"€/kWh"]
["Aktueller Strompreis",null,null,{"$f":"(Energiepreisberechnung!D31)","v":0.2},"€/kWh"]
["Gemittelter Wirkungsgrad Gasbrennwertgerät",null,null,1.06]
["Gemittelter Wirkungsgrad GAWP SW",null,null,1.55]
["Elektr. Leistung GAWP SW",null,null,0.47,"kW"]
["Elektr. Leistung Kesselkreispumpe",null,null,0.1,"kW"]
["Elektr. Leistung Umwälzpumpe GAWP",null,null,0.05,"kW"]
[]
["Gesucht:","Investitions- und Betriebskosten während 20 Jahren"]
[]
["1."]
["Errechnung der mittleren Energiepreise binnen 20 Jahren"]
[]
["Gaspreis Anfangsjahr:",null,null,{"$f":"(D1)","v":5.5E-2},"€/kWh"]
["Gaspreis im 20´sten Jahr:",null,null,{"$f":"(Energiepreisberechnung!C22)","v":0.19890901442685968},"€/kWh"]
["Mittlerer Gaspreis während 20 Jahren:",null,null,{"$f":"(Energiepreisberechnung!C24)","v":0.11273760388338561},"€/kWh"]
[]
["Strompreis Anfangsjahr:",null,null,{"$f":"(D2)","v":0.2},"€/kWh"]
["Strompreis im 20´sten Jahr:",null,null,{"$f":"(Energiepreisberechnung!E22)","v":0.72330550700676266},"€/kWh"]
["Mittlerer Strompreis während 20 Jahren:",null,null,{"$f":"(Energiepreisberechnung!E24)","v":0.40995492321231131},"€/kWh"]
[]
["2."]
["Betrachtung für ein neues Gasbrennwertgerät",null,null,{"$f":"(Master!D5)","v":40},"kW"]
[]
["2a"]
["Investitionskosten",null,null,{"$f":"(Master!D8)","v":5000},"€"]
["Investitionskosten gesamt: ",null,null,{"$f":"(D26)","v":5000},"€",null,null,null,"R_I_GAS"]
[]
["2b"]
["Betriebskosten Gas-Brennwertgerät"]
["Jahresarbeit Gas-Brennwertgerät",null,null,{"$f":"(Master!D5*Master!D6)","v":80000},"kWh/a","(Leistung x Jahresvollbenutzungsstunden)"]
["Energieverbrauch Gas-Brennwertgerät",null,null,{"$f":"(D31/D3)","v":75471.698113207545},"kWh/a","(Wirkungsgrad berücksichtigt)",null,null,"R_B_GAS"]
["Kosten Gas",null,null,{"$f":"(D32*D16)","v":8508.4984062932526},"€/a"]
["Wartungskosten Gas-Brennwertgerät",null,null,300,"€/a",null,null,null,"R_B_WART_GAS"]
["Stromverbrauch 1 Stück Kesselkreispumpe",null,null,{"$f":"(Master!D6*D6)","v":200},"kWh/a",null,null,null,"R_B_STROM_GAS"]
["Stromkosten 1 Stück Kesselkreispumpe",null,null,{"$f":"(D35*D20)","v":81.990984642462266},"€/a","(Stromverbrauch x mittlerer Strompreis)"]
[]
["Betriebskosten pro Jahr gesamt:",null,null,{"$f":"SUM(D33:D34)+D36","v":8890.4893909357143},"€/a"]
[null,null,null,null,null,null,null,null,null,null,null,"Negative Werte sollen gleich Null gesetzt werden"]
["3.",null,null,null,null,null,null,null,null,null,null,{"$f":"(Master!D5-D53)","v":0}]
["Betrachtung für drei GAWP 40 SW (120 kW) sowie Spitzenlastkessel"]
[null,null,null,null,null,null,null,null,null,null,null,"Wärmepumpe soll nur die Anlagenheizlast erbringen, welche erforderlich ist"]
["3a",null,null,null,null,null,null,null,null,null,null,{"$f":"IF(Master!D5<120,Master!D5,120)","v":40}]
["Investitionskosten"]
["3 x GAWP + Zubehör",null,null,{"$f":"IF(Master!T12=TRUE,25000, (IF(Master!T13=TRUE,45000, (IF(Master!T14=TRUE,65000,\"\")))))","v":""},"€",null,null,null,null,null,null,"Deckungsrate GAWP"]
["Förderung BAFA",null,null,{"$f":"IF(Master!$T$12=TRUE,(2400+100*30), (IF(Master!$T$13=TRUE,(2400+100*70), (IF(Master!$T$14=TRUE,(2400+100*110),\"\")))))","v":""},"€",null,null,null,null,null,null,{"$f":"(D52+D53)","v":40},"Max Leistung BW plus Leistung GAWP"]
[{"$f":"IF(AND(Master!D5>29,Master!D5<55),Spitzenlastkessel!C4,(IF(AND(Master!D5>54,Master!D5<65),Spitzenlastkessel!C5,(IF(AND(Master!D5>64,Master!D5<85),Spitzenlastkessel!C6,(IF(AND(Master!D5>84,Master!D5<110),Spitzenlastkessel!C7,(IF(AND(Master!D5>109,Master!D5<135),Spitzenlastkessel!C8,(IF(AND(Master!D5>134,Master!D5<150),Spitzenlastkessel!C9,(IF(AND(Master!D5>149,Master!D5<200),Spitzenlastkessel!C10,(IF(AND(Master!D5>199,Master!D5<240),Spitzenlastkessel!C11,(IF(AND(Master!D5>239,Master!D5<300),Spitzenlastkessel!C12,(IF(AND(Master!D5>299,Master!D5<370),Spitzenlastkessel!C13,(IF(AND(Master!D5>369,Master!D5<450),Spitzenlastkessel!C14,(IF(AND(Master!D5>449,Master!D5<520),Spitzenlastkessel!C15,\"Anlagenheizlast zu groß\")))))))))))))))))))))))","v":"Spitzenlastkessel GMR 3035 (35 kW)"},null,null,{"$f":"IF(AND(Master!D5>29,Master!D5<55),Spitzenlastkessel!E4,(IF(AND(Master!D5>54,Master!D5<65),Spitzenlastkessel!E5,(IF(AND(Master!D5>64,Master!D5<85),Spitzenlastkessel!E6,(IF(AND(Master!D5>84,Master!D5<110),Spitzenlastkessel!E7,(IF(AND(Master!D5>109,Master!D5<135),Spitzenlastkessel!E8,(IF(AND(Master!D5>134,Master!D5<150),Spitzenlastkessel!E9,(IF(AND(Master!D5>149,Master!D5<200),Spitzenlastkessel!E10,(IF(AND(Master!D5>199,Master!D5<240),Spitzenlastkessel!E11,(IF(AND(Master!D5>239,Master!D5<300),Spitzenlastkessel!E12,(IF(AND(Master!D5>299,Master!D5<370),Spitzenlastkessel!E13,(IF(AND(Master!D5>369,Master!D5<450),Spitzenlastkessel!E14,(IF(AND(Master!D5>449,Master!D5<520),Spitzenlastkessel!E15,\"Anlagenheizlast zu groß\")))))))))))))))))))))))","v":3600},"€","(gewählt)",null,null,null,null,null,{"$f":"(100/L46)*D53","v":100},"Prozentuale Anlagenheizlast von GAWP"]
["Investitionskosten gesamt: ",null,null,{"$f":"(D45+D47-D46)","v":{"$error":"#VALUE!"}},"€",null,null,null,"N_I_GAWP_u_BW",null,null,{"$f":"MROUND(L47,5)","v":100},"Gerundet"]
[null,null,null,null,null,null,null,null,null,null,null,null,null,null,null,null,"Prozentuale \nAnlagen-\nheizlast \nder GAWP"]
["3b",null,null,null,null,null,null,null,null,null,null,{"$f":"VLOOKUP(L48,Q53:R80,2)","v":100},"Deckungsrate GAWP",null,null,null,null,"Deckungs-\nrate"]
["Betriebskosten"]
["Max. Leistung Brennwertgerät",null,null,{"$f":"IF(L40<0,0,(Master!D5-D53))","v":0},"kW"]
["Leistung 3 x GAWP",null,null,{"$f":"(L43)","v":40},"kW",null,null,null,null,null,null,null,null,null,null,null,0,0]
[null,null,null,null,null,null,null,null,null,null,null,null,null,null,null,null,5,8]
["Deckungsrate Brennwertgerät",null,null,{"$f":"(100-D56)","v":0},"%","(Ergibt sich aus Leistungsverhältnis Brennwertgerät/GAWP)",null,null,null,null,null,null,null,null,null,null,10,15]
["Deckungsrate 3 x GAWP",null,null,{"$f":"VLOOKUP(L48,Q53:R80,2)","v":100},"%","(Ergibt sich aus Leistungsverhältnis Brennwertgerät/GAWP)",null,null,null,null,null,null,null,null,null,null,15,25]
[null,null,null,null,null,null,null,null,null,null,null,null,null,null,null,null,20,33]
["Jahresarbeit Gas-Brennwertgerät",null,null,{"$f":"(D31*(D55/100))","v":0},"kWh/a","(Deckungsrate berücksichtigt)"]
["Jahresarbeit 3 x GAWP",null,null,{"$f":"(D31*(D56/100))","v":80000},"kWh/a","(Deckungsrate berücksichtigt)",null,null,null,null,null,null,null,null,null,null,25,41]
[null,null,null,null,null,null,null,null,null,null,null,null,null,null,null,null,30,50]
["Vollbenutzungsstunden Gas-Brennwertgerät",null,null,{"$f":"IF(D52=0,0,(D58/D52))","v":0},"h","(ergibt sich aus Jahresarbeit/Leistung)"]
["Vollbenutzungsstunden 3 x GAWP",null,null,{"$f":"(D59/D53)","v":2000},"h","(ergibt sich aus Jahresarbeit/Leistung)",null,null,null,null,null,null,null,null,null,null,35,58]
[null,null,null,null,null,null,null,null,null,null,null,null,null,null,null,null,40,67]
["Gasverbrauch Gas-Brennwertgerät",null,null,{"$f":"(D58/D3)","v":0},"kWh/a","(ergibt sich aus Jahresarbeit/Wirkungsgrad)",null,null,"N_B_GAS_BW"]
["Gasverbrauch 3 x GAWP",null,null,{"$f":"(D59/D4)","v":51612.903225806447},"kWh/a","(ergibt sich aus Jahresarbeit/Wirkungsgrad)",null,null,"N_B_GAS_GAWP",null,null,null,null,null,null,null,45,75]
[null,null,null,null,null,null,null,null,null,null,null,null,null,null,null,null,50,80]
["Kosten Gasverbrauch Gas-Brennwertgerät",null,null,{"$f":"(D64*D16)","v":0},"€/a","(ergibt sich aus Gasverbrauch x mittlerer Gaspreis)"]
["Kosten Gasverbrauch 3 x GAWP",null,null,{"$f":"(D65*D16)","v":5818.7150391424821},"€/a","(ergibt sich aus Gasverbrauch x mittlerer Gaspreis)",null,null,null,null,null,null,null,null,null,null,55,83]
[null,null,null,null,null,null,null,null,null,null,null,null,null,null,null,null,60,87]
["Wartungskosten Gas-Brennwertgerät",null,null,300,"€/a",null,null,null,"N_B_WART_BW"]
["Wartungskosten 3 x GAWP",null,null,700,"€/a",null,null,null,"N_B_WART_GAWP",null,null,null,null,null,null,null,65,90]
[null,null,null,null,null,null,null,null,null,null,null,null,null,null,null,null,70,92]
["Stromverbrauch 3 x GAWP",null,null,{"$f":"(D62*D5)*3","v":2820},"kWh/a",null,null,null,"N_B_STROM_LÜ_GAWP",null,null,null,null,null,null,null,75,94]
["Stromkosten 3 x GAWP",null,null,{"$f":"(D73*D20)","v":1156.0728834587178},"€/a","(Stromverbrauch x mittlerer Strompreis)",null,null,null,null,null,null,null,null,null,null,80,96]
["Stromverbrauch Gas-Brennwertgerät",null,null,{"$f":"(D61*D6)","v":0},"kWh/a",null,null,null,"N_B_STROM_BW"]
["Stromkosten Gas-Brennwertgerät",null,null,{"$f":"(D75*D20)","v":0},"€/a","(Stromverbrauch x mittlerer Strompreis)"]
["Stromverbrauch 6 x Umwälzpumpe GAWP",null,null,{"$f":"((D62)*D7*6)","v":600},"kWh/a",null,null,null,"N_B_STROM_PU_GAWP",null,null,null,null,null,null,null,85,97]
["Stromkosten 6 x Umwälzpumpe GAWP",null,null,{"$f":"(D77*D20)","v":245.97295392738678},"€/a","(Stromverbrauch x mittlerer Strompreis)",null,null,null,null,null,null,null,null,null,null,90,98]
[null,null,null,null,null,null,null,null,null,null,null,null,null,null,null,null,95,99]
["Betriebskosten pro Jahr gesamt:",null,null,{"$f":"SUM(D67:D71)+D78+D74+D76","v":8220.7608765285859},"€/a",null,null,null,null,null,null,null,null,null,null,null,100,100]
[]
["FAZIT:"]
["Mittlere Energieeinsparung pro Jahr bei Einsatz"]
["von drei GAWP SW und Gas-Brennwertgerät"]
["gegenüber \"nur Gas-Brennwert\":",null,null,{"$f":"(D38-D80)","v":669.72851440712839},"€/a"]
[]
["Differenz Investitionskosten:",null,null,{"$f":"(D48-D27)","v":{"$error":"#VALUE!"}},"€"]
[]
["Für einen auf 20 Jahre gemittelten Engergiepreis"]
["ergibt sich eine Amortisationszeit von: ",null,null,{"$f":"IF((D87/D85)<0,\"sofort\",(D87/D85))","v":{"$error":"#VALUE!"}},{"$f":"IF((D87/D85)<0,\"\",\"Jahren\")","v":{"$error":"#VALUE!"}}]

{"sheet":"SW bival FLGAS","index":29,"n_rows":89,"n_cols":18,"rows_kept":89,"cut":false,"hidden":false,"merged":[[47,16,50,16],[48,17,50,17]]}
["Aktueller Flüssiggaspreis",null,null,{"$f":"(Energiepreisberechnung!D29)","v":7.0000000000000007E-2},"€/kWh"]
["Aktueller Strompreis",null,null,{"$f":"(Energiepreisberechnung!D31)","v":0.2},"€/kWh"]
["Gemittelter Wirkungsgrad Gasbrennwertgerät",null,null,1.06]
["Gemittelter Wirkungsgrad GAWP SW",null,null,1.55]
["Elektr. Leistung GAWP SW",null,null,0.47,"kW"]
["Elektr. Leistung Kesselkreispumpe",null,null,0.05,"kW"]
[]
["Gesucht:","Investitions- und Betriebskosten während 20 Jahren"]
[]
["1."]
["Errechnung der mittleren Energiepreise binnen 20 Jahren"]
[]
["Flüssiggaspreis Anfangsjahr:",null,null,{"$f":"(D1)","v":7.0000000000000007E-2},"€/kWh"]
["Flüssiggaspreis im 20´sten Jahr:",null,null,{"$f":"(Energiepreisberechnung!D22)","v":0.25315692745236701},"€/kWh"]
["Mittlerer Flüssiggaspreis während 20 Jahren:",null,null,{"$f":"(Energiepreisberechnung!D24)","v":0.14348422312430903},"€/kWh"]
[]
["Strompreis Anfangsjahr:",null,null,{"$f":"(D2)","v":0.2},"€/kWh"]
["Strompreis im 20´sten Jahr:",null,null,{"$f":"(Energiepreisberechnung!E22)","v":0.72330550700676266},"€/kWh"]
["Mittlerer Strompreis während 20 Jahren:",null,null,{"$f":"(Energiepreisberechnung!E24)","v":0.40995492321231131},"€/kWh"]
[]
["2."]
["Betrachtung für ein neues Gasbrennwertgerät",null,null,{"$f":"(Master!D5)","v":40},"kW"]
[]
["2a"]
["Investitionskosten",null,null,{"$f":"(Master!D8)","v":5000},"€"]
["Investitionskosten gesamt: ",null,null,{"$f":"(D25)","v":5000},"€",null,null,null,"R_I_GAS"]
[]
["2b"]
["Betriebskosten Gas-Brennwertgerät"]
["Jahresarbeit Gas-Brennwertgerät",null,null,{"$f":"(Master!D5*Master!D6)","v":80000},"kWh/a","(Leistung x Jahresvollbenutzungsstunden)"]
["Energieverbrauch Gas-Brennwertgerät",null,null,{"$f":"(D30/D3)","v":75471.698113207545},"kWh/a","(Wirkungsgrad berücksichtigt)",null,null,"R_B_FLGAS"]
["Kosten Flüssiggas",null,null,{"$f":"(D31*D15)","v":10828.997971645964},"€/a"]
["Wartungskosten Gas-Brennwertgerät",null,null,300,"€/a",null,null,null,"R_B_WART_GAS"]
["Stromverbrauch 1 Stück Kesselkreispumpe",null,null,{"$f":"(Master!D6*D6)","v":100},"kWh/a",null,null,null,"R_B_STROM_GAS"]
["Stromkosten 1 Stück Kesselkreispumpe",null,null,{"$f":"(D34*D19)","v":40.995492321231133},"€/a","(Stromverbrauch x mittlerer Strompreis)"]
[]
["Betriebskosten pro Jahr gesamt:",null,null,{"$f":"SUM(D32:D33)+D35","v":11169.993463967196},"€/a"]
[null,null,null,null,null,null,null,null,null,null,null,"Negative Werte sollen gleich Null gesetzt werden"]
["3.",null,null,null,null,null,null,null,null,null,null,{"$f":"(Master!D5-D52)","v":0}]
["Betrachtung für eine GAWP 40 SW (40 kW) sowie Spitzenlastkessel"]
[null,null,null,null,null,null,null,null,null,null,null,"Wärmepumpe soll nur die Anlagenheizlast erbringen, welche erforderlich ist"]
["3a",null,null,null,null,null,null,null,null,null,null,{"$f":"IF(Master!D5<40,Master!D5,40)","v":40}]
["Investitionskosten"]
["GAWP + Zubehör",null,null,{"$f":"IF(Master!T12=TRUE,25000, (IF(Master!T13=TRUE,45000, (IF(Master!T14=TRUE,65000,\"\")))))","v":""},"€",null,null,null,null,null,null,"Deckungsrate GAWP"]
["Förderung BAFA",null,null,{"$f":"IF(Master!$T$12=TRUE,(2400+100*30), (IF(Master!$T$13=TRUE,(2400+100*70), (IF(Master!$T$14=TRUE,(2400+100*110),\"\")))))","v":""},"€",null,null,null,null,null,null,{"$f":"(D51+D52)","v":40},"Max Leistung BW plus Leistung GAWP"]
[{"$f":"IF(AND(Master!D5>29,Master!D5<55),Spitzenlastkessel!C4,(IF(AND(Master!D5>54,Master!D5<65),Spitzenlastkessel!C5,(IF(AND(Master!D5>64,Master!D5<85),Spitzenlastkessel!C6,(IF(AND(Master!D5>84,Master!D5<110),Spitzenlastkessel!C7,(IF(AND(Master!D5>109,Master!D5<135),Spitzenlastkessel!C8,(IF(AND(Master!D5>134,Master!D5<150),Spitzenlastkessel!C9,(IF(AND(Master!D5>149,Master!D5<200),Spitzenlastkessel!C10,(IF(AND(Master!D5>199,Master!D5<240),Spitzenlastkessel!C11,(IF(AND(Master!D5>239,Master!D5<300),Spitzenlastkessel!C12,(IF(AND(Master!D5>299,Master!D5<370),Spitzenlastkessel!C13,(IF(AND(Master!D5>369,Master!D5<450),Spitzenlastkessel!C14,(IF(AND(Master!D5>449,Master!D5<520),Spitzenlastkessel!C15,\"Anlagenheizlast zu groß\")))))))))))))))))))))))","v":"Spitzenlastkessel GMR 3035 (35 kW)"},null,null,{"$f":"IF(AND(Master!D5>29,Master!D5<55),Spitzenlastkessel!E4,(IF(AND(Master!D5>54,Master!D5<65),Spitzenlastkessel!E5,(IF(AND(Master!D5>64,Master!D5<85),Spitzenlastkessel!E6,(IF(AND(Master!D5>84,Master!D5<110),Spitzenlastkessel!E7,(IF(AND(Master!D5>109,Master!D5<135),Spitzenlastkessel!E8,(IF(AND(Master!D5>134,Master!D5<150),Spitzenlastkessel!E9,(IF(AND(Master!D5>149,Master!D5<200),Spitzenlastkessel!E10,(IF(AND(Master!D5>199,Master!D5<240),Spitzenlastkessel!E11,(IF(AND(Master!D5>239,Master!D5<300),Spitzenlastkessel!E12,(IF(AND(Master!D5>299,Master!D5<370),Spitzenlastkessel!E13,(IF(AND(Master!D5>369,Master!D5<450),Spitzenlastkessel!E14,(IF(AND(Master!D5>449,Master!D5<520),Spitzenlastkessel!E15,\"Anlagenheizlast zu groß\")))))))))))))))))))))))","v":3600},"€","(gewählt)",null,null,null,null,null,{"$f":"(100/L45)*D52","v":100},"Prozentuale Anlagenheizlast von GAWP"]
["Investitionskosten gesamt: ",null,null,{"$f":"(D44+D46-D45)","v":{"$error":"#VALUE!"}},"€",null,null,null,"N_I_GAWP_u_BW",null,null,{"$f":"MROUND(L46,5)","v":100},"Gerundet"]
[null,null,null,null,null,null,null,null,null,null,null,null,null,null,null,null,"Prozentuale \nAnlagen-\nheizlast \nder GAWP"]
["3b",null,null,null,null,null,null,null,null,null,null,{"$f":"VLOOKUP(L47,Q52:R79,2)","v":100},"Deckungsrate GAWP",null,null,null,null,"Deckungs-\nrate"]
["Betriebskosten"]
["Max. Leistung Brennwertgerät",null,null,{"$f":"IF(L39<0,0,(Master!D5-D52))","v":0},"kW"]
["Leistung GAWP",null,null,{"$f":"(L42)","v":40},"kW",null,null,null,null,null,null,null,null,null,null,null,0,0]
[null,null,null,null,null,null,null,null,null,null,null,null,null,null,null,null,5,8]
["Deckungsrate Brennwertgerät",null,null,{"$f":"(100-D55)","v":0},"%","(Ergibt sich aus Leistungsverhältnis Brennwertgerät/GAWP)",null,null,null,null,null,null,null,null,null,null,10,15]
["Deckungsrate GAWP",null,null,{"$f":"VLOOKUP(L47,Q52:R79,2)","v":100},"%","(Ergibt sich aus Leistungsverhältnis Brennwertgerät/GAWP)",null,null,null,null,null,null,null,null,null,null,15,25]
[null,null,null,null,null,null,null,null,null,null,null,null,null,null,null,null,20,33]
["Jahresarbeit Gas-Brennwertgerät",null,null,{"$f":"(D30*(D54/100))","v":0},"kWh/a","(Deckungsrate berücksichtigt)"]
["Jahresarbeit GAWP",null,null,{"$f":"(D30*(D55/100))","v":80000},"kWh/a","(Deckungsrate berücksichtigt)",null,null,null,null,null,null,null,null,null,null,25,41]
[null,null,null,null,null,null,null,null,null,null,null,null,null,null,null,null,30,50]
["Vollbenutzungsstunden Gas-Brennwertgerät",null,null,{"$f":"IF(D51=0,0,(D57/D51))","v":0},"h","(ergibt sich aus Jahresarbeit/Leistung)"]
["Vollbenutzungsstunden GAWP",null,null,{"$f":"(D58/D52)","v":2000},"h","(ergibt sich aus Jahresarbeit/Leistung)",null,null,null,null,null,null,null,null,null,null,35,58]
[null,null,null,null,null,null,null,null,null,null,null,null,null,null,null,null,40,67]
["Flüssiggasverbrauch Gas-Brennwertgerät",null,null,{"$f":"(D57/D3)","v":0},"kWh/a","(ergibt sich aus Jahresarbeit/Wirkungsgrad)",null,null,"N_B_FLGAS_BW"]
["Flüssiggasverbrauch GAWP",null,null,{"$f":"(D58/D4)","v":51612.903225806447},"kWh/a","(ergibt sich aus Jahresarbeit/Wirkungsgrad)",null,null,"N_B_FLGAS_GAWP",null,null,null,null,null,null,null,45,75]
[null,null,null,null,null,null,null,null,null,null,null,null,null,null,null,null,50,80]
["Kosten Flüssiggasverbrauch Gas-Brennwertgerät",null,null,{"$f":"(D63*D15)","v":0},"€/a","(ergibt sich aus Flüssiggasverbrauch x mittlerer Flüssiggaspreis)"]
["Kosten Flüssiggasverbrauch GAWP",null,null,{"$f":"(D64*D15)","v":7405.6373225449815},"€/a","(ergibt sich aus Flüssiggasverbrauch x mittlerer Flüssiggaspreis)",null,null,null,null,null,null,null,null,null,null,55,83]
[null,null,null,null,null,null,null,null,null,null,null,null,null,null,null,null,60,87]
["Wartungskosten Gas-Brennwertgerät",null,null,300,"€/a",null,null,null,"N_B_WART_BW"]
["Wartungskosten GAWP",null,null,300,"€/a",null,null,null,"N_B_WART_GAWP",null,null,null,null,null,null,null,65,90]
[null,null,null,null,null,null,null,null,null,null,null,null,null,null,null,null,70,92]
["Stromverbrauch GAWP",null,null,{"$f":"(D61*D5)","v":940},"kWh/a",null,null,null,"N_B_STROM_LÜ_GAWP",null,null,null,null,null,null,null,75,94]
["Stromkosten GAWP",null,null,{"$f":"(D72*D19)","v":385.35762781957266},"€/a","(Stromverbrauch x mittlerer Strompreis)",null,null,null,null,null,null,null,null,null,null,80,96]
["Stromverbrauch Gas-Brennwertgerät",null,null,{"$f":"(D60*D6)","v":0},"kWh/a",null,null,null,"N_B_STROM_BW"]
["Stromkosten Gas-Brennwertgerät",null,null,{"$f":"(D74*D19)","v":0},"€/a","(Stromverbrauch x mittlerer Strompreis)"]
["Stromverbrauch 2 x Umwälzpumpe GAWP",null,null,{"$f":"((D61)*D6*2)","v":200},"kWh/a",null,null,null,"N_B_STROM_PU_GAWP",null,null,null,null,null,null,null,85,97]
["Stromkosten 2 x Umwälzpumpe GAWP",null,null,{"$f":"(D76*D19)","v":81.990984642462266},"€/a","(Stromverbrauch x mittlerer Strompreis)",null,null,null,null,null,null,null,null,null,null,90,98]
[null,null,null,null,null,null,null,null,null,null,null,null,null,null,null,null,95,99]
["Betriebskosten pro Jahr gesamt:",null,null,{"$f":"SUM(D66:D70)+D77+D73+D75","v":8472.9859350070165},"€/a",null,null,null,null,null,null,null,null,null,null,null,100,100]
[]
["FAZIT:"]
["Mittlere Energieeinsparung pro Jahr bei Einsatz"]
["von einer GAWP SW und Gas-Brennwertgerät"]
["gegenüber \"nur Gas-Brennwert\" (Flüssiggas):",null,null,{"$f":"(D37-D79)","v":2697.0075289601791},"€/a"]
[]
["Differenz Investitionskosten:",null,null,{"$f":"(D47-D26)","v":{"$error":"#VALUE!"}},"€"]
[]
["Für einen auf 20 Jahre gemittelten Engergiepreis"]
["ergibt sich eine Amortisationszeit von: ",null,null,{"$f":"IF((D86/D84)<0,\"sofort\",(D86/D84))","v":{"$error":"#VALUE!"}},{"$f":"IF((D86/D84)<0,\"\",\"Jahren\")","v":{"$error":"#VALUE!"}}]

{"sheet":"SW2 bival FLGAS","index":30,"n_rows":90,"n_cols":18,"rows_kept":90,"cut":false,"hidden":false,"merged":[[48,16,51,16],[49,17,51,17]]}
["Aktueller Flüssiggaspreis",null,null,{"$f":"(Energiepreisberechnung!D29)","v":7.0000000000000007E-2},"€/kWh"]
["Aktueller Strompreis",null,null,{"$f":"(Energiepreisberechnung!D31)","v":0.2},"€/kWh"]
["Gemittelter Wirkungsgrad Gasbrennwertgerät",null,null,1.06]
["Gemittelter Wirkungsgrad GAWP SW",null,null,1.55]
["Elektr. Leistung GAWP SW",null,null,0.47,"kW"]
["Elektr. Leistung Kesselkreispumpe",null,null,0.06,"kW"]
["Elektr. Leistung Umwälzpumpe GAWP",null,null,0.05,"kW"]
[]
["Gesucht:","Investitions- und Betriebskosten während 20 Jahren"]
[]
["1."]
["Errechnung der mittleren Energiepreise binnen 20 Jahren"]
[]
["Flüssiggaspreis Anfangsjahr:",null,null,{"$f":"(D1)","v":7.0000000000000007E-2},"€/kWh"]
["Flüssiggaspreis im 20´sten Jahr:",null,null,{"$f":"(Energiepreisberechnung!D22)","v":0.25315692745236701},"€/kWh"]
["Mittlerer Flüssiggaspreis während 20 Jahren:",null,null,{"$f":"(Energiepreisberechnung!D24)","v":0.14348422312430903},"€/kWh"]
[]
["Strompreis Anfangsjahr:",null,null,{"$f":"(D2)","v":0.2},"€/kWh"]
["Strompreis im 20´sten Jahr:",null,null,{"$f":"(Energiepreisberechnung!E22)","v":0.72330550700676266},"€/kWh"]
["Mittlerer Strompreis während 20 Jahren:",null,null,{"$f":"(Energiepreisberechnung!E24)","v":0.40995492321231131},"€/kWh"]
[]
["2."]
["Betrachtung für ein neues Gasbrennwertgerät",null,null,{"$f":"(Master!D5)","v":40},"kW"]
[]
["2a"]
["Investitionskosten",null,null,{"$f":"(Master!D8)","v":5000},"€"]
["Investitionskosten gesamt: ",null,null,{"$f":"(D26)","v":5000},"€",null,null,null,"R_I_GAS"]
[]
["2b"]
["Betriebskosten Gas-Brennwertgerät"]
["Jahresarbeit Gas-Brennwertgerät",null,null,{"$f":"(Master!D5*Master!D6)","v":80000},"kWh/a","(Leistung x Jahresvollbenutzungsstunden)"]
["Energieverbrauch Gas-Brennwertgerät",null,null,{"$f":"(D31/D3)","v":75471.698113207545},"kWh/a","(Wirkungsgrad berücksichtigt)",null,null,"R_B_FLGAS"]
["Kosten Flüssiggas",null,null,{"$f":"(D32*D16)","v":10828.997971645964},"€/a"]
["Wartungskosten Gas-Brennwertgerät",null,null,300,"€/a",null,null,null,"R_B_WART_GAS"]
["Stromverbrauch 1 Stück Kesselkreispumpe",null,null,{"$f":"(Master!D6*D6)","v":120},"kWh/a",null,null,null,"R_B_STROM_GAS"]
["Stromkosten 1 Stück Kesselkreispumpe",null,null,{"$f":"(D35*D20)","v":49.194590785477359},"€/a","(Stromverbrauch x mittlerer Strompreis)"]
[]
["Betriebskosten pro Jahr gesamt:",null,null,{"$f":"SUM(D33:D34)+D36","v":11178.192562431441},"€/a"]
[null,null,null,null,null,null,null,null,null,null,null,"Negative Werte sollen gleich Null gesetzt werden"]
["3.",null,null,null,null,null,null,null,null,null,null,{"$f":"(Master!D5-D53)","v":0}]
["Betrachtung für zwei GAWP 40 SW (80 kW) sowie Spitzenlastkessel"]
[null,null,null,null,null,null,null,null,null,null,null,"Wärmepumpe soll nur die Anlagenheizlast erbringen, welche erforderlich ist"]
["3a",null,null,null,null,null,null,null,null,null,null,{"$f":"IF(Master!D5<80,Master!D5,80)","v":40}]
["Investitionskosten"]
["2 x GAWP + Zubehör",null,null,{"$f":"IF(Master!T12=TRUE,25000, (IF(Master!T13=TRUE,45000, (IF(Master!T14=TRUE,65000,\"\")))))","v":""},"€",null,null,null,null,null,null,"Deckungsrate GAWP"]
["Förderung BAFA",null,null,{"$f":"IF(Master!$T$12=TRUE,(2400+100*30), (IF(Master!$T$13=TRUE,(2400+100*70), (IF(Master!$T$14=TRUE,(2400+100*110),\"\")))))","v":""},"€",null,null,null,null,null,null,{"$f":"(D52+D53)","v":40},"Max Leistung BW plus Leistung GAWP"]
[{"$f":"IF(AND(Master!D5>29,Master!D5<55),Spitzenlastkessel!C4,(IF(AND(Master!D5>54,Master!D5<65),Spitzenlastkessel!C5,(IF(AND(Master!D5>64,Master!D5<85),Spitzenlastkessel!C6,(IF(AND(Master!D5>84,Master!D5<110),Spitzenlastkessel!C7,(IF(AND(Master!D5>109,Master!D5<135),Spitzenlastkessel!C8,(IF(AND(Master!D5>134,Master!D5<150),Spitzenlastkessel!C9,(IF(AND(Master!D5>149,Master!D5<200),Spitzenlastkessel!C10,(IF(AND(Master!D5>199,Master!D5<240),Spitzenlastkessel!C11,(IF(AND(Master!D5>239,Master!D5<300),Spitzenlastkessel!C12,(IF(AND(Master!D5>299,Master!D5<370),Spitzenlastkessel!C13,(IF(AND(Master!D5>369,Master!D5<450),Spitzenlastkessel!C14,(IF(AND(Master!D5>449,Master!D5<520),Spitzenlastkessel!C15,\"Anlagenheizlast zu groß\")))))))))))))))))))))))","v":"Spitzenlastkessel GMR 3035 (35 kW)"},null,null,{"$f":"IF(AND(Master!D5>29,Master!D5<55),Spitzenlastkessel!E4,(IF(AND(Master!D5>54,Master!D5<65),Spitzenlastkessel!E5,(IF(AND(Master!D5>64,Master!D5<85),Spitzenlastkessel!E6,(IF(AND(Master!D5>84,Master!D5<110),Spitzenlastkessel!E7,(IF(AND(Master!D5>109,Master!D5<135),Spitzenlastkessel!E8,(IF(AND(Master!D5>134,Master!D5<150),Spitzenlastkessel!E9,(IF(AND(Master!D5>149,Master!D5<200),Spitzenlastkessel!E10,(IF(AND(Master!D5>199,Master!D5<240),Spitzenlastkessel!E11,(IF(AND(Master!D5>239,Master!D5<300),Spitzenlastkessel!E12,(IF(AND(Master!D5>299,Master!D5<370),Spitzenlastkessel!E13,(IF(AND(Master!D5>369,Master!D5<450),Spitzenlastkessel!E14,(IF(AND(Master!D5>449,Master!D5<520),Spitzenlastkessel!E15,\"Anlagenheizlast zu groß\")))))))))))))))))))))))","v":3600},"€","(gewählt)",null,null,null,null,null,{"$f":"(100/L46)*D53","v":100},"Prozentuale Anlagenheizlast von GAWP"]
["Investitionskosten gesamt: ",null,null,{"$f":"(D45+D47-D46)","v":{"$error":"#VALUE!"}},"€",null,null,null,"N_I_GAWP_u_BW",null,null,{"$f":"MROUND(L47,5)","v":100},"Gerundet"]
[null,null,null,null,null,null,null,null,null,null,null,null,null,null,null,null,"Prozentuale \nAnlagen-\nheizlast \nder GAWP"]
["3b",null,null,null,null,null,null,null,null,null,null,{"$f":"VLOOKUP(L48,Q53:R80,2)","v":100},"Deckungsrate GAWP",null,null,null,null,"Deckungs-\nrate"]
["Betriebskosten"]
["Max. Leistung Brennwertgerät",null,null,{"$f":"IF(L40<0,0,(Master!D5-D53))","v":0},"kW"]
["Leistung 2 x GAWP",null,null,{"$f":"(L43)","v":40},"kW",null,null,null,null,null,null,null,null,null,null,null,0,0]
[null,null,null,null,null,null,null,null,null,null,null,null,null,null,null,null,5,8]
["Deckungsrate Brennwertgerät",null,null,{"$f":"(100-D56)","v":0},"%","(Ergibt sich aus Leistungsverhältnis Brennwertgerät/GAWP)",null,null,null,null,null,null,null,null,null,null,10,15]
["Deckungsrate 2 x GAWP",null,null,{"$f":"VLOOKUP(L48,Q53:R80,2)","v":100},"%","(Ergibt sich aus Leistungsverhältnis Brennwertgerät/GAWP)",null,null,null,null,null,null,null,null,null,null,15,25]
[null,null,null,null,null,null,null,null,null,null,null,null,null,null,null,null,20,33]
["Jahresarbeit Gas-Brennwertgerät",null,null,{"$f":"(D31*(D55/100))","v":0},"kWh/a","(Deckungsrate berücksichtigt)"]
["Jahresarbeit 2 x GAWP",null,null,{"$f":"(D31*(D56/100))","v":80000},"kWh/a","(Deckungsrate berücksichtigt)",null,null,null,null,null,null,null,null,null,null,25,41]
[null,null,null,null,null,null,null,null,null,null,null,null,null,null,null,null,30,50]
["Vollbenutzungsstunden Gas-Brennwertgerät",null,null,{"$f":"IF(D52=0,0,(D58/D52))","v":0},"h","(ergibt sich aus Jahresarbeit/Leistung)"]
["Vollbenutzungsstunden 2 x GAWP",null,null,{"$f":"(D59/D53)","v":2000},"h","(ergibt sich aus Jahresarbeit/Leistung)",null,null,null,null,null,null,null,null,null,null,35,58]
[null,null,null,null,null,null,null,null,null,null,null,null,null,null,null,null,40,67]
["Flüssiggasverbrauch Gas-Brennwertgerät",null,null,{"$f":"(D58/D3)","v":0},"kWh/a","(ergibt sich aus Jahresarbeit/Wirkungsgrad)",null,null,"N_B_FLGAS_BW"]
["Flüssiggasverbrauch 2 x GAWP",null,null,{"$f":"(D59/D4)","v":51612.903225806447},"kWh/a","(ergibt sich aus Jahresarbeit/Wirkungsgrad)",null,null,"N_B_FLGAS_GAWP",null,null,null,null,null,null,null,45,75]
[null,null,null,null,null,null,null,null,null,null,null,null,null,null,null,null,50,80]
["Kosten Flüssiggasverbrauch Gas-Brennwertgerät",null,null,{"$f":"(D64*D16)","v":0},"€/a","(ergibt sich aus Flüssiggasverbrauch x mittlerer Flüssiggaspreis)"]
["Kosten Flüssiggasverbrauch 2 x GAWP",null,null,{"$f":"(D65*D16)","v":7405.6373225449815},"€/a","(ergibt sich aus Flüssiggasverbrauch x mittlerer Flüssiggaspreis)",null,null,null,null,null,null,null,null,null,null,55,83]
[null,null,null,null,null,null,null,null,null,null,null,null,null,null,null,null,60,87]
["Wartungskosten Gas-Brennwertgerät",null,null,300,"€/a",null,null,null,"N_B_WART_BW"]
["Wartungskosten 2 x GAWP",null,null,500,"€/a",null,null,null,"N_B_WART_GAWP",null,null,null,null,null,null,null,65,90]
[null,null,null,null,null,null,null,null,null,null,null,null,null,null,null,null,70,92]
["Stromverbrauch 2 x GAWP",null,null,{"$f":"(D62*D5)*2","v":1880},"kWh/a",null,null,null,"N_B_STROM_LÜ_GAWP",null,null,null,null,null,null,null,75,94]
["Stromkosten 2 x GAWP",null,null,{"$f":"(D73*D20)","v":770.71525563914531},"€/a","(Stromverbrauch x mittlerer Strompreis)",null,null,null,null,null,null,null,null,null,null,80,96]
["Stromverbrauch Gas-Brennwertgerät",null,null,{"$f":"(D61*D6)","v":0},"kWh/a",null,null,null,"N_B_STROM_BW"]
["Stromkosten Gas-Brennwertgerät",null,null,{"$f":"(D75*D20)","v":0},"€/a","(Stromverbrauch x mittlerer Strompreis)"]
["Stromverbrauch 4 x Umwälzpumpe GAWP",null,null,{"$f":"((D62)*D7*4)","v":400},"kWh/a",null,null,null,"N_B_STROM_PU_GAWP",null,null,null,null,null,null,null,85,97]
["Stromkosten 4 x Umwälzpumpe GAWP",null,null,{"$f":"(D77*D20)","v":163.98196928492453},"€/a","(Stromverbrauch x mittlerer Strompreis)",null,null,null,null,null,null,null,null,null,null,90,98]
[null,null,null,null,null,null,null,null,null,null,null,null,null,null,null,null,95,99]
["Betriebskosten pro Jahr gesamt:",null,null,{"$f":"SUM(D67:D71)+D78+D74+D76","v":9140.3345474690523},"€/a",null,null,null,null,null,null,null,null,null,null,null,100,100]
[]
["FAZIT:"]
["Mittlere Energieeinsparung pro Jahr bei Einsatz"]
["von zwei GAWP SW und Gas-Brennwertgerät"]
["gegenüber \"nur Gas-Brennwert\" (Flüssiggas):",null,null,{"$f":"(D38-D80)","v":2037.8580149623886},"€/a"]
[]
["Differenz Investitionskosten:",null,null,{"$f":"(D48-D27)","v":{"$error":"#VALUE!"}},"€"]
[]
["Für einen auf 20 Jahre gemittelten Engergiepreis"]
["ergibt sich eine Amortisationszeit von: ",null,null,{"$f":"IF((D87/D85)<0,\"sofort\",(D87/D85))","v":{"$error":"#VALUE!"}},{"$f":"IF((D87/D85)<0,\"\",\"Jahren\")","v":{"$error":"#VALUE!"}}]

{"sheet":"SW3 bival FLGAS","index":31,"n_rows":90,"n_cols":18,"rows_kept":90,"cut":false,"hidden":false,"merged":[[48,16,51,16],[49,17,51,17]]}
["Aktueller Flüssiggaspreis",null,null,{"$f":"(Energiepreisberechnung!D29)","v":7.0000000000000007E-2},"€/kWh"]
["Aktueller Strompreis",null,null,{"$f":"(Energiepreisberechnung!D31)","v":0.2},"€/kWh"]
["Gemittelter Wirkungsgrad Gasbrennwertgerät",null,null,1.06]
["Gemittelter Wirkungsgrad GAWP SW",null,null,1.55]
["Elektr. Leistung GAWP SW",null,null,0.47,"kW"]
["Elektr. Leistung Kesselkreispumpe",null,null,0.1,"kW"]
["Elektr. Leistung Umwälzpumpe GAWP",null,null,0.05,"kW"]
[]
["Gesucht:","Investitions- und Betriebskosten während 20 Jahren"]
[]
["1."]
["Errechnung der mittleren Energiepreise binnen 20 Jahren"]
[]
["Flüssiggaspreis Anfangsjahr:",null,null,{"$f":"(D1)","v":7.0000000000000007E-2},"€/kWh"]
["Flüssiggaspreis im 20´sten Jahr:",null,null,{"$f":"(Energiepreisberechnung!D22)","v":0.25315692745236701},"€/kWh"]
["Mittlerer Flüssiggaspreis während 20 Jahren:",null,null,{"$f":"(Energiepreisberechnung!D24)","v":0.14348422312430903},"€/kWh"]
[]
["Strompreis Anfangsjahr:",null,null,{"$f":"(D2)","v":0.2},"€/kWh"]
["Strompreis im 20´sten Jahr:",null,null,{"$f":"(Energiepreisberechnung!E22)","v":0.72330550700676266},"€/kWh"]
["Mittlerer Strompreis während 20 Jahren:",null,null,{"$f":"(Energiepreisberechnung!E24)","v":0.40995492321231131},"€/kWh"]
[]
["2."]
["Betrachtung für ein neues Gasbrennwertgerät",null,null,{"$f":"(Master!D5)","v":40},"kW"]
[]
["2a"]
["Investitionskosten",null,null,{"$f":"(Master!D8)","v":5000},"€"]
["Investitionskosten gesamt: ",null,null,{"$f":"(D26)","v":5000},"€",null,null,null,"R_I_GAS"]
[]
["2b"]
["Betriebskosten Gas-Brennwertgerät"]
["Jahresarbeit Gas-Brennwertgerät",null,null,{"$f":"(Master!D5*Master!D6)","v":80000},"kWh/a","(Leistung x Jahresvollbenutzungsstunden)"]
["Energieverbrauch Gas-Brennwertgerät",null,null,{"$f":"(D31/D3)","v":75471.698113207545},"kWh/a","(Wirkungsgrad berücksichtigt)",null,null,"R_B_FLGAS"]
["Kosten Flüssiggas",null,null,{"$f":"(D32*D16)","v":10828.997971645964},"€/a"]
["Wartungskosten Gas-Brennwertgerät",null,null,300,"€/a",null,null,null,"R_B_WART_GAS"]
["Stromverbrauch 1 Stück Kesselkreispumpe",null,null,{"$f":"(Master!D6*D6)","v":200},"kWh/a",null,null,null,"R_B_STROM_GAS"]
["Stromkosten 1 Stück Kesselkreispumpe",null,null,{"$f":"(D35*D20)","v":81.990984642462266},"€/a","(Stromverbrauch x mittlerer Strompreis)"]
[]
["Betriebskosten pro Jahr gesamt:",null,null,{"$f":"SUM(D33:D34)+D36","v":11210.988956288425},"€/a"]
[null,null,null,null,null,null,null,null,null,null,null,"Negative Werte sollen gleich Null gesetzt werden"]
["3.",null,null,null,null,null,null,null,null,null,null,{"$f":"(Master!D5-D53)","v":0}]
["Betrachtung für drei GAWP 40 SW (120 kW) sowie Spitzenlastkessel"]
[null,null,null,null,null,null,null,null,null,null,null,"Wärmepumpe soll nur die Anlagenheizlast erbringen, welche erforderlich ist"]
["3a",null,null,null,null,null,null,null,null,null,null,{"$f":"IF(Master!D5<120,Master!D5,120)","v":40}]
["Investitionskosten"]
["3 x GAWP + Zubehör",null,null,{"$f":"IF(Master!T12=TRUE,25000, (IF(Master!T13=TRUE,45000, (IF(Master!T14=TRUE,65000,\"\")))))","v":""},"€",null,null,null,null,null,null,"Deckungsrate GAWP"]
["Förderung BAFA",null,null,{"$f":"IF(Master!$T$12=TRUE,(2400+100*30), (IF(Master!$T$13=TRUE,(2400+100*70), (IF(Master!$T$14=TRUE,(2400+100*110),\"\")))))","v":""},"€",null,null,null,null,null,null,{"$f":"(D52+D53)","v":40},"Max Leistung BW plus Leistung GAWP"]
[{"$f":"IF(AND(Master!D5>29,Master!D5<55),Spitzenlastkessel!C4,(IF(AND(Master!D5>54,Master!D5<65),Spitzenlastkessel!C5,(IF(AND(Master!D5>64,Master!D5<85),Spitzenlastkessel!C6,(IF(AND(Master!D5>84,Master!D5<110),Spitzenlastkessel!C7,(IF(AND(Master!D5>109,Master!D5<135),Spitzenlastkessel!C8,(IF(AND(Master!D5>134,Master!D5<150),Spitzenlastkessel!C9,(IF(AND(Master!D5>149,Master!D5<200),Spitzenlastkessel!C10,(IF(AND(Master!D5>199,Master!D5<240),Spitzenlastkessel!C11,(IF(AND(Master!D5>239,Master!D5<300),Spitzenlastkessel!C12,(IF(AND(Master!D5>299,Master!D5<370),Spitzenlastkessel!C13,(IF(AND(Master!D5>369,Master!D5<450),Spitzenlastkessel!C14,(IF(AND(Master!D5>449,Master!D5<520),Spitzenlastkessel!C15,\"Anlagenheizlast zu groß\")))))))))))))))))))))))","v":"Spitzenlastkessel GMR 3035 (35 kW)"},null,null,{"$f":"IF(AND(Master!D5>29,Master!D5<55),Spitzenlastkessel!E4,(IF(AND(Master!D5>54,Master!D5<65),Spitzenlastkessel!E5,(IF(AND(Master!D5>64,Master!D5<85),Spitzenlastkessel!E6,(IF(AND(Master!D5>84,Master!D5<110),Spitzenlastkessel!E7,(IF(AND(Master!D5>109,Master!D5<135),Spitzenlastkessel!E8,(IF(AND(Master!D5>134,Master!D5<150),Spitzenlastkessel!E9,(IF(AND(Master!D5>149,Master!D5<200),Spitzenlastkessel!E10,(IF(AND(Master!D5>199,Master!D5<240),Spitzenlastkessel!E11,(IF(AND(Master!D5>239,Master!D5<300),Spitzenlastkessel!E12,(IF(AND(Master!D5>299,Master!D5<370),Spitzenlastkessel!E13,(IF(AND(Master!D5>369,Master!D5<450),Spitzenlastkessel!E14,(IF(AND(Master!D5>449,Master!D5<520),Spitzenlastkessel!E15,\"Anlagenheizlast zu groß\")))))))))))))))))))))))","v":3600},"€","(gewählt)",null,null,null,null,null,{"$f":"(100/L46)*D53","v":100},"Prozentuale Anlagenheizlast von GAWP"]
["Investitionskosten gesamt: ",null,null,{"$f":"(D45+D47-D46)","v":{"$error":"#VALUE!"}},"€",null,null,null,"N_I_GAWP_u_BW",null,null,{"$f":"MROUND(L47,5)","v":100},"Gerundet"]
[null,null,null,null,null,null,null,null,null,null,null,null,null,null,null,null,"Prozentuale \nAnlagen-\nheizlast \nder GAWP"]
["3b",null,null,null,null,null,null,null,null,null,null,{"$f":"VLOOKUP(L48,Q53:R80,2)","v":100},"Deckungsrate GAWP",null,null,null,null,"Deckungs-\nrate"]
["Betriebskosten"]
["Max. Leistung Brennwertgerät",null,null,{"$f":"IF(L40<0,0,(Master!D5-D53))","v":0},"kW"]
["Leistung 3 x GAWP",null,null,{"$f":"(L43)","v":40},"kW",null,null,null,null,null,null,null,null,null,null,null,0,0]
[null,null,null,null,null,null,null,null,null,null,null,null,null,null,null,null,5,8]
["Deckungsrate Brennwertgerät",null,null,{"$f":"(100-D56)","v":0},"%","(Ergibt sich aus Leistungsverhältnis Brennwertgerät/GAWP)",null,null,null,null,null,null,null,null,null,null,10,15]
["Deckungsrate 3 x GAWP",null,null,{"$f":"VLOOKUP(L48,Q53:R80,2)","v":100},"%","(Ergibt sich aus Leistungsverhältnis Brennwertgerät/GAWP)",null,null,null,null,null,null,null,null,null,null,15,25]
[null,null,null,null,null,null,null,null,null,null,null,null,null,null,null,null,20,33]
["Jahresarbeit Gas-Brennwertgerät",null,null,{"$f":"(D31*(D55/100))","v":0},"kWh/a","(Deckungsrate berücksichtigt)"]
["Jahresarbeit 3 x GAWP",null,null,{"$f":"(D31*(D56/100))","v":80000},"kWh/a","(Deckungsrate berücksichtigt)",null,null,null,null,null,null,null,null,null,null,25,41]
[null,null,null,null,null,null,null,null,null,null,null,null,null,null,null,null,30,50]
["Vollbenutzungsstunden Gas-Brennwertgerät",null,null,{"$f":"IF(D52=0,0,(D58/D52))","v":0},"h","(ergibt sich aus Jahresarbeit/Leistung)"]
["Vollbenutzungsstunden 3 x GAWP",null,null,{"$f":"(D59/D53)","v":2000},"h","(ergibt sich aus Jahresarbeit/Leistung)",null,null,null,null,null,null,null,null,null,null,35,58]
[null,null,null,null,null,null,null,null,null,null,null,null,null,null,null,null,40,67]
["Flüssiggasverbrauch Gas-Brennwertgerät",null,null,{"$f":"(D58/D3)","v":0},"kWh/a","(ergibt sich aus Jahresarbeit/Wirkungsgrad)",null,null,"N_B_FLGAS_BW"]
["Flüssiggasverbrauch 3 x GAWP",null,null,{"$f":"(D59/D4)","v":51612.903225806447},"kWh/a","(ergibt sich aus Jahresarbeit/Wirkungsgrad)",null,null,"N_B_FLGAS_GAWP",null,null,null,null,null,null,null,45,75]
[null,null,null,null,null,null,null,null,null,null,null,null,null,null,null,null,50,80]
["Kosten Flüssiggasverbrauch Gas-Brennwertgerät",null,null,{"$f":"(D64*D16)","v":0},"€/a","(ergibt sich aus Flüssiggasverbrauch x mittlerer Flüssiggaspreis)"]
["Kosten Flüssiggasverbrauch 3 x GAWP",null,null,{"$f":"(D65*D16)","v":7405.6373225449815},"€/a","(ergibt sich aus Flüssiggasverbrauch x mittlerer Flüssiggaspreis)",null,null,null,null,null,null,null,null,null,null,55,83]
[null,null,null,null,null,null,null,null,null,null,null,null,null,null,null,null,60,87]
["Wartungskosten Gas-Brennwertgerät",null,null,300,"€/a",null,null,null,"N_B_WART_BW"]
["Wartungskosten 3 x GAWP",null,null,700,"€/a",null,null,null,"N_B_WART_GAWP",null,null,null,null,null,null,null,65,90]
[null,null,null,null,null,null,null,null,null,null,null,null,null,null,null,null,70,92]
["Stromverbrauch 3 x GAWP",null,null,{"$f":"(D62*D5)*3","v":2820},"kWh/a",null,null,null,"N_B_STROM_LÜ_GAWP",null,null,null,null,null,null,null,75,94]
["Stromkosten 3 x GAWP",null,null,{"$f":"(D73*D20)","v":1156.0728834587178},"€/a","(Stromverbrauch x mittlerer Strompreis)",null,null,null,null,null,null,null,null,null,null,80,96]
["Stromverbrauch Gas-Brennwertgerät",null,null,{"$f":"(D61*D6)","v":0},"kWh/a",null,null,null,"N_B_STROM_BW"]
["Stromkosten Gas-Brennwertgerät",null,null,{"$f":"(D75*D20)","v":0},"€/a","(Stromverbrauch x mittlerer Strompreis)"]
["Stromverbrauch 6 x Umwälzpumpe GAWP",null,null,{"$f":"((D62)*D7*6)","v":600},"kWh/a",null,null,null,"N_B_STROM_PU_GAWP",null,null,null,null,null,null,null,85,97]
["Stromkosten 6 x Umwälzpumpe GAWP",null,null,{"$f":"(D77*D20)","v":245.97295392738678},"€/a","(Stromverbrauch x mittlerer Strompreis)",null,null,null,null,null,null,null,null,null,null,90,98]
[null,null,null,null,null,null,null,null,null,null,null,null,null,null,null,null,95,99]
["Betriebskosten pro Jahr gesamt:",null,null,{"$f":"SUM(D67:D71)+D78+D74+D76","v":9807.6831599310863},"€/a",null,null,null,null,null,null,null,null,null,null,null,100,100]
[]
["FAZIT:"]
["Mittlere Energieeinsparung pro Jahr bei Einsatz"]
["von drei GAWP SW und Gas-Brennwertgerät"]
["gegenüber \"nur Gas-Brennwert\" (Flüssiggas):",null,null,{"$f":"(D38-D80)","v":1403.3057963573392},"€/a"]
[]
["Differenz Investitionskosten:",null,null,{"$f":"(D48-D27)","v":{"$error":"#VALUE!"}},"€"]
[]
["Für einen auf 20 Jahre gemittelten Engergiepreis"]
["ergibt sich eine Amortisationszeit von: ",null,null,{"$f":"IF((D87/D85)<0,\"sofort\",(D87/D85))","v":{"$error":"#VALUE!"}},{"$f":"IF((D87/D85)<0,\"\",\"Jahren\")","v":{"$error":"#VALUE!"}}]

{"sheet":"SW mono ÖL","index":32,"n_rows":81,"n_cols":9,"rows_kept":81,"cut":false,"hidden":false,"merged":[]}
["Aktueller Gaspreis",null,null,{"$f":"(Energiepreisberechnung!D28)","v":5.5E-2},"€/kWh"]
["Aktueller Ölpreis",null,null,{"$f":"(Energiepreisberechnung!D30)","v":8.5000000000000006E-2},"€/kWh"]
["Aktueller Strompreis",null,null,{"$f":"(Energiepreisberechnung!D31)","v":0.2},"€/kWh"]
["Gemittelter Wirkungsgrad Ölkessel",null,null,0.93]
["Gemittelter Wirkungsgrad GAWP SW",null,null,1.55]
["Elektr. Leistung GAWP SW",null,null,0.47,"kW"]
["Elektr. Leistung Kesselkreispumpe",null,null,0.05,"kW"]
[]
["Gesucht:","Investitions- und Betriebskosten während 20 Jahren"]
[]
["1."]
["Errechnung der mittleren Energiepreise binnen 20 Jahren"]
[]
["Gaspreis Anfangsjahr:",null,null,{"$f":"(D1)","v":5.5E-2},"€/kWh"]
["Gaspreis im 20´sten Jahr:",null,null,{"$f":"(Energiepreisberechnung!C22)","v":0.19890901442685968},"€/kWh"]
["Mittlerer Gaspreis während 20 Jahren:",null,null,{"$f":"(Energiepreisberechnung!C24)","v":0.11273760388338561},"€/kWh"]
[]
["Ölpreis Anfangsjahr:",null,null,{"$f":"(D2)","v":8.5000000000000006E-2},"€/kWh"]
["Ölpreis im 20´sten Jahr:",null,null,{"$f":"(Energiepreisberechnung!F22)","v":0.30740484047787403},"€/kWh"]
["Mittlerer Ölpreis während 20 Jahren:",null,null,{"$f":"(Energiepreisberechnung!F24)","v":0.17423084236523231},"€/kWh"]
[]
["Strompreis Anfangsjahr:",null,null,{"$f":"(D3)","v":0.2},"€/kWh"]
["Strompreis im 20´sten Jahr:",null,null,{"$f":"(Energiepreisberechnung!E22)","v":0.72330550700676266},"€/kWh"]
["Mittlerer Strompreis während 20 Jahren:",null,null,{"$f":"(Energiepreisberechnung!E24)","v":0.40995492321231131},"€/kWh"]
[]
["2."]
["Betrachtung ohne Investition (bestehende Kessel bleiben)"]
[]
["2a"]
["Investitionskosten"]
["Investitionskosten gesamt: ",null,null,0,"€",null,null,null,"R_I_ÖL"]
[]
["2b"]
["Betriebskosten Öl"]
["Jahresarbeit Ölkessel",null,null,{"$f":"(Master!D5*Master!D6)","v":80000},"kWh/a","(Leistung x Jahresvollbenutzungsstunden)"]
["Energieverbrauch Ölkessel",null,null,{"$f":"(D35/D4)","v":86021.505376344081},"kWh/a","(Wirkungsgrad berücksichtigt)",null,null,"R_B_ÖL"]
["Kosten Öl ",null,null,{"$f":"(D36*D20)","v":14987.599343245789},"€/a"]
["Wartungskosten Ölkessel",null,null,300,"€/a",null,null,null,"R_B_WART_ÖL"]
["Stromverbrauch 1 Stück Kesselkreispumpe",null,null,{"$f":"(Master!D6*D7)","v":100},"kWh/a",null,null,null,"R_B_STROM_ÖL"]
["Stromkosten 1 Stück Kesselkreispumpe",null,null,{"$f":"(D39*D24)","v":40.995492321231133},"€/a","(Stromverbrauch x mittlerer Strompreis)"]
[]
["Betriebskosten pro Jahr gesamt:",null,null,{"$f":"SUM(D37:D38)+D40","v":15328.594835567021},"€/a"]
[]
["3."]
["Betrachtung für eine GAWP 40 SW (40 kW) monovalent"]
[]
["3a"]
["Investitionskosten"]
["GAWP + Zubehör",null,null,{"$f":"IF(Master!T9=TRUE,25000, (IF(Master!T10=TRUE,45000, (IF(Master!T11=TRUE,65000,\"\")))))","v":45000},"€"]
["Förderung BAFA",null,null,{"$f":"IF(Master!$T$9=TRUE,(2400+100*30), (IF(Master!$T$10=TRUE,(2400+100*70), (IF(Master!$T$11=TRUE,(2400+100*110),\"\")))))","v":9400},"€"]
["Investitionskosten gesamt: ",null,null,{"$f":"(D49-D50)","v":35600},"€",null,null,null,"N_I_GAWP_u_BW"]
[]
["3b"]
["Betriebskosten"]
["Leistung GAWP",null,null,{"$f":"(Master!D5)","v":40},"kW"]
["Jahresarbeit GAWP",null,null,{"$f":"(D35)","v":80000},"kWh/a","(ergibt sich aus Deckungsrate = 100%)"]
[]
["Vollbenutzungsstunden GAWP",null,null,{"$f":"(D56/D55)","v":2000},"h","(ergibt sich aus Jahresarbeit/Leistung)"]
[]
["Gasverbrauch GAWP",null,null,{"$f":"(D56/D5)","v":51612.903225806447},"kWh/a","(ergibt sich aus Jahresarbeit/Wirkungsgrad)",null,null,"N_B_GAS_GAWP"]
[]
["Kosten Gasverbrauch GAWP",null,null,{"$f":"(D60*D16)","v":5818.7150391424821},"€/a","(ergibt sich aus Gasverbrauch x mittlerer Gaspreis)"]
[]
["Wartungskosten GAWP",null,null,300,"€/a",null,null,null,"N_B_WART_GAWP"]
[]
["Stromverbrauch GAWP",null,null,{"$f":"(D58*D6)","v":940},"kWh/a",null,null,null,"N_B_STROM_LÜ_GAWP"]
["Stromkosten GAWP",null,null,{"$f":"(D66*D24)","v":385.35762781957266},"€/a","(Stromverbrauch x mittlerer Strompreis)"]
["Stromverbrauch 2 x Umwälzpumpe GAWP",null,null,{"$f":"((D58)*D7*2)","v":200},"kWh/a",null,null,null,"N_B_STROM_PU_GAWP"]
["Stromkosten 2 x Umwälzpumpe GAWP",null,null,{"$f":"(D68*D24)","v":81.990984642462266},"€/a","(Stromverbrauch x mittlerer Strompreis)"]
[]
["Betriebskosten pro Jahr gesamt:",null,null,{"$f":"SUM(D62:D64)+D69+D67","v":6586.063651604517},"€/a"]
[]
["FAZIT:"]
["Mittlere Energieeinsparung pro Jahr bei Einsatz"]
["von einer monovalenten GAWP SW gegenüber"]
["bestehenden Betriebskosten",null,null,{"$f":"(D42-D71)","v":8742.5311839625028},"€/a"]
[]
["Differenz Investitionskosten:",null,null,{"$f":"(D51-D31)","v":35600},"€"]
[]
["Für einen auf 20 Jahre gemittelten Engergiepreis"]
["ergibt sich eine Amortisationszeit von: ",null,null,{"$f":"IF((D78/D76)<0,\"sofort\",(D78/D76))","v":4.0720472424857288},{"$f":"IF((D78/D76)<0,\"\",\"Jahren\")","v":"Jahren"}]

{"sheet":"SW2 mono ÖL","index":33,"n_rows":82,"n_cols":9,"rows_kept":82,"cut":false,"hidden":false,"merged":[]}
["Aktueller Gaspreis",null,null,{"$f":"(Energiepreisberechnung!D28)","v":5.5E-2},"€/kWh"]
["Aktueller Ölpreis",null,null,{"$f":"(Energiepreisberechnung!D30)","v":8.5000000000000006E-2},"€/kWh"]
["Aktueller Strompreis",null,null,{"$f":"(Energiepreisberechnung!D31)","v":0.2},"€/kWh"]
["Gemittelter Wirkungsgrad Ölkessel",null,null,0.93]
["Gemittelter Wirkungsgrad GAWP SW",null,null,1.55]
["Elektr. Leistung GAWP SW",null,null,0.47,"kW"]
["Elektr. Leistung Kesselkreispumpe",null,null,0.06,"kW"]
["Elektr. Leistung Umwälzpumpe GAWP",null,null,0.05,"kW"]
[]
["Gesucht:","Investitions- und Betriebskosten während 20 Jahren"]
[]
["1."]
["Errechnung der mittleren Energiepreise binnen 20 Jahren"]
[]
["Gaspreis Anfangsjahr:",null,null,{"$f":"(D1)","v":5.5E-2},"€/kWh"]
["Gaspreis im 20´sten Jahr:",null,null,{"$f":"(Energiepreisberechnung!C22)","v":0.19890901442685968},"€/kWh"]
["Mittlerer Gaspreis während 20 Jahren:",null,null,{"$f":"(Energiepreisberechnung!C24)","v":0.11273760388338561},"€/kWh"]
[]
["Ölpreis Anfangsjahr:",null,null,{"$f":"(D2)","v":8.5000000000000006E-2},"€/kWh"]
["Ölpreis im 20´sten Jahr:",null,null,{"$f":"(Energiepreisberechnung!F22)","v":0.30740484047787403},"€/kWh"]
["Mittlerer Ölpreis während 20 Jahren:",null,null,{"$f":"(Energiepreisberechnung!F24)","v":0.17423084236523231},"€/kWh"]
[]
["Strompreis Anfangsjahr:",null,null,{"$f":"(D3)","v":0.2},"€/kWh"]
["Strompreis im 20´sten Jahr:",null,null,{"$f":"(Energiepreisberechnung!E22)","v":0.72330550700676266},"€/kWh"]
["Mittlerer Strompreis während 20 Jahren:",null,null,{"$f":"(Energiepreisberechnung!E24)","v":0.40995492321231131},"€/kWh"]
[]
["2."]
["Betrachtung ohne Investition (bestehende Kessel bleiben)"]
[]
["2a"]
["Investitionskosten"]
["Investitionskosten gesamt: ",null,null,0,"€",null,null,null,"R_I_ÖL"]
[]
["2b"]
["Betriebskosten Öl"]
["Jahresarbeit Ölkessel",null,null,{"$f":"(Master!D5*Master!D6)","v":80000},"kWh/a","(Leistung x Jahresvollbenutzungsstunden)"]
["Energieverbrauch Ölkessel",null,null,{"$f":"(D36/D4)","v":86021.505376344081},"kWh/a","(Wirkungsgrad berücksichtigt)",null,null,"R_B_ÖL"]
["Kosten Öl ",null,null,{"$f":"(D37*D21)","v":14987.599343245789},"€/a"]
["Wartungskosten Ölkessel",null,null,300,"€/a",null,null,null,"R_B_WART_ÖL"]
["Stromverbrauch 1 Stück Kesselkreispumpe",null,null,{"$f":"(Master!D6*D7)","v":120},"kWh/a",null,null,null,"R_B_STROM_ÖL"]
["Stromkosten 1 Stück Kesselkreispumpe",null,null,{"$f":"(D40*D25)","v":49.194590785477359},"€/a","(Stromverbrauch x mittlerer Strompreis)"]
[]
["Betriebskosten pro Jahr gesamt:",null,null,{"$f":"SUM(D38:D39)+D41","v":15336.793934031266},"€/a"]
[]
["3."]
["Betrachtung für zwei GAWP 40 SW (80 kW) monovalent"]
[]
["3a"]
["Investitionskosten"]
["2 x GAWP + Zubehör",null,null,{"$f":"IF(Master!T9=TRUE,25000, (IF(Master!T10=TRUE,45000, (IF(Master!T11=TRUE,65000,\"\")))))","v":45000},"€"]
["Förderung BAFA",null,null,{"$f":"IF(Master!$T$9=TRUE,(2400+100*30), (IF(Master!$T$10=TRUE,(2400+100*70), (IF(Master!$T$11=TRUE,(2400+100*110),\"\")))))","v":9400},"€"]
["Investitionskosten gesamt: ",null,null,{"$f":"(D50-D51)","v":35600},"€",null,null,null,"N_I_GAWP_u_BW"]
[]
["3b"]
["Betriebskosten"]
["Leistung 2 x GAWP",null,null,{"$f":"(Master!D5)","v":40},"kW"]
["Jahresarbeit 2 x GAWP",null,null,{"$f":"(D36)","v":80000},"kWh/a","(ergibt sich aus Deckungsrate = 100%)"]
[]
["Vollbenutzungsstunden 2 x GAWP",null,null,{"$f":"(D57/D56)","v":2000},"h","(ergibt sich aus Jahresarbeit/Leistung)"]
[]
["Gasverbrauch 2 x GAWP",null,null,{"$f":"(D57/D5)","v":51612.903225806447},"kWh/a","(ergibt sich aus Jahresarbeit/Wirkungsgrad)",null,null,"N_B_GAS_GAWP"]
[]
["Kosten Gasverbrauch 2 x GAWP",null,null,{"$f":"(D61*D17)","v":5818.7150391424821},"€/a","(ergibt sich aus Gasverbrauch x mittlerer Gaspreis)"]
[]
["Wartungskosten 2 x GAWP",null,null,500,"€/a",null,null,null,"N_B_WART_GAWP"]
[]
["Stromverbrauch 2 x GAWP",null,null,{"$f":"(D59*D6*2)","v":1880},"kWh/a",null,null,null,"N_B_STROM_LÜ_GAWP"]
["Stromkosten 2 x GAWP",null,null,{"$f":"(D67*D25)","v":770.71525563914531},"€/a","(Stromverbrauch x mittlerer Strompreis)"]
["Stromverbrauch 4 x Umwälzpumpe GAWP",null,null,{"$f":"((D59)*D8*4)","v":400},"kWh/a",null,null,null,"N_B_STROM_PU_GAWP"]
["Stromkosten 4 x Umwälzpumpe GAWP",null,null,{"$f":"(D69*D25)","v":163.98196928492453},"€/a","(Stromverbrauch x mittlerer Strompreis)"]
[]
["Betriebskosten pro Jahr gesamt:",null,null,{"$f":"SUM(D63:D65)+D70+D68","v":7253.4122640665519},"€/a"]
[]
["FAZIT:"]
["Mittlere Energieeinsparung pro Jahr bei Einsatz"]
["von zwei monovalenten GAWP SW gegenüber"]
["bestehenden Betriebskosten",null,null,{"$f":"(D43-D72)","v":8083.3816699647141},"€/a"]
[]
["Differenz Investitionskosten:",null,null,{"$f":"(D52-D32)","v":35600},"€"]
[]
["Für einen auf 20 Jahre gemittelten Engergiepreis"]
["ergibt sich eine Amortisationszeit von: ",null,null,{"$f":"IF((D79/D77)<0,\"sofort\",(D79/D77))","v":4.4040973757651853},{"$f":"IF((D79/D77)<0,\"\",\"Jahren\")","v":"Jahren"}]

{"sheet":"SW3 mono ÖL","index":34,"n_rows":82,"n_cols":9,"rows_kept":82,"cut":false,"hidden":false,"merged":[]}
["Aktueller Gaspreis",null,null,{"$f":"(Energiepreisberechnung!D28)","v":5.5E-2},"€/kWh"]
["Aktueller Ölpreis",null,null,{"$f":"(Energiepreisberechnung!D30)","v":8.5000000000000006E-2},"€/kWh"]
["Aktueller Strompreis",null,null,{"$f":"(Energiepreisberechnung!D31)","v":0.2},"€/kWh"]
["Gemittelter Wirkungsgrad Ölkessel",null,null,0.93]
["Gemittelter Wirkungsgrad GAWP SW",null,null,1.55]
["Elektr. Leistung GAWP SW",null,null,0.47,"kW"]
["Elektr. Leistung Kesselkreispumpe",null,null,0.1,"kW"]
["Elektr. Leistung Umwälzpumpen GAWP",null,null,0.05,"kW"]
[]
["Gesucht:","Investitions- und Betriebskosten während 20 Jahren"]
[]
["1."]
["Errechnung der mittleren Energiepreise binnen 20 Jahren"]
[]
["Gaspreis Anfangsjahr:",null,null,{"$f":"(D1)","v":5.5E-2},"€/kWh"]
["Gaspreis im 20´sten Jahr:",null,null,{"$f":"(Energiepreisberechnung!C22)","v":0.19890901442685968},"€/kWh"]
["Mittlerer Gaspreis während 20 Jahren:",null,null,{"$f":"(Energiepreisberechnung!C24)","v":0.11273760388338561},"€/kWh"]
[]
["Ölpreis Anfangsjahr:",null,null,{"$f":"(D2)","v":8.5000000000000006E-2},"€/kWh"]
["Ölpreis im 20´sten Jahr:",null,null,{"$f":"(Energiepreisberechnung!F22)","v":0.30740484047787403},"€/kWh"]
["Mittlerer Ölpreis während 20 Jahren:",null,null,{"$f":"(Energiepreisberechnung!F24)","v":0.17423084236523231},"€/kWh"]
[]
["Strompreis Anfangsjahr:",null,null,{"$f":"(D3)","v":0.2},"€/kWh"]
["Strompreis im 20´sten Jahr:",null,null,{"$f":"(Energiepreisberechnung!E22)","v":0.72330550700676266},"€/kWh"]
["Mittlerer Strompreis während 20 Jahren:",null,null,{"$f":"(Energiepreisberechnung!E24)","v":0.40995492321231131},"€/kWh"]
[]
["2."]
["Betrachtung ohne Investition (bestehende Kessel bleiben)"]
[]
["2a"]
["Investitionskosten"]
["Investitionskosten gesamt: ",null,null,0,"€",null,null,null,"R_I_ÖL"]
[]
["2b"]
["Betriebskosten Öl"]
["Jahresarbeit Ölkessel",null,null,{"$f":"(Master!D5*Master!D6)","v":80000},"kWh/a","(Leistung x Jahresvollbenutzungsstunden)"]
["Energieverbrauch Ölkessel",null,null,{"$f":"(D36/D4)","v":86021.505376344081},"kWh/a","(Wirkungsgrad berücksichtigt)",null,null,"R_B_ÖL"]
["Kosten Öl ",null,null,{"$f":"(D37*D21)","v":14987.599343245789},"€/a"]
["Wartungskosten Ölkessel",null,null,400,"€/a",null,null,null,"R_B_WART_ÖL"]
["Stromverbrauch 1 Stück Kesselkreispumpe",null,null,{"$f":"(Master!D6*D7)","v":200},"kWh/a",null,null,null,"R_B_STROM_ÖL"]
["Stromkosten 1 Stück Kesselkreispumpe",null,null,{"$f":"(D40*D25)","v":81.990984642462266},"€/a","(Stromverbrauch x mittlerer Strompreis)"]
[]
["Betriebskosten pro Jahr gesamt:",null,null,{"$f":"SUM(D38:D39)+D41","v":15469.590327888251},"€/a"]
[]
["3."]
["Betrachtung für drei GAWP 40 SW (120 kW) monovalent"]
[]
["3a"]
["Investitionskosten"]
["3 x GAWP + Zubehör",null,null,{"$f":"IF(Master!T9=TRUE,25000, (IF(Master!T10=TRUE,45000, (IF(Master!T11=TRUE,65000,\"\")))))","v":45000},"€"]
["Förderung BAFA",null,null,{"$f":"IF(Master!$T$9=TRUE,(2400+100*30), (IF(Master!$T$10=TRUE,(2400+100*70), (IF(Master!$T$11=TRUE,(2400+100*110),\"\")))))","v":9400},"€"]
["Investitionskosten gesamt: ",null,null,{"$f":"(D50-D51)","v":35600},"€",null,null,null,"N_I_GAWP_u_BW"]
[]
["3b"]
["Betriebskosten"]
["Leistung 3 x GAWP",null,null,{"$f":"(Master!D5)","v":40},"kW"]
["Jahresarbeit 3 x GAWP",null,null,{"$f":"(D36)","v":80000},"kWh/a","(ergibt sich aus Deckungsrate = 100%)"]
[]
["Vollbenutzungsstunden 3 x GAWP",null,null,{"$f":"(D57/D56)","v":2000},"h","(ergibt sich aus Jahresarbeit/Leistung)"]
[]
["Gasverbrauch 3 x GAWP",null,null,{"$f":"(D57/D5)","v":51612.903225806447},"kWh/a","(ergibt sich aus Jahresarbeit/Wirkungsgrad)",null,null,"N_B_GAS_GAWP"]
[]
["Kosten Gasverbrauch 3 x GAWP",null,null,{"$f":"(D61*D17)","v":5818.7150391424821},"€/a","(ergibt sich aus Gasverbrauch x mittlerer Gaspreis)"]
[]
["Wartungskosten 3 x GAWP",null,null,700,"€/a",null,null,null,"N_B_WART_GAWP"]
[]
["Stromverbrauch 3 x GAWP",null,null,{"$f":"(D59*D6*3)","v":2820},"kWh/a",null,null,null,"N_B_STROM_LÜ_GAWP"]
["Stromkosten 3 x GAWP",null,null,{"$f":"(D67*D25)","v":1156.0728834587178},"€/a","(Stromverbrauch x mittlerer Strompreis)"]
["Stromverbrauch 6 x Umwälzpumpe GAWP",null,null,{"$f":"((D59)*D8*6)","v":600},"kWh/a",null,null,null,"N_B_STROM_PU_GAWP"]
["Stromkosten 6 x Umwälzpumpe GAWP",null,null,{"$f":"(D69*D25)","v":245.97295392738678},"€/a","(Stromverbrauch x mittlerer Strompreis)"]
[]
["Betriebskosten pro Jahr gesamt:",null,null,{"$f":"SUM(D63:D65)+D70+D68","v":7920.7608765285868},"€/a"]
[]
["FAZIT:"]
["Mittlere Energieeinsparung pro Jahr bei Einsatz"]
["von drei monovalenten GAWP SW gegenüber"]
["bestehenden Betriebskosten",null,null,{"$f":"(D43-D72)","v":7548.8294513596638},"€/a"]
[]
["Differenz Investitionskosten:",null,null,{"$f":"(D52-D32)","v":35600},"€"]
[]
["Für einen auf 20 Jahre gemittelten Engergiepreis"]
["ergibt sich eine Amortisationszeit von: ",null,null,{"$f":"IF((D79/D77)<0,\"sofort\",(D79/D77))","v":4.7159629488765145},{"$f":"IF((D79/D77)<0,\"\",\"Jahren\")","v":"Jahren"}]

{"sheet":"SW mono GAS","index":35,"n_rows":76,"n_cols":9,"rows_kept":76,"cut":false,"hidden":false,"merged":[]}
["Aktueller Gaspreis",null,null,{"$f":"(Energiepreisberechnung!D28)","v":5.5E-2},"€/kWh"]
["Aktueller Strompreis",null,null,{"$f":"(Energiepreisberechnung!D31)","v":0.2},"€/kWh"]
["Gemittelter Wirkungsgrad Gasbrennwertgerät",null,null,1.06]
["Gemittelter Wirkungsgrad GAWP SW",null,null,1.55]
["Elektr. Leistung GAWP SW",null,null,0.47,"kW"]
["Elektr. Leistung Kesselkreispumpe",null,null,0.05,"kW"]
[]
["Gesucht:","Investitions- und Betriebskosten während 20 Jahren"]
[]
["1."]
["Errechnung der mittleren Energiepreise binnen 20 Jahren"]
[]
["Gaspreis Anfangsjahr:",null,null,{"$f":"(D1)","v":5.5E-2},"€/kWh"]
["Gaspreis im 20´sten Jahr:",null,null,{"$f":"(Energiepreisberechnung!C22)","v":0.19890901442685968},"€/kWh"]
["Mittlerer Gaspreis während 20 Jahren:",null,null,{"$f":"(Energiepreisberechnung!C24)","v":0.11273760388338561},"€/kWh"]
[]
["Strompreis Anfangsjahr:",null,null,{"$f":"(D2)","v":0.2},"€/kWh"]
["Strompreis im 20´sten Jahr:",null,null,{"$f":"(Energiepreisberechnung!E22)","v":0.72330550700676266},"€/kWh"]
["Mittlerer Strompreis während 20 Jahren:",null,null,{"$f":"(Energiepreisberechnung!E24)","v":0.40995492321231131},"€/kWh"]
[]
["2."]
["Betrachtung für ein neues Gasbrennwertgerät",null,null,{"$f":"(Master!D5)","v":40},"kW"]
[]
["2a"]
["Investitionskosten",null,null,{"$f":"(Master!D8)","v":5000},"€"]
["Investitionskosten gesamt: ",null,null,{"$f":"(D25)","v":5000},"€",null,null,null,"R_I_GAS"]
[]
["2b"]
["Betriebskosten Gas-Brennwertgerät"]
["Jahresarbeit Gas-Brennwertgerät",null,null,{"$f":"(Master!D5*Master!D6)","v":80000},"kWh/a","(Leistung x Jahresvollbenutzungsstunden)"]
["Energieverbrauch Gas-Brennwertgerät",null,null,{"$f":"(D30/D3)","v":75471.698113207545},"kWh/a","(Wirkungsgrad berücksichtigt)",null,null,"R_B_GAS"]
["Kosten Gas",null,null,{"$f":"(D31*D15)","v":8508.4984062932526},"€/a"]
["Wartungskosten Gas-Brennwertgerät",null,null,300,"€/a",null,null,null,"R_B_WART_GAS"]
["Stromverbrauch 1 Stück Kesselkreispumpe",null,null,{"$f":"(Master!D6*D6)","v":100},"kWh/a",null,null,null,"R_B_STROM_GAS"]
["Stromkosten 1 Stück Kesselkreispumpe",null,null,{"$f":"(D34*D19)","v":40.995492321231133},"€/a","(Stromverbrauch x mittlerer Strompreis)"]
[]
["Betriebskosten pro Jahr gesamt:",null,null,{"$f":"SUM(D32:D33)+D35","v":8849.4938986144844},"€/a"]
[]
["3."]
["Betrachtung für eine GAWP 40 SW (40 kW) monovalent"]
[]
["3a"]
["Investitionskosten"]
["GAWP + Zubehör",null,null,{"$f":"IF(Master!T9=TRUE,25000, (IF(Master!T10=TRUE,45000, (IF(Master!T11=TRUE,65000,\"\")))))","v":45000},"€"]
["Förderung BAFA",null,null,{"$f":"IF(Master!$T$9=TRUE,(2400+100*30), (IF(Master!$T$10=TRUE,(2400+100*70), (IF(Master!$T$11=TRUE,(2400+100*110),\"\")))))","v":9400},"€"]
["Investitionskosten gesamt: ",null,null,{"$f":"(D44-D45)","v":35600},"€",null,null,null,"N_I_GAWP_u_BW"]
[]
["3b"]
["Betriebskosten"]
["Leistung GAWP",null,null,{"$f":"(Master!D5)","v":40},"kW"]
["Jahresarbeit GAWP",null,null,{"$f":"(D30)","v":80000},"kWh/a","(ergibt sich aus Deckungsrate = 100%)"]
[]
["Vollbenutzungsstunden GAWP",null,null,{"$f":"(D51/D50)","v":2000},"h","(ergibt sich aus Jahresarbeit/Leistung)"]
[]
["Gasverbrauch GAWP",null,null,{"$f":"(D51/D4)","v":51612.903225806447},"kWh/a","(ergibt sich aus Jahresarbeit/Wirkungsgrad)",null,null,"N_B_GAS_GAWP"]
[]
["Kosten Gasverbrauch GAWP",null,null,{"$f":"(D55*D15)","v":5818.7150391424821},"€/a","(ergibt sich aus Gasverbrauch x mittlerer Gaspreis)"]
[]
["Wartungskosten GAWP",null,null,300,"€/a",null,null,null,"N_B_WART_GAWP"]
[]
["Stromverbrauch GAWP",null,null,{"$f":"(D53*D5)","v":940},"kWh/a",null,null,null,"N_B_STROM_LÜ_GAWP"]
["Stromkosten GAWP",null,null,{"$f":"(D61*D19)","v":385.35762781957266},"€/a","(Stromverbrauch x mittlerer Strompreis)"]
["Stromverbrauch 2 x Umwälzpumpe GAWP",null,null,{"$f":"((D53)*D6*2)","v":200},"kWh/a",null,null,null,"N_B_STROM_PU_GAWP"]
["Stromkosten 2 x Umwälzpumpe GAWP",null,null,{"$f":"(D63*D19)","v":81.990984642462266},"€/a","(Stromverbrauch x mittlerer Strompreis)"]
[]
["Betriebskosten pro Jahr gesamt:",null,null,{"$f":"SUM(D57:D59)+D64+D62","v":6586.063651604517},"€/a"]
[]
["FAZIT:"]
["Mittlere Energieeinsparung pro Jahr bei Einsatz"]
["von einer monovalenten GAWP SW gegenüber"]
["den Betriebskosten eines Gas-Brennwertgerätes",null,null,{"$f":"(D37-D66)","v":2263.4302470099674},"€/a"]
[]
["Differenz Investitionskosten:",null,null,{"$f":"(D46-D26)","v":30600},"€"]
[]
["Für einen auf 20 Jahre gemittelten Engergiepreis"]
["ergibt sich eine Amortisationszeit von: ",null,null,{"$f":"IF((D73/D71)<0,\"sofort\",(D73/D71))","v":13.519303296588511},{"$f":"IF((D73/D71)<0,\"\",\"Jahren\")","v":"Jahren"}]

{"sheet":"SW2 mono GAS","index":36,"n_rows":77,"n_cols":9,"rows_kept":77,"cut":false,"hidden":false,"merged":[]}
["Aktueller Gaspreis",null,null,{"$f":"(Energiepreisberechnung!D28)","v":5.5E-2},"€/kWh"]
["Aktueller Strompreis",null,null,{"$f":"(Energiepreisberechnung!D31)","v":0.2},"€/kWh"]
["Gemittelter Wirkungsgrad Gasbrennwertgerät",null,null,1.06]
["Gemittelter Wirkungsgrad GAWP SW",null,null,1.55]
["Elektr. Leistung GAWP SW",null,null,0.47,"kW"]
["Elektr. Leistung Kesselkreispumpe",null,null,0.06,"kW"]
["Elektr. Leistung Umwälzpumpe GAWP",null,null,0.05,"kW"]
[]
["Gesucht:","Investitions- und Betriebskosten während 20 Jahren"]
[]
["1."]
["Errechnung der mittleren Energiepreise binnen 20 Jahren"]
[]
["Gaspreis Anfangsjahr:",null,null,{"$f":"(D1)","v":5.5E-2},"€/kWh"]
["Gaspreis im 20´sten Jahr:",null,null,{"$f":"(Energiepreisberechnung!C22)","v":0.19890901442685968},"€/kWh"]
["Mittlerer Gaspreis während 20 Jahren:",null,null,{"$f":"(Energiepreisberechnung!C24)","v":0.11273760388338561},"€/kWh"]
[]
["Strompreis Anfangsjahr:",null,null,{"$f":"(D2)","v":0.2},"€/kWh"]
["Strompreis im 20´sten Jahr:",null,null,{"$f":"(Energiepreisberechnung!E22)","v":0.72330550700676266},"€/kWh"]
["Mittlerer Strompreis während 20 Jahren:",null,null,{"$f":"(Energiepreisberechnung!E24)","v":0.40995492321231131},"€/kWh"]
[]
["2."]
["Betrachtung für ein neues Gasbrennwertgerät",null,null,{"$f":"(Master!D5)","v":40},"kW"]
[]
["2a"]
["Investitionskosten",null,null,{"$f":"(Master!D8)","v":5000},"€"]
["Investitionskosten gesamt: ",null,null,{"$f":"(D26)","v":5000},"€",null,null,null,"R_I_GAS"]
[]
["2b"]
["Betriebskosten Gas-Brennwertgerät"]
["Jahresarbeit Gas-Brennwertgerät",null,null,{"$f":"(Master!D5*Master!D6)","v":80000},"kWh/a","(Leistung x Jahresvollbenutzungsstunden)"]
["Energieverbrauch Gas-Brennwertgerät",null,null,{"$f":"(D31/D3)","v":75471.698113207545},"kWh/a","(Wirkungsgrad berücksichtigt)",null,null,"R_B_GAS"]
["Kosten Gas",null,null,{"$f":"(D32*D16)","v":8508.4984062932526},"€/a"]
["Wartungskosten Gas-Brennwertgerät",null,null,300,"€/a",null,null,null,"R_B_WART_GAS"]
["Stromverbrauch 1 Stück Kesselkreispumpe",null,null,{"$f":"(Master!D6*D6)","v":120},"kWh/a",null,null,null,"R_B_STROM_GAS"]
["Stromkosten 1 Stück Kesselkreispumpe",null,null,{"$f":"(D35*D20)","v":49.194590785477359},"€/a","(Stromverbrauch x mittlerer Strompreis)"]
[]
["Betriebskosten pro Jahr gesamt:",null,null,{"$f":"SUM(D33:D34)+D36","v":8857.6929970787296},"€/a"]
[]
["3."]
["Betrachtung für zwei GAWP 40 SW (80 kW) monovalent"]
[]
["3a"]
["Investitionskosten"]
["2 x GAWP + Zubehör",null,null,{"$f":"IF(Master!T9=TRUE,25000, (IF(Master!T10=TRUE,45000, (IF(Master!T11=TRUE,65000,\"\")))))","v":45000},"€"]
["Förderung BAFA",null,null,{"$f":"IF(Master!$T$9=TRUE,(2400+100*30), (IF(Master!$T$10=TRUE,(2400+100*70), (IF(Master!$T$11=TRUE,(2400+100*110),\"\")))))","v":9400},"€"]
["Investitionskosten gesamt: ",null,null,{"$f":"(D45-D46)","v":35600},"€",null,null,null,"N_I_GAWP_u_BW"]
[]
["3b"]
["Betriebskosten"]
["Leistung 2 x GAWP",null,null,{"$f":"(Master!D5)","v":40},"kW"]
["Jahresarbeit 2 x GAWP",null,null,{"$f":"(D31)","v":80000},"kWh/a","(ergibt sich aus Deckungsrate = 100%)"]
[]
["Vollbenutzungsstunden 2 x GAWP",null,null,{"$f":"(D52/D51)","v":2000},"h","(ergibt sich aus Jahresarbeit/Leistung)"]
[]
["Gasverbrauch 2 x GAWP",null,null,{"$f":"(D52/D4)","v":51612.903225806447},"kWh/a","(ergibt sich aus Jahresarbeit/Wirkungsgrad)",null,null,"N_B_GAS_GAWP"]
[]
["Kosten Gasverbrauch 2 x GAWP",null,null,{"$f":"(D56*D16)","v":5818.7150391424821},"€/a","(ergibt sich aus Gasverbrauch x mittlerer Gaspreis)"]
[]
["Wartungskosten 2 x GAWP",null,null,500,"€/a",null,null,null,"N_B_WART_GAWP"]
[]
["Stromverbrauch 2 x GAWP",null,null,{"$f":"(D54*D5)*2","v":1880},"kWh/a",null,null,null,"N_B_STROM_LÜ_GAWP"]
["Stromkosten 2 x GAWP",null,null,{"$f":"(D62*D20)","v":770.71525563914531},"€/a","(Stromverbrauch x mittlerer Strompreis)"]
["Stromverbrauch 4 x Umwälzpumpe GAWP",null,null,{"$f":"((D54)*D7*4)","v":400},"kWh/a",null,null,null,"N_B_STROM_PU_GAWP"]
["Stromkosten 4 x Umwälzpumpe GAWP",null,null,{"$f":"(D64*D20)","v":163.98196928492453},"€/a","(Stromverbrauch x mittlerer Strompreis)"]
[]
["Betriebskosten pro Jahr gesamt:",null,null,{"$f":"SUM(D58:D60)+D65+D63","v":7253.4122640665519},"€/a"]
[]
["FAZIT:"]
["Mittlere Energieeinsparung pro Jahr bei Einsatz"]
["von zwei monovalenten GAWP SW gegenüber"]
["den Betriebskosten eines Gas-Brennwertgerätes",null,null,{"$f":"(D38-D67)","v":1604.2807330121777},"€/a"]
[]
["Differenz Investitionskosten:",null,null,{"$f":"(D47-D27)","v":30600},"€"]
[]
["Für einen auf 20 Jahre gemittelten Engergiepreis"]
["ergibt sich eine Amortisationszeit von: ",null,null,{"$f":"IF((D74/D72)<0,\"sofort\",(D74/D72))","v":19.073968396133399},{"$f":"IF((D74/D72)<0,\"\",\"Jahren\")","v":"Jahren"}]

{"sheet":"SW3 mono GAS","index":37,"n_rows":77,"n_cols":9,"rows_kept":77,"cut":false,"hidden":false,"merged":[]}
["Aktueller Gaspreis",null,null,{"$f":"(Energiepreisberechnung!D28)","v":5.5E-2},"€/kWh"]
["Aktueller Strompreis",null,null,{"$f":"(Energiepreisberechnung!D31)","v":0.2},"€/kWh"]
["Gemittelter Wirkungsgrad Gasbrennwertgerät",null,null,1.06]
["Gemittelter Wirkungsgrad GAWP SW",null,null,1.55]
["Elektr. Leistung GAWP SW",null,null,0.47,"kW"]
["Elektr. Leistung Kesselkreispumpe",null,null,0.1,"kW"]
["Elektr. Leistung Umwälzpumpe GAWP",null,null,0.05,"kW"]
[]
["Gesucht:","Investitions- und Betriebskosten während 20 Jahren"]
[]
["1."]
["Errechnung der mittleren Energiepreise binnen 20 Jahren"]
[]
["Gaspreis Anfangsjahr:",null,null,{"$f":"(D1)","v":5.5E-2},"€/kWh"]
["Gaspreis im 20´sten Jahr:",null,null,{"$f":"(Energiepreisberechnung!C22)","v":0.19890901442685968},"€/kWh"]
["Mittlerer Gaspreis während 20 Jahren:",null,null,{"$f":"(Energiepreisberechnung!C24)","v":0.11273760388338561},"€/kWh"]
[]
["Strompreis Anfangsjahr:",null,null,{"$f":"(D2)","v":0.2},"€/kWh"]
["Strompreis im 20´sten Jahr:",null,null,{"$f":"(Energiepreisberechnung!E22)","v":0.72330550700676266},"€/kWh"]
["Mittlerer Strompreis während 20 Jahren:",null,null,{"$f":"(Energiepreisberechnung!E24)","v":0.40995492321231131},"€/kWh"]
[]
["2."]
["Betrachtung für ein neues Gasbrennwertgerät",null,null,{"$f":"(Master!D5)","v":40},"kW"]
[]
["2a"]
["Investitionskosten",null,null,{"$f":"(Master!D8)","v":5000},"€"]
["Investitionskosten gesamt: ",null,null,{"$f":"(D26)","v":5000},"€",null,null,null,"R_I_GAS"]
[]
["2b"]
["Betriebskosten Gas-Brennwertgerät"]
["Jahresarbeit Gas-Brennwertgerät",null,null,{"$f":"(Master!D5*Master!D6)","v":80000},"kWh/a","(Leistung x Jahresvollbenutzungsstunden)"]
["Energieverbrauch Gas-Brennwertgerät",null,null,{"$f":"(D31/D3)","v":75471.698113207545},"kWh/a","(Wirkungsgrad berücksichtigt)",null,null,"R_B_GAS"]
["Kosten Gas",null,null,{"$f":"(D32*D16)","v":8508.4984062932526},"€/a"]
["Wartungskosten Gas-Brennwertgerät",null,null,300,"€/a",null,null,null,"R_B_WART_GAS"]
["Stromverbrauch 1 Stück Kesselkreispumpe",null,null,{"$f":"(Master!D6*D6)","v":200},"kWh/a",null,null,null,"R_B_STROM_GAS"]
["Stromkosten 1 Stück Kesselkreispumpe",null,null,{"$f":"(D35*D20)","v":81.990984642462266},"€/a","(Stromverbrauch x mittlerer Strompreis)"]
[]
["Betriebskosten pro Jahr gesamt:",null,null,{"$f":"SUM(D33:D34)+D36","v":8890.4893909357143},"€/a"]
[]
["3."]
["Betrachtung für drei GAWP 40 SW (120 kW) monovalent"]
[]
["3a"]
["Investitionskosten"]
["3 x GAWP + Zubehör",null,null,{"$f":"IF(Master!T9=TRUE,25000, (IF(Master!T10=TRUE,45000, (IF(Master!T11=TRUE,65000,\"\")))))","v":45000},"€"]
["Förderung BAFA",null,null,{"$f":"IF(Master!$T$9=TRUE,(2400+100*30), (IF(Master!$T$10=TRUE,(2400+100*70), (IF(Master!$T$11=TRUE,(2400+100*110),\"\")))))","v":9400},"€"]
["Investitionskosten gesamt: ",null,null,{"$f":"(D45-D46)","v":35600},"€",null,null,null,"N_I_GAWP_u_BW"]
[]
["3b"]
["Betriebskosten"]
["Leistung 3 x GAWP",null,null,{"$f":"(Master!D5)","v":40},"kW"]
["Jahresarbeit 3 x GAWP",null,null,{"$f":"(D31)","v":80000},"kWh/a","(ergibt sich aus Deckungsrate = 100%)"]
[]
["Vollbenutzungsstunden 3 x GAWP",null,null,{"$f":"(D52/D51)","v":2000},"h","(ergibt sich aus Jahresarbeit/Leistung)"]
[]
["Gasverbrauch 3 x GAWP",null,null,{"$f":"(D52/D4)","v":51612.903225806447},"kWh/a","(ergibt sich aus Jahresarbeit/Wirkungsgrad)",null,null,"N_B_GAS_GAWP"]
[]
["Kosten Gasverbrauch 3 x GAWP",null,null,{"$f":"(D56*D16)","v":5818.7150391424821},"€/a","(ergibt sich aus Gasverbrauch x mittlerer Gaspreis)"]
[]
["Wartungskosten 3 x GAWP",null,null,700,"€/a",null,null,null,"N_B_WART_GAWP"]
[]
["Stromverbrauch 3 x GAWP",null,null,{"$f":"(D54*D5)*3","v":2820},"kWh/a",null,null,null,"N_B_STROM_LÜ_GAWP"]
["Stromkosten 3 x GAWP",null,null,{"$f":"(D62*D20)","v":1156.0728834587178},"€/a","(Stromverbrauch x mittlerer Strompreis)"]
["Stromverbrauch 6 x Umwälzpumpe GAWP",null,null,{"$f":"((D54)*D7*6)","v":600},"kWh/a",null,null,null,"N_B_STROM_PU_GAWP"]
["Stromkosten 6 x Umwälzpumpe GAWP",null,null,{"$f":"(D64*D20)","v":245.97295392738678},"€/a","(Stromverbrauch x mittlerer Strompreis)"]
[]
["Betriebskosten pro Jahr gesamt:",null,null,{"$f":"SUM(D58:D60)+D65+D63","v":7920.7608765285868},"€/a"]
[]
["FAZIT:"]
["Mittlere Energieeinsparung pro Jahr bei Einsatz"]
["von drei monovalenten GAWP SW gegenüber"]
["den Betriebskosten eines Gas-Brennwertgerätes",null,null,{"$f":"(D38-D67)","v":969.72851440712748},"€/a"]
[]
["Differenz Investitionskosten:",null,null,{"$f":"(D47-D27)","v":30600},"€"]
[]
["Für einen auf 20 Jahre gemittelten Engergiepreis"]
["ergibt sich eine Amortisationszeit von: ",null,null,{"$f":"IF((D74/D72)<0,\"sofort\",(D74/D72))","v":31.555223493359094},{"$f":"IF((D74/D72)<0,\"\",\"Jahren\")","v":"Jahren"}]

{"sheet":"SW mono FLGAS","index":38,"n_rows":77,"n_cols":9,"rows_kept":77,"cut":false,"hidden":false,"merged":[]}
["Aktueller Flüssiggaspreis",null,null,{"$f":"(Energiepreisberechnung!D29)","v":7.0000000000000007E-2},"€/kWh"]
["Aktueller Strompreis",null,null,{"$f":"(Energiepreisberechnung!D31)","v":0.2},"€/kWh"]
["Gemittelter Wirkungsgrad Gasbrennwertgerät",null,null,1.06]
["Gemittelter Wirkungsgrad GAWP SW",null,null,1.55]
["Elektr. Leistung GAWP SW",null,null,0.47,"kW"]
["Elektr. Leistung Kesselkreispumpe",null,null,0.05,"kW"]
[]
["Gesucht:","Investitions- und Betriebskosten während 20 Jahren"]
[]
["1."]
["Errechnung der mittleren Energiepreise binnen 20 Jahren"]
[]
["Flüssiggaspreis Anfangsjahr:",null,null,{"$f":"(D1)","v":7.0000000000000007E-2},"€/kWh"]
["Flüssiggaspreis im 20´sten Jahr:",null,null,{"$f":"(Energiepreisberechnung!D22)","v":0.25315692745236701},"€/kWh"]
["Mittlerer Flüssiggaspreis während 20 Jahren:",null,null,{"$f":"(Energiepreisberechnung!D24)","v":0.14348422312430903},"€/kWh"]
[]
["Strompreis Anfangsjahr:",null,null,{"$f":"(D2)","v":0.2},"€/kWh"]
["Strompreis im 20´sten Jahr:",null,null,{"$f":"(Energiepreisberechnung!E22)","v":0.72330550700676266},"€/kWh"]
["Mittlerer Strompreis während 20 Jahren:",null,null,{"$f":"(Energiepreisberechnung!E24)","v":0.40995492321231131},"€/kWh"]
[]
["2."]
["Betrachtung für ein neues Gasbrennwertgerät",null,null,{"$f":"(Master!D5)","v":40},"kW"]
[]
["2a"]
["Investitionskosten",null,null,{"$f":"(Master!D8)","v":5000},"€"]
["Investitionskosten gesamt: ",null,null,{"$f":"(D25)","v":5000},"€",null,null,null,"R_I_GAS"]
[]
["2b"]
["Betriebskosten Gas-Brennwertgerät"]
["Jahresarbeit Gas-Brennwertgerät",null,null,{"$f":"(Master!D5*Master!D6)","v":80000},"kWh/a","(Leistung x Jahresvollbenutzungsstunden)"]
["Energieverbrauch Gas-Brennwertgerät",null,null,{"$f":"(D30/D3)","v":75471.698113207545},"kWh/a","(Wirkungsgrad berücksichtigt)",null,null,"R_B_FLGAS"]
["Kosten Flüssiggas",null,null,{"$f":"(D31*D15)","v":10828.997971645964},"€/a"]
["Wartungskosten Gas-Brennwertgerät",null,null,300,"€/a",null,null,null,"R_B_WART_GAS"]
["Stromverbrauch 1 Stück Kesselkreispumpe",null,null,{"$f":"(Master!D6*D6)","v":100},"kWh/a",null,null,null,"R_B_STROM_GAS"]
["Stromkosten 1 Stück Kesselkreispumpe",null,null,{"$f":"(D34*D19)","v":40.995492321231133},"€/a","(Stromverbrauch x mittlerer Strompreis)"]
[]
["Betriebskosten pro Jahr gesamt:",null,null,{"$f":"SUM(D32:D33)+D35","v":11169.993463967196},"€/a"]
[]
["3."]
["Betrachtung für eine GAWP 40 SW (40 kW) monovalent"]
[]
["3a"]
["Investitionskosten"]
["GAWP + Zubehör",null,null,{"$f":"IF(Master!T9=TRUE,25000, (IF(Master!T10=TRUE,45000, (IF(Master!T11=TRUE,65000,\"\")))))","v":45000},"€"]
["Förderung BAFA",null,null,{"$f":"IF(Master!$T$9=TRUE,(2400+100*30), (IF(Master!$T$10=TRUE,(2400+100*70), (IF(Master!$T$11=TRUE,(2400+100*110),\"\")))))","v":9400},"€"]
["Investitionskosten gesamt: ",null,null,{"$f":"(D44-D45)","v":35600},"€",null,null,null,"N_I_GAWP_u_BW"]
[]
["3b"]
["Betriebskosten"]
["Leistung GAWP",null,null,{"$f":"(Master!D5)","v":40},"kW"]
["Jahresarbeit GAWP",null,null,{"$f":"(D30)","v":80000},"kWh/a","(ergibt sich aus Deckungsrate = 100%)"]
[]
["Vollbenutzungsstunden GAWP",null,null,{"$f":"(D51/D50)","v":2000},"h","(ergibt sich aus Jahresarbeit/Leistung)"]
[]
["Flüssiggasverbrauch GAWP",null,null,{"$f":"(D51/D4)","v":51612.903225806447},"kWh/a","(ergibt sich aus Jahresarbeit/Wirkungsgrad)",null,null,"N_B_FLGAS_GAWP"]
[]
["Kosten Flüssiggasverbrauch GAWP",null,null,{"$f":"(D55*D15)","v":7405.6373225449815},"€/a","(ergibt sich aus Flüssiggasverbrauch x mittlerer Flüssiggaspreis)"]
[]
["Wartungskosten GAWP",null,null,300,"€/a",null,null,null,"N_B_WART_GAWP"]
[]
["Stromverbrauch GAWP",null,null,{"$f":"(D53*D5)","v":940},"kWh/a",null,null,null,"N_B_STROM_LÜ_GAWP"]
["Stromkosten GAWP",null,null,{"$f":"(D61*D19)","v":385.35762781957266},"€/a","(Stromverbrauch x mittlerer Strompreis)"]
["Stromverbrauch 2 x Umwälzpumpe GAWP",null,null,{"$f":"((D53)*D6*2)","v":200},"kWh/a",null,null,null,"N_B_STROM_PU_GAWP"]
["Stromkosten 2 x Umwälzpumpe GAWP",null,null,{"$f":"(D63*D19)","v":81.990984642462266},"€/a","(Stromverbrauch x mittlerer Strompreis)"]
[]
["Betriebskosten pro Jahr gesamt:",null,null,{"$f":"SUM(D57:D59)+D64+D62","v":8172.9859350070165},"€/a"]
[]
["FAZIT:"]
["Mittlere Energieeinsparung pro Jahr bei Einsatz"]
["von einer monovalenten GAWP SW gegenüber"]
["den Betriebskosten eines Gas-Brennwertgerätes"]
["(Flüssiggas)",null,null,{"$f":"(D37-D66)","v":2997.0075289601791},"€/a"]
[]
["Differenz Investitionskosten:",null,null,{"$f":"(D46-D26)","v":30600},"€"]
[]
["Für einen auf 20 Jahre gemittelten Engergiepreis"]
["ergibt sich eine Amortisationszeit von: ",null,null,{"$f":"IF((D74/D72)<0,\"sofort\",(D74/D72))","v":10.210184560536211},{"$f":"IF((D74/D72)<0,\"\",\"Jahren\")","v":"Jahren"}]

{"sheet":"SW2 mono FLGAS","index":39,"n_rows":78,"n_cols":9,"rows_kept":78,"cut":false,"hidden":false,"merged":[]}
["Aktueller Flüssiggaspreis",null,null,{"$f":"(Energiepreisberechnung!D29)","v":7.0000000000000007E-2},"€/kWh"]
["Aktueller Strompreis",null,null,{"$f":"(Energiepreisberechnung!D31)","v":0.2},"€/kWh"]
["Gemittelter Wirkungsgrad Gasbrennwertgerät",null,null,1.06]
["Gemittelter Wirkungsgrad GAWP SW",null,null,1.55]
["Elektr. Leistung GAWP SW",null,null,0.47,"kW"]
["Elektr. Leistung Kesselkreispumpe",null,null,0.06,"kW"]
["Elektr. Leistung Umwälzpumpe GAWP",null,null,0.05,"kW"]
[]
["Gesucht:","Investitions- und Betriebskosten während 20 Jahren"]
[]
["1."]
["Errechnung der mittleren Energiepreise binnen 20 Jahren"]
[]
["Flüssiggaspreis Anfangsjahr:",null,null,{"$f":"(D1)","v":7.0000000000000007E-2},"€/kWh"]
["Flüssiggaspreis im 20´sten Jahr:",null,null,{"$f":"(Energiepreisberechnung!D22)","v":0.25315692745236701},"€/kWh"]
["Mittlerer Flüssiggaspreis während 20 Jahren:",null,null,{"$f":"(Energiepreisberechnung!D24)","v":0.14348422312430903},"€/kWh"]
[]
["Strompreis Anfangsjahr:",null,null,{"$f":"(D2)","v":0.2},"€/kWh"]
["Strompreis im 20´sten Jahr:",null,null,{"$f":"(Energiepreisberechnung!E22)","v":0.72330550700676266},"€/kWh"]
["Mittlerer Strompreis während 20 Jahren:",null,null,{"$f":"(Energiepreisberechnung!E24)","v":0.40995492321231131},"€/kWh"]
[]
["2."]
["Betrachtung für ein neues Gasbrennwertgerät",null,null,{"$f":"(Master!D5)","v":40},"kW"]
[]
["2a"]
["Investitionskosten",null,null,{"$f":"(Master!D8)","v":5000},"€"]
["Investitionskosten gesamt: ",null,null,{"$f":"(D26)","v":5000},"€",null,null,null,"R_I_GAS"]
[]
["2b"]
["Betriebskosten Gas-Brennwertgerät"]
["Jahresarbeit Gas-Brennwertgerät",null,null,{"$f":"(Master!D5*Master!D6)","v":80000},"kWh/a","(Leistung x Jahresvollbenutzungsstunden)"]
["Energieverbrauch Gas-Brennwertgerät",null,null,{"$f":"(D31/D3)","v":75471.698113207545},"kWh/a","(Wirkungsgrad berücksichtigt)",null,null,"R_B_FLGAS"]
["Kosten Flüssiggas",null,null,{"$f":"(D32*D16)","v":10828.997971645964},"€/a"]
["Wartungskosten Gas-Brennwertgerät",null,null,300,"€/a",null,null,null,"R_B_WART_GAS"]
["Stromverbrauch 1 Stück Kesselkreispumpe",null,null,{"$f":"(Master!D6*D6)","v":120},"kWh/a",null,null,null,"R_B_STROM_GAS"]
["Stromkosten 1 Stück Kesselkreispumpe",null,null,{"$f":"(D35*D20)","v":49.194590785477359},"€/a","(Stromverbrauch x mittlerer Strompreis)"]
[]
["Betriebskosten pro Jahr gesamt:",null,null,{"$f":"SUM(D33:D34)+D36","v":11178.192562431441},"€/a"]
[]
["3."]
["Betrachtung für zwei GAWP 40 SW (80 kW) monovalent"]
[]
["3a"]
["Investitionskosten"]
["2 x GAWP + Zubehör",null,null,{"$f":"IF(Master!T9=TRUE,25000, (IF(Master!T10=TRUE,45000, (IF(Master!T11=TRUE,65000,\"\")))))","v":45000},"€"]
["Förderung BAFA",null,null,{"$f":"IF(Master!$T$9=TRUE,(2400+100*30), (IF(Master!$T$10=TRUE,(2400+100*70), (IF(Master!$T$11=TRUE,(2400+100*110),\"\")))))","v":9400},"€"]
["Investitionskosten gesamt: ",null,null,{"$f":"(D45-D46)","v":35600},"€",null,null,null,"N_I_GAWP_u_BW"]
[]
["3b"]
["Betriebskosten"]
["Leistung 2 x GAWP",null,null,{"$f":"(Master!D5)","v":40},"kW"]
["Jahresarbeit 2 x GAWP",null,null,{"$f":"(D31)","v":80000},"kWh/a","(ergibt sich aus Deckungsrate = 100%)"]
[]
["Vollbenutzungsstunden 2 x GAWP",null,null,{"$f":"(D52/D51)","v":2000},"h","(ergibt sich aus Jahresarbeit/Leistung)"]
[]
["Flüssiggasverbrauch 2 x GAWP",null,null,{"$f":"(D52/D4)","v":51612.903225806447},"kWh/a","(ergibt sich aus Jahresarbeit/Wirkungsgrad)",null,null,"N_B_FLGAS_GAWP"]
[]
["Kosten Flüssiggasverbrauch 2 x GAWP",null,null,{"$f":"(D56*D16)","v":7405.6373225449815},"€/a","(ergibt sich aus Flüssiggasverbrauch x mittlerer Flüssiggaspreis)"]
[]
["Wartungskosten 2 x GAWP",null,null,500,"€/a",null,null,null,"N_B_WART_GAWP"]
[]
["Stromverbrauch 2 x GAWP",null,null,{"$f":"(D54*D5)*2","v":1880},"kWh/a",null,null,null,"N_B_STROM_LÜ_GAWP"]
["Stromkosten 2 x GAWP",null,null,{"$f":"(D62*D20)","v":770.71525563914531},"€/a","(Stromverbrauch x mittlerer Strompreis)"]
["Stromverbrauch 4 x Umwälzpumpe GAWP",null,null,{"$f":"((D54)*D7*4)","v":400},"kWh/a",null,null,null,"N_B_STROM_PU_GAWP"]
["Stromkosten 4 x Umwälzpumpe GAWP",null,null,{"$f":"(D64*D20)","v":163.98196928492453},"€/a","(Stromverbrauch x mittlerer Strompreis)"]
[]
["Betriebskosten pro Jahr gesamt:",null,null,{"$f":"SUM(D58:D60)+D65+D63","v":8840.3345474690504},"€/a"]
[]
["FAZIT:"]
["Mittlere Energieeinsparung pro Jahr bei Einsatz"]
["von zwei monovalenten GAWP SW gegenüber"]
["den Betriebskosten eines Gas-Brennwertgerätes"]
["(Flüssiggas)",null,null,{"$f":"(D38-D67)","v":2337.8580149623904},"€/a"]
[]
["Differenz Investitionskosten:",null,null,{"$f":"(D47-D27)","v":30600},"€"]
[]
["Für einen auf 20 Jahre gemittelten Engergiepreis"]
["ergibt sich eine Amortisationszeit von: ",null,null,{"$f":"IF((D75/D73)<0,\"sofort\",(D75/D73))","v":13.088904374927264},{"$f":"IF((D75/D73)<0,\"\",\"Jahren\")","v":"Jahren"}]

{"sheet":"SW3 mono FLGAS","index":40,"n_rows":78,"n_cols":9,"rows_kept":78,"cut":false,"hidden":false,"merged":[]}
["Aktueller Flüssiggaspreis",null,null,{"$f":"(Energiepreisberechnung!D29)","v":7.0000000000000007E-2},"€/kWh"]
["Aktueller Strompreis",null,null,{"$f":"(Energiepreisberechnung!D31)","v":0.2},"€/kWh"]
["Gemittelter Wirkungsgrad Gasbrennwertgerät",null,null,1.06]
["Gemittelter Wirkungsgrad GAWP SW",null,null,1.55]
["Elektr. Leistung GAWP SW",null,null,0.47,"kW"]
["Elektr. Leistung Kesselkreispumpe",null,null,0.1,"kW"]
["Elektr. Leistung Umwälzpumpe GAWP",null,null,0.05,"kW"]
[]
["Gesucht:","Investitions- und Betriebskosten während 20 Jahren"]
[]
["1."]
["Errechnung der mittleren Energiepreise binnen 20 Jahren"]
[]
["Flüssiggaspreis Anfangsjahr:",null,null,{"$f":"(D1)","v":7.0000000000000007E-2},"€/kWh"]
["Flüssiggaspreis im 20´sten Jahr:",null,null,{"$f":"(Energiepreisberechnung!D22)","v":0.25315692745236701},"€/kWh"]
["Mittlerer Flüssiggaspreis während 20 Jahren:",null,null,{"$f":"(Energiepreisberechnung!D24)","v":0.14348422312430903},"€/kWh"]
[]
["Strompreis Anfangsjahr:",null,null,{"$f":"(D2)","v":0.2},"€/kWh"]
["Strompreis im 20´sten Jahr:",null,null,{"$f":"(Energiepreisberechnung!E22)","v":0.72330550700676266},"€/kWh"]
["Mittlerer Strompreis während 20 Jahren:",null,null,{"$f":"(Energiepreisberechnung!E24)","v":0.40995492321231131},"€/kWh"]
[]
["2."]
["Betrachtung für ein neues Gasbrennwertgerät",null,null,{"$f":"(Master!D5)","v":40},"kW"]
[]
["2a"]
["Investitionskosten",null,null,{"$f":"(Master!D8)","v":5000},"€"]
["Investitionskosten gesamt: ",null,null,{"$f":"(D26)","v":5000},"€",null,null,null,"R_I_GAS"]
[]
["2b"]
["Betriebskosten Gas-Brennwertgerät"]
["Jahresarbeit Gas-Brennwertgerät",null,null,{"$f":"(Master!D5*Master!D6)","v":80000},"kWh/a","(Leistung x Jahresvollbenutzungsstunden)"]
["Energieverbrauch Gas-Brennwertgerät",null,null,{"$f":"(D31/D3)","v":75471.698113207545},"kWh/a","(Wirkungsgrad berücksichtigt)",null,null,"R_B_FLGAS"]
["Kosten Flüssiggas",null,null,{"$f":"(D32*D16)","v":10828.997971645964},"€/a"]
["Wartungskosten Gas-Brennwertgerät",null,null,300,"€/a",null,null,null,"R_B_WART_GAS"]
["Stromverbrauch 1 Stück Kesselkreispumpe",null,null,{"$f":"(Master!D6*D6)","v":200},"kWh/a",null,null,null,"R_B_STROM_GAS"]
["Stromkosten 1 Stück Kesselkreispumpe",null,null,{"$f":"(D35*D20)","v":81.990984642462266},"€/a","(Stromverbrauch x mittlerer Strompreis)"]
[]
["Betriebskosten pro Jahr gesamt:",null,null,{"$f":"SUM(D33:D34)+D36","v":11210.988956288425},"€/a"]
[]
["3."]
["Betrachtung für drei GAWP 40 SW (120 kW) monovalent"]
[]
["3a"]
["Investitionskosten"]
["3 x GAWP + Zubehör",null,null,{"$f":"IF(Master!T9=TRUE,25000, (IF(Master!T10=TRUE,45000, (IF(Master!T11=TRUE,65000,\"\")))))","v":45000},"€"]
["Förderung BAFA",null,null,{"$f":"IF(Master!$T$9=TRUE,(2400+100*30), (IF(Master!$T$10=TRUE,(2400+100*70), (IF(Master!$T$11=TRUE,(2400+100*110),\"\")))))","v":9400},"€"]
["Investitionskosten gesamt: ",null,null,{"$f":"(D45-D46)","v":35600},"€",null,null,null,"N_I_GAWP_u_BW"]
[]
["3b"]
["Betriebskosten"]
["Leistung 3 x GAWP",null,null,{"$f":"(Master!D5)","v":40},"kW"]
["Jahresarbeit 3 x GAWP",null,null,{"$f":"(D31)","v":80000},"kWh/a","(ergibt sich aus Deckungsrate = 100%)"]
[]
["Vollbenutzungsstunden 3 x GAWP",null,null,{"$f":"(D52/D51)","v":2000},"h","(ergibt sich aus Jahresarbeit/Leistung)"]
[]
["Flüssiggasverbrauch 3 x GAWP",null,null,{"$f":"(D52/D4)","v":51612.903225806447},"kWh/a","(ergibt sich aus Jahresarbeit/Wirkungsgrad)",null,null,"N_B_FLGAS_GAWP"]
[]
["Kosten Flüssiggasverbrauch 3 x GAWP",null,null,{"$f":"(D56*D16)","v":7405.6373225449815},"€/a","(ergibt sich aus Flüssiggasverbrauch x mittlerer Flüssiggaspreis)"]
[]
["Wartungskosten 3 x GAWP",null,null,700,"€/a",null,null,null,"N_B_WART_GAWP"]
[]
["Stromverbrauch 3 x GAWP",null,null,{"$f":"(D54*D5)*3","v":2820},"kWh/a",null,null,null,"N_B_STROM_LÜ_GAWP"]
["Stromkosten 3 x GAWP",null,null,{"$f":"(D62*D20)","v":1156.0728834587178},"€/a","(Stromverbrauch x mittlerer Strompreis)"]
["Stromverbrauch 6 x Umwälzpumpe GAWP",null,null,{"$f":"((D54)*D7*6)","v":600},"kWh/a",null,null,null,"N_B_STROM_PU_GAWP"]
["Stromkosten 6 x Umwälzpumpe GAWP",null,null,{"$f":"(D64*D20)","v":245.97295392738678},"€/a","(Stromverbrauch x mittlerer Strompreis)"]
[]
["Betriebskosten pro Jahr gesamt:",null,null,{"$f":"SUM(D58:D60)+D65+D63","v":9507.6831599310863},"€/a"]
[]
["FAZIT:"]
["Mittlere Energieeinsparung pro Jahr bei Einsatz"]
["von drei monovalenten GAWP SW gegenüber"]
["den Betriebskosten eines Gas-Brennwertgerätes"]
["(Flüssiggas)",null,null,{"$f":"(D38-D67)","v":1703.3057963573392},"€/a"]
[]
["Differenz Investitionskosten:",null,null,{"$f":"(D47-D27)","v":30600},"€"]
[]
["Für einen auf 20 Jahre gemittelten Engergiepreis"]
["ergibt sich eine Amortisationszeit von: ",null,null,{"$f":"IF((D75/D73)<0,\"sofort\",(D75/D73))","v":17.965065383703056},{"$f":"IF((D75/D73)<0,\"\",\"Jahren\")","v":"Jahren"}]